{
  "af": "Afrikaans",
  "sq-AL": "Shqip",
  "ar": "عربي",
  "hy-AM": "Հայերեն",
  "az-Latn-AZ": "azərbaycanca",
  "be-BY": "Беларуская",
  "bn-BD": "বাংলা (বাংলাদেশ)",
  "bn": "বাংলা (ভারত)",
  "bs-BA": "Bosanski",
  "bg-BG": "български",
  "zh-CN": "中文 (简体)",
  "zh-HK": "中文 (香港)",
  "zh-TW": "中文 (台灣)",
  "hr-HR": "Hrvatski",
  "cs-CZ": "Čeština",
  "da-DK": "Dansk",
  "nl": "Nederlands",
  "en-GB": "English (GB)",
  "en-US": "English (US)",
  "et-EE": "Eesti keel",
  "fi-FI": "suomi",
  "fr-CA": "Français (CA)",
  "fr": "Français",
  "ka-GE": "ქართული",
  "de": "Deutsch",
  "el-GR": "Ελληνικά",
  "he-IL": "עברית",
  "hi": "हिन्दी (भारत)",
  "hu": "Magyar",
  "is-IS": "íslenska",
  "id": "Bahasa Indonesia",
  "it": "Italiano",
  "kk-KZ": "қазақ тілі",
  "km-KH": "ខ្មែរ",
  "ko-KR": "한국어",
  "lo-LA": "ລາວ",
  "lv-LV": "Latviešu valoda",
  "it-LT": "Lietuvių",
  "mk-MK": "Македонски",
  "ms": "Melayu",
  "mo-RO": "Moldavian",
  "ne": "नेपाली",
  "nb-NO": "Norsk bokmål",
  "fa-IR": "فارسی (IR)",
  "pl": "Polski",
  "pt-BR": "Português (do Brasil)",
  "pt-PT": "Português (Portugal)",
  "ps-AF": "Pushto",
  "ro": "Română",
  "ru": "Русский",
  "sr-Latn-CS": "Srpski",
  "si-LK": "සිංහල",
  "sk-SK": "Slovenčina",
  "sl-SI": "Slovenščina",
  "es": "Español",
  "es-US": "Español (Latam)",
  "sw": "Kiswahili",
  "sv-SE": "Svenska",
  "fil-PH": "Tagalog",
  "ta": "தமிழ்",
  "th": "ไทย",
  "tr": "Türkçe",
  "uk-UA": "Українська",
  "ur": "اُردو",
  "uz-Cyrl-UZ": "Uzbek (Cyrillic)",
  "vi": "Tiếng Việt",
  "xh-ZA": "isiXhosa",
  "zu": "isiZulu"
}