<svg width="620" height="240" viewBox="0 0 620 240" fill="none" xmlns="http://www.w3.org/2000/svg">
<rect width="620" height="240" rx="120" fill="white"/>
<path d="M509.28 171.01C532.256 171.01 551 152.417 551 129.29C551 106.313 532.256 87.5693 509.28 87.5693C486.303 87.5693 467.559 106.313 467.559 129.29C467.559 152.417 486.303 171.01 509.28 171.01ZM509.28 152.871C496.28 152.871 485.698 142.441 485.698 129.29C485.698 116.29 496.28 105.709 509.28 105.709C522.279 105.709 532.861 116.29 532.861 129.29C532.861 142.441 522.279 152.871 509.28 152.871Z" fill="black"/>
<path d="M461.782 169.348V150.755C453.468 150.755 449.236 144.104 449.236 134.883V59H431.096V135.185C431.096 154.987 443.038 169.348 461.782 169.348Z" fill="black"/>
<path d="M378.764 172.975C401.74 172.975 420.484 154.231 420.484 131.255C420.484 108.278 401.74 89.5344 378.764 89.5344C355.636 89.5344 337.043 108.278 337.043 131.255V197.766H355.183V160.731C360.02 167.987 368.938 172.975 378.764 172.975ZM378.764 107.674C391.764 107.674 402.345 118.255 402.345 131.255C402.345 144.255 391.764 154.836 378.764 154.836C365.613 154.836 355.183 144.255 355.183 131.255C355.183 118.255 365.613 107.674 378.764 107.674Z" fill="black"/>
<path d="M284.587 171.01C307.563 171.01 326.307 152.418 326.307 129.29C326.307 106.313 307.563 87.5695 284.587 87.5695C261.61 87.5695 242.866 106.313 242.866 129.29C242.866 152.418 261.61 171.01 284.587 171.01ZM284.587 152.871C271.587 152.871 261.006 142.441 261.006 129.29C261.006 116.29 271.587 105.709 284.587 105.709C297.587 105.709 308.168 116.29 308.168 129.29C308.168 142.441 297.587 152.871 284.587 152.871Z" fill="black"/>
<path d="M235.86 169.952V151.813C224.976 151.813 212.43 150.301 212.43 133.22V107.22H231.93V89.0811H212.43V72.4534H194.29V89.0811H186.884V107.22H194.29V137.302C194.29 165.72 219.383 169.952 235.86 169.952Z" fill="black"/>
<path fill-rule="evenodd" clip-rule="evenodd" d="M82.2062 154.325C82.6972 154.857 83.2009 155.381 83.7173 155.898C104.674 176.854 138.651 176.854 159.607 155.898C180.564 134.941 180.564 100.964 159.607 80.0079C159.091 79.4915 158.566 78.9878 158.035 78.4969L82.2062 154.325ZM153.347 74.6338L78.3431 149.637C77.0378 147.857 75.856 146.015 74.7977 144.122L147.831 71.0884C149.724 72.1466 151.567 73.3284 153.347 74.6338ZM142.064 68.305C139.843 67.3935 137.573 66.6372 135.272 66.0362L69.7455 131.562C70.3466 133.864 71.1029 136.134 72.0144 138.354L142.064 68.305ZM68.3832 124.374L128.083 64.6739C125.187 64.3268 122.268 64.2155 119.357 64.3399L68.0492 115.647C67.9248 118.558 68.0362 121.477 68.3832 124.374ZM69.3992 105.746L109.456 65.6899C100.023 67.8835 91.0691 72.6562 83.7173 80.0079C76.3655 87.3597 71.5928 96.314 69.3992 105.746Z" fill="black"/>
<circle cx="138.29" cy="134.581" r="14.3603" fill="#FF1E6F"/>
</svg>
