<?xml version="1.0" encoding="utf-8"?>
<!-- Generator: Adobe Illustrator 24.2.3, SVG Export Plug-In . SVG Version: 6.00 Build 0)  -->
<svg version="1.1" id="Layer_1" xmlns="http://www.w3.org/2000/svg" xmlns:xlink="http://www.w3.org/1999/xlink" x="0px" y="0px"
	 viewBox="0 0 670 138.4" style="enable-background:new 0 0 670 138.4;" xml:space="preserve">
<style type="text/css">
	.st0{fill:#FFFFFF;}
	.st1{fill:url(#SVGID_1_);}
	.st2{fill:url(#SVGID_2_);}
	.st3{fill:url(#SVGID_3_);}
	.st4{fill:url(#SVGID_4_);}
	.st5{fill:url(#SVGID_5_);}
	.st6{fill:url(#SVGID_6_);}
	.st7{fill:url(#SVGID_7_);}
	.st8{fill:url(#SVGID_8_);}
	.st9{fill:url(#SVGID_9_);}
	.st10{fill:url(#SVGID_10_);}
	.st11{fill:url(#SVGID_11_);}
	.st12{fill:url(#SVGID_12_);}
	.st13{fill:url(#SVGID_13_);}
	.st14{fill:url(#SVGID_14_);}
	.st15{fill:#444444;}
	.st16{fill:#737373;}
</style>
<circle class="st0" cx="69.1" cy="69.1" r="69.1"/>
<linearGradient id="SVGID_1_" gradientUnits="userSpaceOnUse" x1="76.2119" y1="-1083.2589" x2="145.3419" y2="-1202.9889" gradientTransform="matrix(1 0 0 -1 -62 -1062.01)">
	<stop  offset="0" style="stop-color:#16FDC4"/>
	<stop  offset="1" style="stop-color:#02A5F9"/>
</linearGradient>
<path class="st1" d="M25.6,56.4c2.7-1.6,5.7-2.8,8.7-3.5c0-2.8,1.5-5.3,3.9-6.7c-0.8-3-1.2-6.1-1.3-9.2c-0.1-5.2,1.2-10.4,3.7-15
	c-10.5,0.6-20.1,6.4-25.3,15.6c-5.5,9-5.7,20.3-0.6,29.6C17.5,62.8,21.2,59.1,25.6,56.4z"/>
<linearGradient id="SVGID_2_" gradientUnits="userSpaceOnUse" x1="69.0725" y1="-1087.3785" x2="138.2025" y2="-1207.1185" gradientTransform="matrix(1 0 0 -1 -62 -1062.01)">
	<stop  offset="0" style="stop-color:#16FDC4"/>
	<stop  offset="1" style="stop-color:#02A5F9"/>
</linearGradient>
<path class="st2" d="M40.5,54.2c-4.9,0.3-9.6,1.7-13.8,4.2c-4.5,2.6-8.3,6.3-11.1,10.8c2.8,4.4,6.6,8.1,11.1,10.8
	c4.2,2.4,9,3.8,13.8,4.1c-2.4-4.6-3.7-9.8-3.6-15C37,63.9,38.2,58.8,40.5,54.2z"/>
<linearGradient id="SVGID_3_" gradientUnits="userSpaceOnUse" x1="118.4762" y1="-1058.8622" x2="187.6062" y2="-1178.5922" gradientTransform="matrix(1 0 0 -1 -62 -1062.01)">
	<stop  offset="0" style="stop-color:#16FDC4"/>
	<stop  offset="1" style="stop-color:#02A5F9"/>
</linearGradient>
<path class="st3" d="M66,30.3c1.2-0.8,2.6-1.2,4.1-1.2c1.4,0,2.7,0.3,3.9,0.9c2.1-2.2,4.5-4.2,7.1-5.8c4.6-2.5,9.6-4,14.9-4.3
	C90.2,11,80.4,5.6,69.8,5.5C59,5.5,49.4,11.4,43.6,20c5.2,0.3,10.3,1.8,14.9,4.4C61.3,25.9,63.8,27.9,66,30.3z"/>
<linearGradient id="SVGID_4_" gradientUnits="userSpaceOnUse" x1="97.3162" y1="-1071.0721" x2="166.4462" y2="-1190.8123" gradientTransform="matrix(1 0 0 -1 -62 -1062.01)">
	<stop  offset="0" style="stop-color:#16FDC4"/>
	<stop  offset="1" style="stop-color:#02A5F9"/>
</linearGradient>
<path class="st4" d="M42.2,51.3c5.8-8.9,15.6-14.5,26.2-15c-2.7-4.1-6.4-7.5-10.6-9.9c-4.6-2.6-9.7-4-15-4.2
	c-2.6,4.6-4,9.8-3.8,15.1C38.8,42.2,39.9,47,42.2,51.3z"/>
<linearGradient id="SVGID_5_" gradientUnits="userSpaceOnUse" x1="125.6984" y1="-1054.6908" x2="194.8284" y2="-1174.4209" gradientTransform="matrix(1 0 0 -1 -62 -1062.01)">
	<stop  offset="0" style="stop-color:#16FDC4"/>
	<stop  offset="1" style="stop-color:#02A5F9"/>
</linearGradient>
<path class="st5" d="M124.7,69.2c-2.8-4.4-6.6-8.1-11.1-10.8c-4.2-2.4-9-3.8-13.8-4.1c2.4,4.6,3.7,9.8,3.6,15
	c0.1,5.2-1.2,10.4-3.6,15c4.9-0.2,9.7-1.6,13.8-4.2C118.1,77.4,121.9,73.6,124.7,69.2z"/>
<linearGradient id="SVGID_6_" gradientUnits="userSpaceOnUse" x1="125.9597" y1="-1054.5402" x2="195.0797" y2="-1174.2701" gradientTransform="matrix(1 0 0 -1 -62 -1062.01)">
	<stop  offset="0" style="stop-color:#16FDC4"/>
	<stop  offset="1" style="stop-color:#02A5F9"/>
</linearGradient>
<path class="st6" d="M72.1,36.1c10.6,0.6,20.3,6.1,26.2,15c2.2-4.4,3.4-9.2,3.4-14.1c0-5.3-1.3-10.5-3.8-15.1
	c-5.3,0.1-10.4,1.6-15,4.2C78.6,28.5,74.9,32,72.1,36.1z"/>
<linearGradient id="SVGID_7_" gradientUnits="userSpaceOnUse" x1="141.936" y1="-1045.3208" x2="211.056" y2="-1165.0509" gradientTransform="matrix(1 0 0 -1 -62 -1062.01)">
	<stop  offset="0" style="stop-color:#16FDC4"/>
	<stop  offset="1" style="stop-color:#02A5F9"/>
</linearGradient>
<path class="st7" d="M99.9,21.9c2.4,4.6,3.7,9.8,3.6,15c0.1,3.1-0.4,6.1-1.3,9c2.6,1.4,4.2,4.1,4.2,7c2.9,0.7,5.7,1.9,8.3,3.5
	c4.4,2.7,8.2,6.4,11.1,10.8c0.9-2,1.6-3.9,2.3-6.1c0.6-2.7,0.9-5.4,0.9-8.2c0-5.5-1.5-10.9-4.2-15.6
	C119.6,28.3,110.3,22.6,99.9,21.9z"/>
<linearGradient id="SVGID_8_" gradientUnits="userSpaceOnUse" x1="118.7349" y1="-1058.7072" x2="187.8649" y2="-1178.4371" gradientTransform="matrix(1 0 0 -1 -62 -1062.01)">
	<stop  offset="0" style="stop-color:#16FDC4"/>
	<stop  offset="1" style="stop-color:#02A5F9"/>
</linearGradient>
<path class="st8" d="M128.1,77.2c-0.5-2.1-1.3-4.2-2.3-6.1c-4.4,7-11.4,12.1-19.4,14.3c0.1,3-1.6,5.7-4.2,7c0.8,2.9,1.3,6,1.3,9
	c0.1,5.2-1.2,10.4-3.6,15c10.5-0.6,20.1-6.4,25.4-15.6c2.8-4.7,4.2-10.1,3.9-15.6C128.9,82.5,128.6,79.8,128.1,77.2z"/>
<linearGradient id="SVGID_9_" gradientUnits="userSpaceOnUse" x1="96.6616" y1="-1071.5381" x2="165.7375" y2="-1191.1709" gradientTransform="matrix(1 0 0 -1 -62 -1062.01)">
	<stop  offset="0" style="stop-color:#16FDC4"/>
	<stop  offset="1" style="stop-color:#02A5F9"/>
</linearGradient>
<path class="st9" d="M69.2,0.3C31.1,0.3,0.1,31.2,0.1,69.3s30.9,69.1,69.1,69.1c38.1,0,69.1-30.9,69.1-69.1c0,0,0,0,0-0.1
	C138.3,31.2,107.4,0.3,69.2,0.3C69.2,0.3,69.2,0.3,69.2,0.3z M126.9,102.6c-4.6,7.7-12,13.3-20.7,15.6c0,4.4-3.6,8-8,8
	c-1.4,0-2.9-0.4-4.1-1.2c-6.2,6.5-14.9,10.2-23.9,10.2c-9-0.1-17.6-3.7-23.9-10.2c-1.2,0.6-2.6,0.9-3.9,0.9c-4.4,0-8-3.6-8-8
	c-8.9-2.2-16.4-7.8-21-15.7C10.5,97.1,9,91.3,9,85.5c0-2.8,0.4-5.6,1.2-8.3c-3.5-1-5.8-4.1-5.8-7.7c0-3.6,2.4-6.7,5.8-7.7
	C9.4,59.1,9,56.3,9,53.5C8.9,38.1,19.4,24.7,34.3,21.1c0-4.4,3.6-8,8-8c1.4,0,2.7,0.3,3.9,0.9C58.9,0.8,79.9,0.4,93.1,13
	c0.3,0.3,0.7,0.6,1,1c3.8-2.3,8.7-1,11,2.8c0.7,1.2,1.1,2.6,1.1,4.1c8.8,2.1,16.2,7.8,20.7,15.6c4.6,7.8,5.8,17.1,3.4,25.8
	c2.4,1.5,3.9,4.1,3.9,7c0,2.9-1.5,5.6-3.9,7.1C132.6,85.2,131.4,94.6,126.9,102.6L126.9,102.6z"/>
<linearGradient id="SVGID_10_" gradientUnits="userSpaceOnUse" x1="97.1932" y1="-1071.1482" x2="166.3132" y2="-1190.8782" gradientTransform="matrix(1 0 0 -1 -62 -1062.01)">
	<stop  offset="0" style="stop-color:#16FDC4"/>
	<stop  offset="1" style="stop-color:#02A5F9"/>
</linearGradient>
<path class="st10" d="M97.9,87.6c-5.8,8.9-15.6,14.5-26.2,15c5.7,8.7,15.3,14,25.6,14.3c2.6-4.6,3.9-9.9,3.8-15.1
	C101.3,96.8,100.1,91.9,97.9,87.6z"/>
<linearGradient id="SVGID_11_" gradientUnits="userSpaceOnUse" x1="76.3116" y1="-1083.198" x2="145.4416" y2="-1202.938" gradientTransform="matrix(1 0 0 -1 -62 -1062.01)">
	<stop  offset="0" style="stop-color:#16FDC4"/>
	<stop  offset="1" style="stop-color:#02A5F9"/>
</linearGradient>
<path class="st11" d="M75.2,109.7c-1.4,1.1-3.1,1.6-4.8,1.6c-1.9,0.1-3.7-0.6-5-2c-1.9,1.9-4,3.5-6.4,4.7c-4.6,2.6-9.6,4-14.9,4.4
	c9.4,14.5,28.8,18.7,43.4,9.2c3.7-2.4,6.8-5.5,9.2-9.2c-5.2-0.3-10.3-1.8-14.9-4.4C79.3,113,77.1,111.6,75.2,109.7z"/>
<linearGradient id="SVGID_12_" gradientUnits="userSpaceOnUse" x1="52.8554" y1="-1096.7484" x2="121.9854" y2="-1216.4784" gradientTransform="matrix(1 0 0 -1 -62 -1062.01)">
	<stop  offset="0" style="stop-color:#16FDC4"/>
	<stop  offset="1" style="stop-color:#02A5F9"/>
</linearGradient>
<path class="st12" d="M38,92.1c-2.4-1.4-3.9-3.9-3.9-6.7c-3.1-0.8-6-1.9-8.7-3.5c-4.5-2.6-8.2-6.3-11.1-10.6
	c-2.2,4.4-3.4,9.3-3.3,14.3c0,5.5,1.4,10.9,4.2,15.6c5.7,9.5,15,14.9,25.2,15.1c-2.4-4.6-3.7-9.8-3.6-15
	C36.7,98.1,37.2,95.1,38,92.1z"/>
<linearGradient id="SVGID_13_" gradientUnits="userSpaceOnUse" x1="68.7712" y1="-1087.5593" x2="137.8912" y2="-1207.2893" gradientTransform="matrix(1 0 0 -1 -62 -1062.01)">
	<stop  offset="0" style="stop-color:#16FDC4"/>
	<stop  offset="1" style="stop-color:#02A5F9"/>
</linearGradient>
<path class="st13" d="M68.3,102.7c-11.1-0.4-20.4-6.5-26.2-15c-2.2,4.4-3.4,9.2-3.3,14.1c0,5.3,1.3,10.5,3.8,15.2
	c5.3-0.1,10.4-1.5,15-4.2C61.9,110.3,65.5,106.8,68.3,102.7z"/>
<path class="st0" d="M80.3,58.6c-1.6-3.8-5.7-4.5-10.2-3.8l-1.6-6l-3.6,0.9l1.5,6c-0.9,0.1-2,0.4-2.8,0.6l-1.5-6l-3.6,0.9l1.5,6
	c-0.7,0.1-7.1,1.9-7.1,1.9l0.9,3.8l2.6-0.6c1.5-0.3,2.2,0.3,2.5,0.9l4.1,16c0,0.4,0,1.3-0.9,1.5l-2.6,0.6l0.3,4.4
	c0,0,6.4-1.6,7.1-1.9l1.5,6l3.6-0.9l-1.3-5.8c0.9-0.1,2-0.4,2.8-0.6l1.5,6l3.6-0.9l-1.5-6c5.7-1.3,9.3-4.7,8.4-10.2
	c-0.4-3.1-3.9-5.8-6.9-6.1C80.4,64,81.3,61.6,80.3,58.6z M78.7,72.6c0.6,5.2-6.6,6-9,6.5l-2.2-7.9C69.9,70.5,77.2,68,78.7,72.6
	L78.7,72.6z M74.1,61.9c0.7,4.5-5.5,5.2-7.4,5.8l-2-7C66.9,60,72.6,57.7,74.1,61.9L74.1,61.9z"/>
<linearGradient id="SVGID_14_" gradientUnits="userSpaceOnUse" x1="416.8099" y1="757.0728" x2="478.8718" y2="757.0728" gradientTransform="matrix(0.5767 0.8169 0.8169 -0.5767 -806.6044 140.2412)">
	<stop  offset="0" style="stop-color:#16FDC4"/>
	<stop  offset="1" style="stop-color:#02A5F9"/>
</linearGradient>
<circle class="st14" cx="70.1" cy="69.4" r="31"/>
<path class="st0" d="M80,59c-1.6-3.6-4.9-4.2-9.5-3.6l-1.5-5.5l-3.3,0.7l1.3,5.6c-0.7,0.1-1.9,0.4-2.6,0.6l-1.3-5.5l-3.3,0.7
	l1.5,5.5c-0.6,0.1-6.7,1.9-6.7,1.9l0.9,3.6l2.5-0.6c0.9-0.3,1.9,0.1,2.3,0.9l3.9,15c0.1,0.6-0.3,1.3-0.9,1.5l-2.5,0.6l0.3,4.1
	c0,0,6-1.5,6.7-1.6l1.5,5.7l3.4-0.7L71.1,82c0.9-0.1,1.9-0.4,2.6-0.6l1.4,5.7l3.4-0.7l-1.4-5.7c5-1.3,8.7-4.4,8-9.5
	c-0.4-2.9-3.8-5.5-6.4-5.8C80.1,64,80.9,61.9,80,59z M78.4,72.1c0.6,4.8-6.1,5.7-8.3,6.1l-2-7.1C70.1,70.2,77.1,67.9,78.4,72.1
	L78.4,72.1z M74.2,62.1c0.6,4.4-5,4.8-7,5.5l-1.9-6.7C67.3,60.2,72.7,58.1,74.2,62.1L74.2,62.1z"/>
<path class="st15" d="M175.8,17.9h35v4.4h-30.3v20.4h29.7V47h-29.7v21.9h30.3v4.4h-35L175.8,17.9z"/>
<path class="st15" d="M222.5,17.9h4.4v55.2h-4.4V17.9z"/>
<path class="st15" d="M257.1,32.1c12.2,0,18.9,9.6,18.9,21.1v1.2h-33.5c0.4,8.7,6.3,15.9,15.6,15.9c5,0.1,9.7-1.9,13.1-5.5l2.2,2.8
	c-4.1,4.3-9.7,6.6-15.6,6.4c-11.6,0-20.1-8.7-20.1-21C237.8,41.5,246.1,32.1,257.1,32.1z M242.6,51.1h29
	c-0.1-6.8-4.5-15.3-14.6-15.3C247.5,35.8,242.9,44.1,242.6,51.1z"/>
<path class="st15" d="M304.2,32.1c5.6-0.2,10.9,2.3,14.1,6.9l-2.9,2.6c-2.5-3.6-6.6-5.7-10.9-5.5c-9.3,0-15,7.4-15,17
	s5.7,17.2,15,17.2c4.4,0.1,8.5-2,10.9-5.7l2.9,2.6c-3.3,4.5-8.6,7.1-14.1,6.9c-11.8,0-19.5-9.3-19.5-21S292.4,32.1,304.2,32.1z"/>
<path class="st15" d="M328.8,65.4V37h-6.6v-3.9h6.6V22.1h4.4v10.9h8.2V37h-8.2v27.7c0,3.2,1.3,5.5,4.1,5.5c1.7,0,3.3-0.7,4.5-1.9
	l1.6,3.4c-1.8,1.7-4.3,2.6-6.9,2.5C331.3,74,328.8,70.8,328.8,65.4z"/>
<path class="st15" d="M350.7,33.1h4.3v6.9c3.4-4.5,8-7.7,13.5-7.7v4.7c-0.7-0.1-1.5-0.2-2.2-0.1c-4.1,0-9.5,3.6-11.4,7.1V73h-4.4
	L350.7,33.1z"/>
<path class="st15" d="M404,67.2c-3.4,3.6-8.6,6.8-14.4,6.8c-8.2,0-12.6-3.8-12.6-12.8V33.1h4.4v27.1c0,7.7,3.9,9.9,9.6,9.9
	c5.1-0.2,9.8-2.6,13-6.6V33.1h4.4V73H404V67.2z"/>
<path class="st15" d="M466,45.2c0-5.7-2.3-9.2-8-9.2c-4.4,0-9.2,3.2-11.4,6.9v30.3h-4.3v-28c0-5.7-2.3-9.2-8-9.2
	c-4.2,0-9,3.2-11.4,6.9V73h-4.4V33.1h4.4v6c1.6-2.6,7.1-7,13-7c6.3,0,9.5,3.6,10.5,7.6c2.9-4.6,7.9-7.4,13.2-7.6
	c7.4,0,10.9,4.1,10.9,12.2v28.8h-4.4v-28L466,45.2z"/>
<path class="st15" d="M503.3,44.3c0.9-16.9,13.8-27.8,29.3-27.1c7.9,0.3,15.3,4.3,19.8,10.8l-4.1,2.3c-3.6-5.3-9.5-8.6-15.9-8.9
	c-12.8-0.7-23.3,8.6-24,23s8.7,24.8,21.6,25.4c6.4,0.3,12.6-2.3,16.8-7.1l3.8,2.6c-5.1,6.1-12.9,9.3-20.9,8.7
	C514.1,73.4,502.3,61.2,503.3,44.3z"/>
<path class="st15" d="M586.2,68.3c-3.5,3.9-8,5.7-13.5,5.7c-6.8,0-14-4.7-14-13.3s7-13.1,14-13.1c5.5,0,10.1,1.7,13.5,5.7v-8.2
	c0-5.8-4.8-9.2-10.8-9.2c-5,0-8.9,1.8-12.5,5.8l-2.3-2.9c3.8-4.5,9.4-7,15.3-6.9c8.2,0,14.7,3.9,14.7,12.8V73h-4.4L586.2,68.3z
	 M586.2,56.4c-2.9-3.6-7.4-5.7-12.1-5.5c-6.6,0-10.9,4.4-10.9,9.9s4.4,9.9,10.9,9.9c4.7,0.2,9.1-1.9,12.1-5.5V56.4z"/>
<path class="st15" d="M601.4,64.5c3.2,3.8,8,5.9,13,5.8c6.7,0,10.6-3.4,10.6-8c0-5.1-5.5-6.6-11.2-8.2c-6.6-1.6-14-3.4-14-11.2
	c0-6.1,5.1-11.1,14.3-11.1c6.8,0,11.4,2.6,14.3,6l-2.4,2.9c-2.3-3.2-6.5-5.2-11.9-5.2c-6.3,0-10,3.1-10,7.1c0,4.5,5.1,5.8,10.6,7.1
	c6.8,1.8,14.6,3.6,14.6,12.2c0,6.4-5.1,11.8-15,11.8c-6.4,0-11.4-1.9-15.4-6.3L601.4,64.5z"/>
<path class="st15" d="M665.6,45.9c0-7.7-3.9-9.9-9.6-9.9c-5.1,0-10.5,3.4-13,6.9V73h-4.4V17.9h4.4v21.3c2.9-3.5,8.6-7,14.4-7
	c8.2,0,12.6,3.8,12.6,12.8v28.1h-4.4V45.9z"/>
<g>
	<path class="st16" d="M174.9,98.7c0.6,0.8,1.5,1.5,2.8,1.5c1.8,0,2.9-1.3,2.9-3.1V86.9h1.8v10.3c0,3.2-2,4.7-4.7,4.7
		c-1.6,0-2.8-0.5-3.8-1.7L174.9,98.7z"/>
	<path class="st16" d="M192.9,100.3c-0.9,1-2.1,1.5-3.5,1.5c-1.8,0-3.7-1.2-3.7-3.5c0-2.4,1.9-3.5,3.7-3.5c1.5,0,2.7,0.5,3.5,1.5
		v-1.9c0-1.4-1.1-2.2-2.7-2.2c-1.3,0-2.3,0.5-3.3,1.5l-0.8-1.1c1.1-1.2,2.5-1.8,4.2-1.8c2.2,0,4.1,1,4.1,3.6v7.3h-1.6V100.3z
		 M192.9,97.3c-0.6-0.9-1.8-1.3-2.9-1.3c-1.5,0-2.6,1-2.6,2.3c0,1.3,1.1,2.3,2.6,2.3c1.2,0,2.3-0.4,2.9-1.3V97.3z"/>
	<path class="st16" d="M196.7,90.9h1.8l3.5,8.7l3.5-8.7h1.8l-4.4,10.6h-1.8L196.7,90.9z"/>
	<path class="st16" d="M216.1,100.3c-0.9,1-2.1,1.5-3.5,1.5c-1.8,0-3.7-1.2-3.7-3.5c0-2.4,1.9-3.5,3.7-3.5c1.5,0,2.7,0.5,3.5,1.5
		v-1.9c0-1.4-1.1-2.2-2.7-2.2c-1.3,0-2.3,0.5-3.3,1.5l-0.8-1.1c1.1-1.2,2.5-1.8,4.2-1.8c2.2,0,4.1,1,4.1,3.6v7.3h-1.6V100.3z
		 M216.1,97.3c-0.6-0.9-1.8-1.3-2.9-1.3c-1.5,0-2.6,1-2.6,2.3c0,1.3,1.1,2.3,2.6,2.3c1.2,0,2.3-0.4,2.9-1.3V97.3z"/>
	<path class="st16" d="M221.5,99c0.7,0.8,2,1.5,3.5,1.5c1.6,0,2.5-0.7,2.5-1.8c0-1.2-1.3-1.5-2.7-1.9c-1.8-0.4-3.9-0.9-3.9-3.1
		c0-1.7,1.4-3.1,4-3.1c1.8,0,3.1,0.7,3.9,1.5l-0.8,1.1c-0.6-0.8-1.8-1.3-3.2-1.3c-1.5,0-2.4,0.7-2.4,1.6c0,1,1.2,1.4,2.6,1.7
		c1.8,0.4,4,0.9,4,3.3c0,1.8-1.4,3.2-4.2,3.2c-1.7,0-3.2-0.5-4.3-1.7L221.5,99z"/>
	<path class="st16" d="M236.9,90.7c1.9,0,3.1,0.8,3.9,1.8l-1.1,1c-0.7-1-1.6-1.4-2.7-1.4c-2.3,0-3.7,1.7-3.7,4.1
		c0,2.4,1.4,4.1,3.7,4.1c1.1,0,2-0.4,2.7-1.4l1.1,1c-0.8,1.1-2,1.8-3.9,1.8c-3.2,0-5.3-2.4-5.3-5.6
		C231.6,93.1,233.7,90.7,236.9,90.7z"/>
	<path class="st16" d="M243.5,90.9h1.6v1.7c0.9-1.1,2.1-1.9,3.5-1.9v1.7c-0.2,0-0.4-0.1-0.7-0.1c-1,0-2.4,0.8-2.9,1.7v7.5h-1.6V90.9
		z"/>
	<path class="st16" d="M250.9,88c0-0.6,0.5-1.1,1.1-1.1c0.6,0,1.1,0.5,1.1,1.1c0,0.6-0.5,1.1-1.1,1.1
		C251.4,89.1,250.9,88.6,250.9,88z M251.2,90.9h1.6v10.6h-1.6V90.9z"/>
	<path class="st16" d="M256.6,105.6V90.9h1.6v1.6c0.8-1.1,2.1-1.8,3.6-1.8c2.8,0,4.7,2.1,4.7,5.6c0,3.4-1.9,5.6-4.7,5.6
		c-1.5,0-2.7-0.7-3.6-1.9v5.7H256.6z M261.4,92.1c-1.3,0-2.6,0.8-3.2,1.7v4.8c0.6,0.9,1.9,1.7,3.2,1.7c2.1,0,3.4-1.8,3.4-4.1
		C264.8,93.9,263.6,92.1,261.4,92.1z"/>
	<path class="st16" d="M270,99.3v-7h-1.8v-1.5h1.8V88h1.6v2.9h2.2v1.5h-2.2V99c0,0.8,0.4,1.4,1.1,1.4c0.5,0,0.9-0.2,1.1-0.4l0.5,1.2
		c-0.4,0.4-1,0.7-2,0.7C270.8,101.8,270,100.9,270,99.3z"/>
	<path class="st16" d="M283.2,86.4h1.3l-5.2,15.6H278L283.2,86.4z"/>
	<path class="st16" d="M292.5,88.5h-4.6v-1.6H299v1.6h-4.7v13h-1.8V88.5z"/>
	<path class="st16" d="M300.9,104.4c0.7,0,1.2-0.2,1.6-1.1l0.7-1.6l-4.4-10.7h1.8l3.5,8.7l3.5-8.7h1.8l-5.3,12.8
		c-0.6,1.5-1.7,2.1-3.1,2.2c-0.4,0-0.9-0.1-1.2-0.2l0.3-1.5C300.2,104.3,300.6,104.4,300.9,104.4z"/>
	<path class="st16" d="M311.5,105.6V90.9h1.6v1.6c0.8-1.1,2.1-1.8,3.6-1.8c2.8,0,4.7,2.1,4.7,5.6c0,3.4-1.9,5.6-4.7,5.6
		c-1.5,0-2.7-0.7-3.6-1.9v5.7H311.5z M316.3,92.1c-1.3,0-2.6,0.8-3.2,1.7v4.8c0.6,0.9,1.9,1.7,3.2,1.7c2.1,0,3.4-1.8,3.4-4.1
		C319.7,93.9,318.5,92.1,316.3,92.1z"/>
	<path class="st16" d="M329.2,90.7c3.2,0,5.1,2.5,5.1,5.7v0.4h-8.6c0.1,2,1.5,3.7,3.8,3.7c1.2,0,2.4-0.5,3.3-1.3l0.8,1.1
		c-1.1,1.1-2.5,1.6-4.2,1.6c-3.1,0-5.4-2.3-5.4-5.6C324,93.1,326.2,90.7,329.2,90.7z M325.7,95.6h7c0-1.6-1.1-3.5-3.5-3.5
		C326.9,92,325.8,93.9,325.7,95.6z"/>
	<path class="st16" d="M337.3,99c0.7,0.8,2,1.5,3.5,1.5c1.6,0,2.5-0.7,2.5-1.8c0-1.2-1.3-1.5-2.7-1.9c-1.8-0.4-3.9-0.9-3.9-3.1
		c0-1.7,1.4-3.1,4-3.1c1.8,0,3.1,0.7,3.9,1.5l-0.8,1.1c-0.6-0.8-1.8-1.3-3.2-1.3c-1.5,0-2.4,0.7-2.4,1.6c0,1,1.2,1.4,2.6,1.7
		c1.8,0.4,4,0.9,4,3.3c0,1.8-1.4,3.2-4.2,3.2c-1.7,0-3.2-0.5-4.3-1.7L337.3,99z"/>
	<path class="st16" d="M352.8,90.7c1.9,0,3.1,0.8,3.9,1.8l-1.1,1c-0.7-1-1.6-1.4-2.7-1.4c-2.3,0-3.7,1.7-3.7,4.1
		c0,2.4,1.4,4.1,3.7,4.1c1.1,0,2-0.4,2.7-1.4l1.1,1c-0.8,1.1-2,1.8-3.9,1.8c-3.2,0-5.3-2.4-5.3-5.6
		C347.5,93.1,349.6,90.7,352.8,90.7z"/>
	<path class="st16" d="M359.4,90.9h1.7v1.7c0.9-1.1,2.1-1.9,3.5-1.9v1.7c-0.2,0-0.4-0.1-0.7-0.1c-1,0-2.4,0.8-2.9,1.7v7.5h-1.7V90.9
		z"/>
	<path class="st16" d="M366.8,88c0-0.6,0.5-1.1,1.1-1.1c0.6,0,1.1,0.5,1.1,1.1c0,0.6-0.5,1.1-1.1,1.1
		C367.3,89.1,366.8,88.6,366.8,88z M367.1,90.9h1.7v10.6h-1.7V90.9z"/>
	<path class="st16" d="M372.5,105.6V90.9h1.7v1.6c0.8-1.1,2.1-1.8,3.6-1.8c2.8,0,4.7,2.1,4.7,5.6c0,3.4-1.9,5.6-4.7,5.6
		c-1.5,0-2.7-0.7-3.6-1.9v5.7H372.5z M377.3,92.1c-1.3,0-2.6,0.8-3.2,1.7v4.8c0.6,0.9,1.9,1.7,3.2,1.7c2.1,0,3.4-1.8,3.4-4.1
		C380.7,93.9,379.5,92.1,377.3,92.1z"/>
	<path class="st16" d="M385.9,99.3v-7h-1.8v-1.5h1.8V88h1.7v2.9h2.2v1.5h-2.2V99c0,0.8,0.4,1.4,1.1,1.4c0.5,0,0.9-0.2,1.1-0.4
		l0.5,1.2c-0.4,0.4-1,0.7-2,0.7C386.7,101.8,385.9,100.9,385.9,99.3z"/>
	<path class="st16" d="M398.6,86.9h1.7v14.7h-1.7V86.9z"/>
	<path class="st16" d="M403.7,88c0-0.6,0.5-1.1,1.1-1.1c0.6,0,1.1,0.5,1.1,1.1c0,0.6-0.5,1.1-1.1,1.1
		C404.2,89.1,403.7,88.6,403.7,88z M404,90.9h1.7v10.6H404V90.9z"/>
	<path class="st16" d="M409.4,86.9h1.7v5.7c0.9-1.2,2.1-1.9,3.6-1.9c2.8,0,4.7,2.2,4.7,5.6c0,3.5-2,5.6-4.7,5.6
		c-1.5,0-2.8-0.8-3.6-1.8v1.6h-1.7V86.9z M414.2,100.3c2.2,0,3.4-1.7,3.4-4.1s-1.3-4.1-3.4-4.1c-1.3,0-2.6,0.8-3.2,1.7v4.8
		C411.6,99.6,412.9,100.3,414.2,100.3z"/>
	<path class="st16" d="M422.5,90.9h1.7v1.7c0.9-1.1,2.1-1.9,3.5-1.9v1.7c-0.2,0-0.4-0.1-0.7-0.1c-1,0-2.4,0.8-2.9,1.7v7.5h-1.7V90.9
		z"/>
	<path class="st16" d="M436.8,100.3c-0.9,1-2.1,1.5-3.5,1.5c-1.8,0-3.7-1.2-3.7-3.5c0-2.4,1.9-3.5,3.7-3.5c1.5,0,2.7,0.5,3.5,1.5
		v-1.9c0-1.4-1.1-2.2-2.7-2.2c-1.3,0-2.3,0.5-3.3,1.5l-0.8-1.1c1.1-1.2,2.5-1.8,4.2-1.8c2.2,0,4.1,1,4.1,3.6v7.3h-1.7V100.3z
		 M436.8,97.3c-0.6-0.9-1.8-1.3-2.9-1.3c-1.5,0-2.6,1-2.6,2.3c0,1.3,1.1,2.3,2.6,2.3c1.2,0,2.3-0.4,2.9-1.3V97.3z"/>
	<path class="st16" d="M442.2,90.9h1.7v1.7c0.9-1.1,2.1-1.9,3.5-1.9v1.7c-0.2,0-0.4-0.1-0.7-0.1c-1,0-2.4,0.8-2.9,1.7v7.5h-1.7V90.9
		z"/>
	<path class="st16" d="M450.5,104.4c0.7,0,1.2-0.2,1.6-1.1l0.7-1.6l-4.4-10.7h1.8l3.5,8.7l3.5-8.7h1.8l-5.3,12.8
		c-0.6,1.5-1.7,2.1-3.1,2.2c-0.4,0-0.9-0.1-1.2-0.2l0.3-1.5C449.8,104.3,450.2,104.4,450.5,104.4z"/>
	<path class="st16" d="M467.7,92.4h-1.8v-1.5h1.8v-0.8c0-2.2,1.2-3.5,3.1-3.5c0.6,0,1.2,0.1,1.6,0.4l-0.4,1.2
		c-0.3-0.2-0.6-0.2-0.9-0.2c-1.1,0-1.7,0.7-1.7,2.1v0.8h2.2v1.5h-2.2v9.2h-1.7V92.4z"/>
	<path class="st16" d="M473.3,96.2c0-3.1,2-5.6,5.3-5.6s5.3,2.5,5.3,5.6c0,3.1-2,5.6-5.3,5.6S473.3,99.3,473.3,96.2z M482.1,96.2
		c0-2.2-1.3-4.1-3.5-4.1s-3.5,1.9-3.5,4.1c0,2.2,1.3,4.1,3.5,4.1S482.1,98.4,482.1,96.2z"/>
	<path class="st16" d="M486.9,90.9h1.7v1.7c0.9-1.1,2.1-1.9,3.5-1.9v1.7c-0.2,0-0.4-0.1-0.7-0.1c-1,0-2.4,0.8-2.9,1.7v7.5h-1.7V90.9
		z"/>
	<path class="st16" d="M506.2,90.7c3.2,0,5.1,2.5,5.1,5.7v0.4h-8.6c0.1,2,1.5,3.7,3.8,3.7c1.2,0,2.4-0.5,3.3-1.3l0.8,1.1
		c-1.1,1.1-2.5,1.6-4.2,1.6c-3.1,0-5.4-2.3-5.4-5.6C501,93.1,503.2,90.7,506.2,90.7z M502.7,95.6h7c0-1.6-1.1-3.5-3.5-3.5
		C503.9,92,502.8,93.9,502.7,95.6z"/>
	<path class="st16" d="M514.4,86.9h1.7v14.7h-1.7V86.9z"/>
	<path class="st16" d="M524.5,90.7c3.2,0,5.1,2.5,5.1,5.7v0.4H521c0.1,2,1.5,3.7,3.8,3.7c1.2,0,2.4-0.5,3.3-1.3l0.8,1.1
		c-1.1,1.1-2.5,1.6-4.2,1.6c-3.1,0-5.4-2.3-5.4-5.6C519.2,93.1,521.4,90.7,524.5,90.7z M521,95.6h7c0-1.6-1.1-3.5-3.5-3.5
		C522.2,92,521,93.9,521,95.6z"/>
	<path class="st16" d="M537.3,90.7c1.9,0,3.1,0.8,3.9,1.8l-1.1,1c-0.7-1-1.6-1.4-2.7-1.4c-2.3,0-3.7,1.7-3.7,4.1
		c0,2.4,1.4,4.1,3.7,4.1c1.1,0,2-0.4,2.7-1.4l1.1,1c-0.8,1.1-2,1.8-3.9,1.8c-3.2,0-5.3-2.4-5.3-5.6C532,93.1,534.2,90.7,537.3,90.7z
		"/>
	<path class="st16" d="M544.3,99.3v-7h-1.8v-1.5h1.8V88h1.7v2.9h2.2v1.5H546V99c0,0.8,0.4,1.4,1.1,1.4c0.5,0,0.9-0.2,1.1-0.4
		l0.5,1.2c-0.4,0.4-1,0.7-2,0.7C545.1,101.8,544.3,100.9,544.3,99.3z"/>
	<path class="st16" d="M550.9,90.9h1.7v1.7c0.9-1.1,2.1-1.9,3.5-1.9v1.7c-0.2,0-0.4-0.1-0.7-0.1c-1,0-2.4,0.8-2.9,1.7v7.5h-1.7V90.9
		z"/>
	<path class="st16" d="M565.8,100.1c-0.8,0.9-2.2,1.8-3.8,1.8c-2.2,0-3.4-1.1-3.4-3.4v-7.5h1.7v7c0,1.9,0.9,2.4,2.4,2.4
		c1.3,0,2.5-0.7,3.1-1.6v-7.8h1.7v10.6h-1.7V100.1z"/>
	<path class="st16" d="M584,94.3c0-1.3-0.6-2.2-2-2.2c-1.1,0-2.3,0.8-2.8,1.6v7.8h-1.7v-7.2c0-1.3-0.6-2.2-2-2.2
		c-1.1,0-2.2,0.8-2.8,1.6v7.8h-1.7V90.9h1.7v1.5c0.4-0.7,1.9-1.8,3.4-1.8c1.6,0,2.6,0.9,2.9,2c0.6-1,2-2,3.6-2c1.9,0,3,1.1,3,3.2
		v7.7H584V94.3z"/>
	<path class="st16" d="M595.4,99c0.7,0.8,2,1.5,3.5,1.5c1.6,0,2.5-0.7,2.5-1.8c0-1.2-1.3-1.5-2.7-1.9c-1.8-0.4-3.9-0.9-3.9-3.1
		c0-1.7,1.4-3.1,4-3.1c1.8,0,3.1,0.7,3.9,1.5l-0.8,1.1c-0.6-0.8-1.8-1.3-3.2-1.3c-1.5,0-2.4,0.7-2.4,1.6c0,1,1.2,1.4,2.6,1.7
		c1.8,0.4,4,0.9,4,3.3c0,1.8-1.4,3.2-4.2,3.2c-1.7,0-3.2-0.5-4.3-1.7L595.4,99z"/>
	<path class="st16" d="M610.8,90.7c3.2,0,5.1,2.5,5.1,5.7v0.4h-8.6c0.1,2,1.5,3.7,3.8,3.7c1.2,0,2.4-0.5,3.3-1.3l0.8,1.1
		c-1.1,1.1-2.5,1.6-4.2,1.6c-3.1,0-5.4-2.3-5.4-5.6C605.5,93.1,607.7,90.7,610.8,90.7z M607.3,95.6h7c0-1.6-1.1-3.5-3.5-3.5
		C608.5,92,607.4,93.9,607.3,95.6z"/>
	<path class="st16" d="M619,90.9h1.7v1.7c0.9-1.1,2.1-1.9,3.5-1.9v1.7c-0.2,0-0.4-0.1-0.7-0.1c-1,0-2.4,0.8-2.9,1.7v7.5H619V90.9z"
		/>
	<path class="st16" d="M625.1,90.9h1.8l3.5,8.7l3.5-8.7h1.8l-4.4,10.6h-1.8L625.1,90.9z"/>
	<path class="st16" d="M642.5,90.7c3.2,0,5.1,2.5,5.1,5.7v0.4H639c0.1,2,1.5,3.7,3.8,3.7c1.2,0,2.4-0.5,3.3-1.3l0.8,1.1
		c-1.1,1.1-2.5,1.6-4.2,1.6c-3.1,0-5.4-2.3-5.4-5.6C637.3,93.1,639.5,90.7,642.5,90.7z M639,95.6h7c0-1.6-1.1-3.5-3.5-3.5
		C640.2,92,639.1,93.9,639,95.6z"/>
	<path class="st16" d="M650.7,90.9h1.7v1.7c0.9-1.1,2.1-1.9,3.5-1.9v1.7c-0.2,0-0.4-0.1-0.7-0.1c-1,0-2.4,0.8-2.9,1.7v7.5h-1.7V90.9
		z"/>
	<path class="st16" d="M658.4,99c0.7,0.8,2,1.5,3.5,1.5c1.6,0,2.5-0.7,2.5-1.8c0-1.2-1.3-1.5-2.7-1.9c-1.8-0.4-3.9-0.9-3.9-3.1
		c0-1.7,1.4-3.1,4-3.1c1.8,0,3.1,0.7,3.9,1.5l-0.8,1.1c-0.6-0.8-1.8-1.3-3.2-1.3c-1.5,0-2.4,0.7-2.4,1.6c0,1,1.2,1.4,2.6,1.7
		c1.8,0.4,4,0.9,4,3.3c0,1.8-1.4,3.2-4.2,3.2c-1.7,0-3.2-0.5-4.3-1.7L658.4,99z"/>
</g>
</svg>
