<?xml version="1.0" encoding="utf-8"?>
<!-- Generator: Adobe Illustrator 24.2.3, SVG Export Plug-In . SVG Version: 6.00 Build 0)  -->
<svg version="1.1" id="Layer_1" xmlns="http://www.w3.org/2000/svg" xmlns:xlink="http://www.w3.org/1999/xlink" x="0px" y="0px"
	 viewBox="0 0 256 256" style="enable-background:new 0 0 256 256;" xml:space="preserve">
<style type="text/css">
	.st0{fill:url(#SVGID_1_);}
	.st1{fill:#FFFFFF;}
	.st2{fill:url(#SVGID_2_);}
</style>
<linearGradient id="SVGID_1_" gradientUnits="userSpaceOnUse" x1="40.5744" y1="486.5744" x2="215.4256" y2="789.4257" gradientTransform="matrix(1 0 0 1 0 -510)">
	<stop  offset="0" style="stop-color:#16FDC4"/>
	<stop  offset="1" style="stop-color:#02A5F9"/>
</linearGradient>
<path class="st0" d="M0,0h256v256H0V0z"/>
<g>
	<path class="st1" d="M128.9,249.3c17.6,0,34.3-7.5,46.1-20.1c1.7,0.7,3.6,1.1,5.6,1.1c7.2,0,13.2-5.3,14.4-12.2
		c16.2-4.2,30.4-14.7,39-29.5c8.7-15,10.6-32.9,5.8-49.2c3.4-2.7,5.5-6.8,5.5-11.4s-2.2-8.8-5.6-11.4c4.8-16.3,2.9-34.3-5.8-49.3
		c-8.6-14.8-22.8-25.3-39-29.5c-1.2-6.8-7.2-12-14.4-12c-2,0-3.8,0.4-5.5,1.1c-11.8-12.7-28.5-20.3-46.2-20.3
		C111.5,6.7,95,14,83.2,26.3c-1.2-0.3-2.5-0.5-3.8-0.5c-7,0-12.8,4.9-14.3,11.5C48,41,32.8,51.8,23.8,67.3
		c-5.6,9.7-8.4,20.6-8.4,31.4c0,5.7,0.8,11.3,2.3,16.8c-4.2,2.6-7.1,7.2-7.1,12.5s2.8,9.9,7,12.5c-1.5,5.5-2.2,11.1-2.2,16.7
		c0,10.9,2.8,21.7,8.4,31.4c9,15.5,24.1,26.3,41.3,30c1.4,6.6,7.3,11.6,14.3,11.6c1.4,0,2.7-0.2,3.9-0.6
		C95.1,242.1,111.5,249.3,128.9,249.3z M176.9,211.1c-0.1,0-0.2,0-0.2,0c-0.9,0-1.9-0.1-2.8-0.2c-0.1,0-0.3,0-0.4,0
		c-0.9-0.1-1.9-0.2-2.8-0.4c-0.1,0-0.2,0-0.2,0c-0.9-0.2-1.9-0.4-2.8-0.6c-0.1,0-0.1,0-0.2,0c-0.9-0.2-1.9-0.5-2.8-0.7
		c-0.1,0-0.3-0.1-0.4-0.1c-0.9-0.3-1.8-0.6-2.6-0.9c-0.2-0.1-0.3-0.1-0.5-0.2c-0.9-0.3-1.7-0.7-2.6-1c-0.1-0.1-0.3-0.1-0.4-0.2
		c-0.9-0.4-1.7-0.8-2.6-1.2c-0.1-0.1-0.2-0.1-0.3-0.2c-0.9-0.4-1.8-0.9-2.6-1.4c-0.9-0.5-1.8-1.1-2.7-1.7c-0.3-0.2-0.5-0.3-0.8-0.5
		c-0.7-0.5-1.3-0.9-2-1.4c-0.2-0.2-0.5-0.3-0.7-0.5c-0.8-0.6-1.6-1.3-2.4-2c-0.1-0.1-0.2-0.2-0.3-0.3c-0.7-0.6-1.3-1.2-2-1.9
		c-0.2-0.2-0.4-0.4-0.7-0.7c-0.6-0.6-1.1-1.2-1.7-1.8c-0.2-0.2-0.3-0.4-0.5-0.6c-0.6-0.7-1.2-1.5-1.8-2.2
		c16.6-2.2,31.7-10.9,41.9-24.2c0,0.1,0.1,0.2,0.1,0.3c0.2,0.6,0.5,1.2,0.7,1.8c0.1,0.2,0.1,0.3,0.2,0.5c0.2,0.7,0.5,1.4,0.7,2.2
		c0,0.1,0.1,0.3,0.1,0.4c0.2,0.6,0.4,1.2,0.5,1.9c0,0.2,0.1,0.4,0.1,0.5c0.2,0.7,0.3,1.5,0.5,2.2c0,0.1,0,0.2,0.1,0.3
		c0.1,0.7,0.2,1.3,0.3,2c0,0.2,0.1,0.4,0.1,0.6c0.1,0.8,0.2,1.5,0.3,2.3v0.2c0.1,0.7,0.1,1.4,0.2,2.1v0.6c0,0.8,0.1,1.5,0.1,2.3
		c0,1,0,2-0.1,3v0.3c-0.1,0.9-0.1,1.9-0.3,2.8c0,0.2,0,0.3-0.1,0.5c-0.1,0.9-0.3,1.8-0.4,2.7c0,0.2-0.1,0.3-0.1,0.5
		c-0.2,0.9-0.4,1.8-0.6,2.7c0,0.1-0.1,0.3-0.1,0.4c-0.2,0.9-0.5,1.9-0.8,2.8c0,0.1,0,0.1-0.1,0.2c-0.3,0.9-0.6,1.8-0.9,2.7
		c0,0.1-0.1,0.2-0.1,0.2c-0.3,0.9-0.7,1.8-1.1,2.7c-0.1,0.1-0.1,0.3-0.2,0.4c-0.4,0.9-0.8,1.7-1.2,2.5V211.1z M38.3,134.9
		c-0.3-0.4-0.6-0.7-1-1.1c-0.4-0.5-0.8-1-1.2-1.5c-0.3-0.4-0.6-0.8-0.9-1.1c-0.4-0.5-0.8-1.1-1.1-1.6c-0.3-0.4-0.5-0.8-0.8-1.2
		c-0.1-0.1-0.2-0.3-0.2-0.4c0.1-0.1,0.2-0.3,0.2-0.4c0.3-0.4,0.5-0.8,0.8-1.2c0.4-0.5,0.8-1.1,1.2-1.6c0.3-0.4,0.6-0.8,0.9-1.1
		c0.4-0.5,0.8-1,1.2-1.5c0.3-0.4,0.6-0.7,1-1.1c0.4-0.5,0.9-0.9,1.3-1.4l1-1c0.5-0.5,0.9-0.9,1.4-1.3c0.3-0.3,0.7-0.6,1.1-0.9
		c0.5-0.4,1-0.9,1.6-1.3c0.3-0.3,0.7-0.6,1-0.8c0.6-0.5,1.2-0.9,1.8-1.3c0.3-0.2,0.6-0.4,0.9-0.6c0.9-0.6,1.9-1.2,2.9-1.8
		c0.7-0.4,1.3-0.8,2-1.1c0.2-0.1,0.4-0.2,0.5-0.3c0.6-0.3,1.3-0.6,1.9-0.9c0.1,0,0.1-0.1,0.2-0.1c0.7-0.3,1.4-0.6,2.1-0.9
		c0.2-0.1,0.4-0.1,0.5-0.2c0.6-0.2,1.2-0.5,1.9-0.7c0.1,0,0.2-0.1,0.3-0.1c0.7-0.2,1.4-0.5,2.2-0.7c0.2-0.1,0.4-0.1,0.5-0.2
		c0.6-0.2,1.2-0.3,1.9-0.5c0.1,0,0.3-0.1,0.4-0.1c0.7-0.2,1.5-0.3,2.2-0.5c0.2,0,0.3-0.1,0.5-0.1c0.6-0.1,1.3-0.2,1.9-0.3
		c0.1,0,0.2,0,0.3-0.1c-3.2,7.6-4.8,15.9-4.8,24.2s1.7,16.6,4.8,24.2c-0.1,0-0.2,0-0.3,0c-0.6-0.1-1.3-0.2-1.9-0.3
		c-0.2,0-0.3-0.1-0.5-0.1c-0.7-0.1-1.5-0.3-2.2-0.5c-0.1,0-0.3-0.1-0.4-0.1c-0.6-0.2-1.3-0.3-1.9-0.5c-0.2-0.1-0.4-0.1-0.5-0.2
		c-0.7-0.2-1.5-0.4-2.2-0.7c-0.1,0-0.2-0.1-0.3-0.1c-0.6-0.2-1.3-0.5-1.9-0.7c-0.2-0.1-0.4-0.1-0.5-0.2c-0.7-0.3-1.4-0.6-2.1-0.9
		c-0.1,0-0.1-0.1-0.2-0.1c-0.6-0.3-1.3-0.6-1.9-0.9c-0.2-0.1-0.4-0.2-0.5-0.3c-0.7-0.4-1.4-0.7-2-1.1c-1-0.6-1.9-1.2-2.9-1.8
		c-0.3-0.2-0.6-0.4-0.9-0.6c-0.6-0.4-1.2-0.9-1.8-1.3c-0.4-0.3-0.7-0.6-1-0.8c-0.5-0.4-1.1-0.9-1.6-1.3c-0.4-0.3-0.7-0.6-1.1-0.9
		c-0.5-0.4-1-0.9-1.4-1.3c-0.3-0.3-0.7-0.7-1-1C39.1,135.8,38.7,135.4,38.3,134.9L38.3,134.9z M219.5,121.1c0.3,0.4,0.6,0.7,1,1.1
		l1.2,1.5c0.3,0.4,0.6,0.8,0.9,1.1c0.4,0.5,0.8,1.1,1.1,1.6c0.3,0.4,0.5,0.8,0.8,1.2c0.1,0.1,0.2,0.3,0.2,0.4
		c-0.1,0.1-0.2,0.3-0.2,0.4c-0.3,0.4-0.5,0.8-0.8,1.2c-0.4,0.5-0.8,1.1-1.2,1.6c-0.3,0.4-0.6,0.8-0.9,1.1c-0.4,0.5-0.8,1-1.2,1.5
		c-0.3,0.4-0.6,0.7-1,1.1c-0.4,0.5-0.9,0.9-1.3,1.4c-0.3,0.3-0.7,0.7-1,1c-0.5,0.5-0.9,0.9-1.4,1.3c-0.3,0.3-0.7,0.6-1.1,0.9
		c-0.5,0.4-1,0.9-1.6,1.3c-0.3,0.3-0.7,0.6-1,0.8c-0.6,0.5-1.2,0.9-1.8,1.3c-0.3,0.2-0.6,0.4-0.9,0.6c-0.9,0.6-1.9,1.2-2.9,1.8
		c-0.7,0.4-1.4,0.8-2,1.1c-0.2,0.1-0.4,0.2-0.5,0.3c-0.6,0.3-1.3,0.6-1.9,0.9c-0.1,0-0.1,0.1-0.2,0.1c-0.7,0.3-1.4,0.6-2.1,0.9
		c-0.2,0.1-0.4,0.1-0.5,0.2c-0.6,0.2-1.3,0.5-1.9,0.7c-0.1,0-0.2,0.1-0.3,0.1c-0.7,0.2-1.4,0.5-2.2,0.7c-0.2,0.1-0.4,0.1-0.5,0.2
		c-0.6,0.2-1.3,0.3-1.9,0.5c-0.1,0-0.3,0.1-0.4,0.1c-0.7,0.2-1.5,0.3-2.2,0.5c-0.2,0-0.3,0.1-0.5,0.1c-0.6,0.1-1.3,0.2-1.9,0.3
		c-0.1,0-0.2,0-0.3,0c3.2-7.6,4.8-15.9,4.8-24.2s-1.7-16.6-4.8-24.2h0.3c0.6,0.1,1.3,0.2,1.9,0.3c0.2,0,0.3,0.1,0.5,0.1
		c0.7,0.1,1.5,0.3,2.2,0.5c0.1,0,0.3,0.1,0.4,0.1c0.6,0.2,1.3,0.3,1.9,0.5c0.2,0.1,0.4,0.1,0.5,0.2c0.7,0.2,1.5,0.4,2.2,0.7
		c0.1,0,0.2,0.1,0.3,0.1c0.6,0.2,1.3,0.5,1.9,0.7c0.2,0.1,0.4,0.1,0.5,0.2c0.7,0.3,1.4,0.6,2.1,0.9c0.1,0,0.1,0.1,0.2,0.1
		c0.6,0.3,1.3,0.6,1.9,0.9c0.2,0.1,0.4,0.2,0.5,0.3c0.7,0.4,1.4,0.7,2,1.1c1,0.6,1.9,1.2,2.9,1.8c0.3,0.2,0.6,0.4,0.9,0.6
		c0.6,0.4,1.2,0.9,1.8,1.3c0.4,0.3,0.7,0.6,1,0.8c0.5,0.4,1.1,0.9,1.6,1.3c0.4,0.3,0.7,0.6,1.1,0.9c0.5,0.4,1,0.9,1.4,1.3
		c0.3,0.3,0.7,0.7,1,1C218.7,120.2,219.1,120.6,219.5,121.1L219.5,121.1z M226.2,184.2c-8.3,14.4-22.9,24.1-39.2,26.4
		c0.3-0.8,0.7-1.7,1-2.5c0.1-0.2,0.2-0.4,0.2-0.7c0.3-0.8,0.6-1.6,0.8-2.4c0-0.1,0-0.1,0.1-0.2c0.3-0.9,0.5-1.7,0.7-2.6
		c0.1-0.2,0.1-0.5,0.2-0.7c0.2-0.8,0.4-1.7,0.6-2.5c0-0.1,0-0.1,0-0.2c0.2-0.9,0.3-1.8,0.5-2.7c0-0.2,0.1-0.5,0.1-0.7
		c0.1-0.9,0.2-1.8,0.3-2.7v-0.1c0.1-0.9,0.2-1.8,0.2-2.7c0-0.2,0-0.5,0-0.7c0-0.9,0.1-1.8,0.1-2.8s0-1.9-0.1-2.9c0-0.2,0-0.4,0-0.6
		c-0.1-0.9-0.1-1.9-0.2-2.8c0-0.1,0-0.3,0-0.4c-0.1-0.9-0.2-1.7-0.3-2.6c0-0.2-0.1-0.4-0.1-0.6c-0.1-0.9-0.3-1.9-0.5-2.8
		c0-0.2-0.1-0.4-0.1-0.5c-0.2-0.8-0.4-1.7-0.6-2.5c0-0.1-0.1-0.3-0.1-0.4c-0.1-0.4-0.3-0.9-0.4-1.3c3-2.2,5-5.5,5.7-9.3
		c0.3-0.1,0.6-0.1,0.9-0.2c0.1,0,0.3-0.1,0.4-0.1c0.8-0.2,1.6-0.5,2.5-0.7c0.2-0.1,0.4-0.1,0.5-0.2c0.9-0.3,1.8-0.6,2.6-0.9
		c0.2-0.1,0.4-0.1,0.5-0.2c0.8-0.3,1.6-0.6,2.4-1c0.1-0.1,0.2-0.1,0.4-0.2c0.9-0.4,1.7-0.8,2.6-1.2c0.2-0.1,0.4-0.2,0.6-0.3
		c0.9-0.4,1.7-0.9,2.5-1.4s1.6-0.9,2.4-1.4c0.2-0.1,0.4-0.2,0.6-0.4c0.8-0.5,1.5-1,2.3-1.6h0.1c0.7-0.5,1.4-1.1,2.1-1.6
		c0.2-0.1,0.4-0.3,0.5-0.4c0.7-0.6,1.4-1.2,2.1-1.8l0.1-0.1c0.7-0.6,1.3-1.2,1.9-1.8c0.2-0.2,0.3-0.3,0.5-0.5c0.7-0.6,1.3-1.3,1.9-2
		l0.1-0.1c0.6-0.6,1.2-1.3,1.7-1.9c0.1-0.2,0.3-0.3,0.4-0.5c0.6-0.7,1.2-1.4,1.7-2.1C235.6,152.3,234.5,169.8,226.2,184.2z
		 M226.2,71.8c8.3,14.4,9.4,31.9,3.3,47.2c-0.6-0.7-1.1-1.4-1.7-2.1c-0.1-0.2-0.3-0.3-0.4-0.5c-0.6-0.7-1.1-1.3-1.7-1.9l-0.1-0.1
		c-0.6-0.7-1.3-1.3-1.9-2c-0.2-0.2-0.3-0.3-0.5-0.5c-0.6-0.6-1.3-1.2-1.9-1.8l-0.1-0.1c-0.7-0.6-1.4-1.2-2.1-1.8
		c-0.2-0.1-0.4-0.3-0.5-0.4c-0.7-0.6-1.4-1.1-2.1-1.6c0,0,0,0-0.1,0c-0.7-0.5-1.5-1-2.3-1.6c-0.2-0.1-0.4-0.2-0.6-0.4
		c-0.8-0.5-1.6-1-2.4-1.4c-0.8-0.5-1.7-0.9-2.5-1.4c-0.2-0.1-0.4-0.2-0.6-0.3c-0.8-0.4-1.7-0.8-2.6-1.2c-0.1-0.1-0.2-0.1-0.4-0.2
		c-0.8-0.3-1.6-0.7-2.4-1c-0.2-0.1-0.4-0.1-0.5-0.2c-0.9-0.3-1.8-0.6-2.6-0.9c-0.2-0.1-0.4-0.1-0.5-0.2c-0.8-0.3-1.6-0.5-2.4-0.7
		c-0.1,0-0.3-0.1-0.4-0.1c-0.3-0.1-0.7-0.2-1-0.2c-0.7-3.7-2.8-7-5.7-9.1c0.1-0.5,0.3-1,0.4-1.5c0-0.1,0.1-0.3,0.1-0.4
		c0.2-0.8,0.4-1.7,0.6-2.5c0-0.2,0.1-0.4,0.1-0.6c0.2-0.9,0.4-1.8,0.5-2.8c0-0.2,0.1-0.4,0.1-0.6c0.1-0.8,0.2-1.7,0.3-2.6
		c0-0.1,0-0.3,0-0.4c0.1-0.9,0.2-1.9,0.2-2.8c0-0.2,0-0.4,0-0.6c0-1,0.1-1.9,0.1-2.9c0-0.9,0-1.8-0.1-2.8c0-0.2,0-0.5,0-0.7
		c-0.1-0.9-0.1-1.8-0.2-2.8c0,0,0,0,0-0.1c-0.1-0.9-0.2-1.8-0.3-2.7c0-0.2-0.1-0.4-0.1-0.7c-0.1-0.9-0.3-1.8-0.5-2.7V57
		c-0.2-0.9-0.4-1.7-0.6-2.6c-0.1-0.2-0.1-0.4-0.2-0.6c-0.2-0.9-0.5-1.8-0.7-2.6c0-0.1,0-0.1-0.1-0.2c-0.3-0.8-0.5-1.7-0.8-2.5
		c-0.1-0.2-0.1-0.4-0.2-0.6c-0.3-0.9-0.6-1.7-1-2.6C203.3,47.7,217.9,57.4,226.2,71.8L226.2,71.8z M177,45.1
		c0.4,0.8,0.8,1.7,1.2,2.5c0.1,0.1,0.1,0.3,0.2,0.4c0.4,0.9,0.7,1.8,1.1,2.6c0,0.1,0.1,0.2,0.1,0.2c0.3,0.9,0.6,1.8,0.9,2.7
		c0,0.1,0,0.1,0.1,0.2c0.3,0.9,0.5,1.9,0.8,2.8c0,0.1,0.1,0.3,0.1,0.4c0.2,0.9,0.4,1.8,0.6,2.7c0,0.2,0.1,0.3,0.1,0.5
		c0.2,0.9,0.3,1.8,0.4,2.7c0,0.2,0,0.3,0.1,0.5c0.1,0.9,0.2,1.9,0.3,2.8v0.3c0.1,1,0.1,2,0.1,3c0,0.8,0,1.5-0.1,2.3v0.6
		c0,0.7-0.1,1.4-0.2,2.1v0.2c-0.1,0.8-0.2,1.5-0.3,2.3c0,0.2-0.1,0.4-0.1,0.6c-0.1,0.7-0.2,1.3-0.3,2c0,0.1,0,0.2-0.1,0.3
		c-0.1,0.7-0.3,1.5-0.5,2.2c0,0.2-0.1,0.4-0.1,0.6c-0.2,0.6-0.3,1.2-0.5,1.9c0,0.1-0.1,0.3-0.1,0.4c-0.2,0.7-0.4,1.4-0.7,2.2
		c-0.1,0.2-0.1,0.3-0.2,0.5c-0.2,0.6-0.4,1.2-0.7,1.8c0,0.1-0.1,0.2-0.1,0.3c-10.2-13.3-25.3-22-41.9-24.2c0.6-0.8,1.2-1.5,1.8-2.2
		c0.2-0.2,0.3-0.4,0.5-0.6c0.5-0.6,1.1-1.2,1.7-1.8c0.2-0.2,0.4-0.4,0.7-0.7c0.6-0.6,1.3-1.3,2-1.9c0.1-0.1,0.2-0.2,0.3-0.3
		c0.8-0.7,1.6-1.4,2.4-2c0.2-0.2,0.5-0.3,0.7-0.5c0.6-0.5,1.3-1,2-1.4c0.3-0.2,0.5-0.3,0.8-0.5c0.9-0.6,1.8-1.1,2.7-1.7
		c0.9-0.5,1.7-1,2.6-1.4c0.1,0,0.2-0.1,0.3-0.2c0.8-0.4,1.7-0.8,2.6-1.2c0.1-0.1,0.3-0.1,0.4-0.2c0.9-0.4,1.7-0.7,2.6-1
		c0.2-0.1,0.3-0.1,0.5-0.2c0.9-0.3,1.8-0.6,2.7-0.9c0.1,0,0.3-0.1,0.4-0.1c0.9-0.3,1.9-0.5,2.8-0.7h0.2c0.9-0.2,1.9-0.4,2.8-0.6h0.2
		c0.9-0.2,1.9-0.3,2.8-0.4h0.4c0.9-0.1,1.8-0.2,2.8-0.2h0.2C176.9,45,176.9,45.1,177,45.1L177,45.1z M107.3,43
		c-0.2-0.1-0.4-0.2-0.6-0.3c-0.8-0.4-1.6-0.8-2.5-1.2c0,0,0,0-0.1,0c-0.8-0.4-1.6-0.7-2.5-1c-0.2-0.1-0.4-0.2-0.6-0.2
		c-0.9-0.3-1.7-0.6-2.6-0.9h-0.1c-0.8-0.3-1.7-0.5-2.5-0.8c-0.2-0.1-0.4-0.1-0.7-0.2c-0.9-0.2-1.8-0.5-2.7-0.7c-0.1,0-0.1,0-0.2,0
		c-0.8-0.2-1.7-0.4-2.5-0.5c-0.2,0-0.4-0.1-0.7-0.1c-0.9-0.2-1.8-0.3-2.7-0.4c0,0,0,0-0.1,0c10.1-13,25.8-20.8,42.5-20.8
		s32.4,7.8,42.5,20.8c0,0,0,0-0.1,0c-0.9,0.1-1.8,0.3-2.7,0.4c-0.2,0-0.4,0.1-0.7,0.1c-0.8,0.2-1.7,0.3-2.5,0.5c-0.1,0-0.1,0-0.2,0
		c-0.9,0.2-1.8,0.4-2.6,0.7c-0.2,0.1-0.4,0.1-0.7,0.2c-0.8,0.2-1.7,0.5-2.5,0.8h-0.1c-0.9,0.3-1.7,0.6-2.6,0.9
		c-0.2,0.1-0.4,0.2-0.6,0.3c-0.8,0.3-1.7,0.7-2.5,1c0,0,0,0-0.1,0c-0.8,0.4-1.7,0.8-2.5,1.2c-0.2,0.1-0.4,0.2-0.6,0.3
		c-0.8,0.4-1.6,0.9-2.4,1.3c-0.8,0.5-1.7,1-2.5,1.5c-0.2,0.1-0.4,0.2-0.5,0.4c-0.8,0.5-1.6,1-2.3,1.6c-0.1,0.1-0.2,0.2-0.3,0.2
		c-0.7,0.5-1.4,1-2,1.6c-0.2,0.1-0.3,0.2-0.5,0.4c-0.7,0.6-1.4,1.2-2.1,1.8c-0.1,0.1-0.3,0.3-0.4,0.4c-0.6,0.6-1.2,1.2-1.9,1.7
		c-0.1,0.1-0.2,0.2-0.3,0.3c-0.5,0.5-0.9,0.9-1.3,1.4c-1.2-0.3-2.5-0.5-3.8-0.5c-1.9,0-3.8,0.4-5.5,1.1c-0.6-0.7-1.2-1.3-1.9-2
		c-0.1-0.1-0.2-0.2-0.3-0.3c-0.6-0.6-1.2-1.2-1.9-1.8c-0.1-0.1-0.3-0.3-0.4-0.4c-0.7-0.6-1.4-1.2-2.1-1.8c-0.2-0.1-0.3-0.2-0.5-0.4
		c-0.7-0.5-1.4-1.1-2-1.6c-0.1-0.1-0.2-0.2-0.3-0.2c-0.8-0.6-1.5-1.1-2.3-1.6c-0.2-0.1-0.4-0.2-0.5-0.4c-0.8-0.5-1.6-1-2.5-1.5
		C109,43.8,108.1,43.4,107.3,43L107.3,43z M80.9,44.9h0.2c0.9,0,1.9,0.1,2.8,0.2h0.4c0.9,0.1,1.9,0.2,2.8,0.4h0.2
		c1,0.2,1.9,0.4,2.8,0.6h0.2c0.9,0.2,1.9,0.5,2.8,0.7c0.1,0,0.3,0.1,0.4,0.1c0.9,0.3,1.8,0.6,2.7,0.9c0.2,0.1,0.3,0.1,0.5,0.2
		c0.9,0.3,1.7,0.7,2.6,1c0.1,0.1,0.3,0.1,0.4,0.2c0.9,0.4,1.7,0.8,2.6,1.2c0.1,0,0.2,0.1,0.3,0.2c0.9,0.4,1.8,0.9,2.6,1.4
		c0.9,0.5,1.8,1.1,2.7,1.7c0.3,0.2,0.5,0.3,0.8,0.5c0.7,0.5,1.3,0.9,2,1.4c0.2,0.2,0.5,0.3,0.7,0.5c0.8,0.6,1.6,1.3,2.4,2
		c0.1,0.1,0.2,0.2,0.3,0.3c0.7,0.6,1.3,1.2,2,1.9c0.2,0.2,0.4,0.4,0.7,0.7c0.6,0.6,1.1,1.2,1.7,1.8c0.2,0.2,0.3,0.4,0.5,0.6
		c0.6,0.7,1.2,1.5,1.8,2.2c-16.6,2.2-31.7,10.9-41.9,24.2c0-0.1-0.1-0.2-0.1-0.3c-0.2-0.6-0.5-1.2-0.7-1.8c-0.1-0.2-0.1-0.3-0.2-0.5
		c-0.2-0.7-0.5-1.4-0.7-2.2c0-0.1-0.1-0.3-0.1-0.4c-0.2-0.6-0.3-1.2-0.5-1.9c0-0.2-0.1-0.4-0.1-0.5c-0.2-0.7-0.3-1.5-0.5-2.2
		c0-0.1,0-0.2-0.1-0.3c-0.1-0.7-0.2-1.3-0.3-2c0-0.2-0.1-0.4-0.1-0.6c-0.1-0.8-0.2-1.5-0.3-2.3c0-0.1,0-0.1,0-0.2
		c-0.1-0.7-0.1-1.4-0.2-2.1c0-0.2,0-0.4,0-0.6c0-0.8-0.1-1.5-0.1-2.3c0-1,0-2,0.1-3c0-0.1,0-0.2,0-0.3c0.1-0.9,0.1-1.9,0.3-2.8
		c0-0.2,0-0.3,0.1-0.5c0.1-0.9,0.3-1.8,0.4-2.7c0-0.2,0.1-0.3,0.1-0.5c0.2-0.9,0.4-1.8,0.6-2.7c0-0.1,0.1-0.3,0.1-0.4
		c0.2-0.9,0.5-1.9,0.8-2.8c0-0.1,0-0.1,0.1-0.2c0.3-0.9,0.6-1.8,0.9-2.8c0-0.1,0.1-0.1,0.1-0.2c0.3-0.9,0.7-1.8,1.1-2.7
		c0.1-0.1,0.1-0.3,0.2-0.4c0.4-0.8,0.8-1.7,1.2-2.5C80.9,45.1,80.9,45,80.9,44.9z M31.6,71.8c8.3-14.4,22.9-24.1,39.2-26.4
		c-0.4,0.8-0.7,1.7-1,2.6c-0.1,0.2-0.2,0.4-0.2,0.6c-0.3,0.8-0.6,1.6-0.8,2.5c0,0.1,0,0.1-0.1,0.2c-0.3,0.9-0.5,1.8-0.7,2.6
		c-0.1,0.2-0.1,0.4-0.2,0.7c-0.2,0.9-0.4,1.7-0.6,2.6v0.1C67,58.1,66.9,59,66.7,60c0,0.2-0.1,0.4-0.1,0.7c-0.1,0.9-0.2,1.8-0.3,2.7
		v0.1c-0.1,0.9-0.2,1.8-0.2,2.8V67c0,0.9-0.1,1.8-0.1,2.8s0,1.9,0.1,2.9v0.6c0.1,0.9,0.1,1.9,0.2,2.8v0.4c0.1,0.9,0.2,1.7,0.3,2.5
		c0,0.2,0.1,0.4,0.1,0.6c0.1,0.9,0.3,1.8,0.5,2.8c0,0.2,0.1,0.4,0.1,0.6c0.2,0.8,0.4,1.6,0.6,2.5c0,0.1,0.1,0.3,0.1,0.4
		c0.2,0.9,0.5,1.8,0.8,2.7c0,0.1,0.1,0.2,0.1,0.3c-1.9,1.9-3.2,4.3-3.8,7c-0.2,0-0.4,0.1-0.6,0.1c-0.9,0.2-1.8,0.4-2.7,0.7
		c-0.1,0-0.3,0.1-0.4,0.1c-0.8,0.2-1.6,0.5-2.4,0.7c-0.2,0.1-0.4,0.1-0.5,0.2c-0.9,0.3-1.8,0.6-2.6,0.9c-0.2,0.1-0.4,0.1-0.5,0.2
		c-0.8,0.3-1.6,0.6-2.4,1c-0.1,0.1-0.2,0.1-0.4,0.2c-0.9,0.4-1.7,0.8-2.6,1.2c-0.2,0.1-0.4,0.2-0.6,0.3c-0.9,0.4-1.7,0.9-2.5,1.4
		s-1.6,0.9-2.4,1.4c-0.2,0.1-0.4,0.2-0.6,0.4c-0.8,0.5-1.5,1-2.3,1.6c0,0,0,0-0.1,0c-0.7,0.5-1.4,1.1-2.1,1.6
		c-0.2,0.1-0.4,0.3-0.5,0.4c-0.7,0.6-1.4,1.2-2.1,1.8l-0.1,0.1c-0.7,0.6-1.3,1.2-1.9,1.8c-0.2,0.2-0.3,0.3-0.5,0.5
		c-0.7,0.6-1.3,1.3-1.9,2l-0.1,0.1c-0.6,0.6-1.2,1.3-1.7,1.9c-0.1,0.2-0.3,0.3-0.4,0.5c-0.6,0.7-1.2,1.4-1.7,2.1
		C22.2,103.7,23.3,86.3,31.6,71.8z M31.6,184.2c-8.3-14.4-9.4-31.9-3.3-47.2c0.6,0.7,1.1,1.4,1.7,2.1c0.1,0.2,0.3,0.4,0.4,0.5
		c0.6,0.7,1.1,1.3,1.7,1.9l0.1,0.1c0.6,0.7,1.3,1.3,1.9,2c0.2,0.2,0.3,0.3,0.5,0.5c0.6,0.6,1.3,1.2,1.9,1.8l0.1,0.1l2.1,1.8
		c0.2,0.1,0.4,0.3,0.5,0.4c0.7,0.6,1.4,1.1,2.1,1.6h0.1c0.7,0.5,1.5,1.1,2.3,1.6c0.2,0.1,0.4,0.2,0.6,0.4c0.8,0.5,1.6,1,2.4,1.4
		c0.8,0.5,1.7,0.9,2.5,1.4c0.2,0.1,0.4,0.2,0.6,0.3c0.8,0.4,1.7,0.8,2.6,1.2c0.1,0.1,0.2,0.1,0.4,0.2c0.8,0.3,1.6,0.7,2.4,1
		c0.2,0.1,0.4,0.1,0.5,0.2c0.9,0.3,1.8,0.7,2.6,0.9c0.2,0.1,0.4,0.1,0.5,0.2c0.8,0.3,1.6,0.5,2.5,0.7c0.1,0,0.3,0.1,0.4,0.1
		c0.9,0.2,1.8,0.5,2.7,0.7c0.2,0,0.4,0.1,0.6,0.1c0.6,2.7,1.9,5.2,3.8,7.1c0,0.1,0,0.1-0.1,0.2c-0.3,0.9-0.5,1.8-0.8,2.7
		c0,0.1-0.1,0.3-0.1,0.4c-0.2,0.8-0.4,1.7-0.6,2.5c0,0.2-0.1,0.4-0.1,0.6c-0.2,0.9-0.4,1.8-0.5,2.8c0,0.2-0.1,0.4-0.1,0.6
		c-0.1,0.8-0.2,1.7-0.3,2.6v0.4c-0.1,0.9-0.2,1.9-0.2,2.8v0.6c0,1-0.1,1.9-0.1,2.9c0,0.9,0,1.8,0.1,2.8v0.7c0.1,0.9,0.1,1.8,0.2,2.7
		v0.1c0.1,0.9,0.2,1.8,0.3,2.7c0,0.2,0.1,0.4,0.1,0.7c0.1,0.9,0.3,1.8,0.5,2.7v0.1c0.2,0.9,0.4,1.7,0.6,2.6c0.1,0.2,0.1,0.4,0.2,0.7
		c0.2,0.9,0.5,1.8,0.7,2.6c0,0.1,0,0.1,0.1,0.2c0.3,0.8,0.5,1.7,0.8,2.5c0.1,0.2,0.1,0.4,0.2,0.6c0.3,0.9,0.6,1.7,1,2.6
		C54.5,208.3,39.9,198.6,31.6,184.2L31.6,184.2z M80.8,210.9c-0.4-0.8-0.8-1.7-1.2-2.5c-0.1-0.1-0.1-0.3-0.2-0.4
		c-0.4-0.9-0.7-1.8-1.1-2.7c0-0.1-0.1-0.1-0.1-0.2c-0.3-0.9-0.6-1.8-0.9-2.8c0-0.1,0-0.1-0.1-0.2c-0.3-0.9-0.5-1.9-0.8-2.8
		c0-0.1-0.1-0.3-0.1-0.4c-0.2-0.9-0.4-1.8-0.6-2.7c0-0.2-0.1-0.3-0.1-0.5c-0.2-0.9-0.3-1.8-0.4-2.7c0-0.2,0-0.3-0.1-0.5
		c-0.1-0.9-0.2-1.9-0.3-2.8c0-0.1,0-0.2,0-0.3c-0.1-1-0.1-2-0.1-3c0-0.8,0-1.5,0.1-2.3c0-0.2,0-0.4,0-0.6c0-0.7,0.1-1.4,0.2-2.1
		c0-0.1,0-0.1,0-0.2c0.1-0.8,0.2-1.5,0.3-2.3c0-0.2,0.1-0.4,0.1-0.6c0.1-0.7,0.2-1.3,0.3-2c0-0.1,0-0.2,0.1-0.3
		c0.1-0.7,0.3-1.5,0.5-2.2c0-0.2,0.1-0.4,0.1-0.6c0.2-0.6,0.3-1.2,0.5-1.9c0-0.1,0.1-0.3,0.1-0.4c0.2-0.7,0.4-1.4,0.7-2.2
		c0.1-0.2,0.1-0.3,0.2-0.5c0.2-0.6,0.4-1.2,0.7-1.8c0-0.1,0.1-0.2,0.1-0.3c10.2,13.3,25.3,22,41.9,24.2c-0.6,0.8-1.2,1.5-1.8,2.2
		c-0.2,0.2-0.3,0.4-0.5,0.6c-0.5,0.6-1.1,1.2-1.7,1.8c-0.2,0.2-0.4,0.4-0.7,0.7c-0.6,0.6-1.3,1.3-2,1.9c-0.1,0.1-0.2,0.2-0.3,0.3
		c-0.8,0.7-1.6,1.4-2.4,2c-0.2,0.2-0.5,0.3-0.7,0.5c-0.6,0.5-1.3,1-2,1.4c-0.3,0.2-0.5,0.3-0.8,0.5c-0.9,0.6-1.8,1.1-2.7,1.7
		c-0.9,0.5-1.7,1-2.6,1.4c-0.1,0.1-0.2,0.1-0.3,0.2c-0.8,0.4-1.7,0.8-2.6,1.2c-0.1,0.1-0.3,0.1-0.4,0.2c-0.8,0.4-1.7,0.7-2.6,1
		c-0.2,0.1-0.3,0.1-0.5,0.2c-0.9,0.3-1.8,0.6-2.6,0.9c-0.1,0-0.3,0.1-0.4,0.1c-0.9,0.3-1.9,0.5-2.8,0.7c-0.1,0-0.1,0-0.2,0
		c-0.9,0.2-1.9,0.4-2.8,0.6c-0.1,0-0.2,0-0.2,0c-0.9,0.2-1.9,0.3-2.8,0.4c-0.1,0-0.3,0-0.4,0c-0.9,0.1-1.9,0.2-2.8,0.2
		C80.9,211,80.8,211,80.8,210.9C80.9,211,80.9,210.9,80.8,210.9L80.8,210.9z M107.3,213c0.8-0.4,1.6-0.9,2.4-1.3
		c0.8-0.5,1.7-1,2.5-1.5c0.2-0.1,0.4-0.2,0.5-0.4c0.8-0.5,1.6-1,2.3-1.6c0.1-0.1,0.2-0.2,0.3-0.2c0.7-0.5,1.4-1,2-1.6
		c0.2-0.1,0.3-0.2,0.5-0.4l2.1-1.8c0.1-0.1,0.3-0.3,0.4-0.4c0.6-0.6,1.2-1.2,1.9-1.7l0.1-0.1c2.2,1.3,4.8,2.1,7.6,2.1
		c2.2,0,4.3-0.5,6.1-1.4l1.1,1.1l0.4,0.4c0.7,0.6,1.4,1.2,2.1,1.8c0.2,0.1,0.3,0.2,0.5,0.4c0.7,0.5,1.3,1,2,1.6
		c0.1,0.1,0.2,0.2,0.3,0.2c0.8,0.6,1.5,1.1,2.3,1.6c0.2,0.1,0.4,0.2,0.6,0.4c0.8,0.5,1.6,1,2.5,1.5c0.8,0.5,1.6,0.9,2.4,1.3
		c0.2,0.1,0.4,0.2,0.6,0.3c0.8,0.4,1.7,0.8,2.5,1.2s1.7,0.7,2.5,1.1c0.2,0.1,0.4,0.2,0.6,0.2c0.9,0.3,1.7,0.7,2.6,0.9h0.1
		c0.8,0.3,1.7,0.5,2.5,0.8c0.2,0.1,0.4,0.1,0.6,0.2c0.9,0.2,1.8,0.5,2.7,0.7h0.2c0.8,0.2,1.7,0.4,2.6,0.5c0.2,0,0.4,0.1,0.7,0.1
		c0.9,0.2,1.8,0.3,2.7,0.4c-10.1,13-25.8,20.8-42.5,20.8s-32.4-7.8-42.5-20.8h0.1c0.9-0.1,1.8-0.3,2.7-0.4c0.2,0,0.4-0.1,0.7-0.1
		c0.8-0.2,1.7-0.3,2.5-0.5h0.2c0.9-0.2,1.8-0.4,2.7-0.7c0.2-0.1,0.4-0.1,0.6-0.2c0.8-0.2,1.7-0.5,2.5-0.8h0.1
		c0.9-0.3,1.7-0.6,2.6-0.9c0.2-0.1,0.4-0.2,0.6-0.2c0.8-0.3,1.7-0.7,2.5-1.1c0.8-0.4,1.7-0.8,2.5-1.2
		C106.9,213.2,107.1,213.1,107.3,213L107.3,213z"/>
</g>
<g>
	
		<linearGradient id="SVGID_2_" gradientUnits="userSpaceOnUse" x1="72.2074" y1="740.545" x2="179.8139" y2="740.545" gradientTransform="matrix(0.5768 0.8169 0.8169 -0.5768 -548.6739 452.0937)">
		<stop  offset="0" style="stop-color:#16FDC4"/>
		<stop  offset="1" style="stop-color:#02A5F9"/>
	</linearGradient>
	<circle class="st2" cx="128.9" cy="127.8" r="53.9"/>
	<path class="st1" d="M145.9,109.6c-2.8-6.2-8.8-7.4-16.5-6.2l-2.6-9.4l-5.7,1.4l2.3,9.4c-1.4,0.3-3.1,0.9-4.5,1.1l-2.3-9.4L111,98
		l2.6,9.4c-1.1,0.3-11.6,3.1-11.6,3.1l1.7,6.2l4.3-1.1c2.3-0.6,3.4,0.6,4,1.7l6.8,26.1c0,0.9,0,2-1.7,2.6l-4.3,1.1l0.6,7.1
		c0,0,10.2-2.6,11.6-2.8l2.6,9.6l5.7-1.4l-2.6-9.6c1.7-0.3,3.1-0.9,4.5-1.1l2.6,9.6l5.7-1.4l-2.6-9.6c8.8-2.3,15-7.7,13.9-16.5
		c-0.9-5.1-6.5-9.4-11.1-9.9C146.2,118.4,147.6,114.8,145.9,109.6z M143.1,132.3c1.1,8.5-10.5,9.6-14.5,10.5l-3.4-12.5
		C128.9,129.2,141.1,125,143.1,132.3z M136,115c1.1,7.7-8.8,8.5-12.2,9.4l-3.1-11.6C124.1,111.9,133.4,108.2,136,115z"/>
</g>
</svg>
