[
    {
        "id": "0f32243e-51c7-4b25-a890-b09a0705859c",
        "title": "Bitcoin Cash Node",
        "iconUrl": "https://i.imgur.com/vkrLrfD.png",
        "pif": {
            "balance": 13370,
            "burn": ""
        },
        "satoshis": 1234567890,
        "donation": {
            "bch": "bitcoincash:prnc2exht3zxlrqqcat690tc85cvfuypngh7szx6mk"
        },
        "verify": "https://bitcoincashnode.org"
    },
    {
        "title": "Electron Cash",
        "iconUrl": "https://i.imgur.com/1XSz8dC.png",
        "pif": {
            "balance": 500,
            "burn": ""
        },
        "satoshis": 1234567890,
        "donation": {
            "bch": "bitcoincash:qz4wq9m860zr5p2nfdpttm5ymdqdyt3psc95qjagae"
        },
        "verify": "https://electroncash.org"
    },
    {
        "title": "Cash DevOps",
        "iconUrl": "https://devops.cash/img/icon.fdff6fec.png",
        "pif": {
            "balance": 500,
            "burn": ""
        },
        "satoshis": 1234567890,
        "donation": {
            "bch": "bitcoincash:qrlsrw8qyrce75pp654rx9s8hftgywkxwv89uwafs3"
        },
        "verify": "https://devops.cash"
    },
    {
        "title": "Fountainhead Cash",
        "iconUrl": "https://i.imgur.com/fnuLphA.png",
        "pif": {
            "balance": 500,
            "burn": ""
        },
        "satoshis": 1234567890,
        "donation": {
            "bch": "bitcoincash:qpygaungmfry8xzxphj4pw24kk5l9vfxlyhy0z36al"
        },
        "verify": "https://fountainhead.cash"
    },
    {
        "title": "Fulcrum",
        "iconUrl": "https://i.imgur.com/KeTMKcN.png",
        "pif": {
            "balance": 500,
            "burn": ""
        },
        "satoshis": 1234567890,
        "donation": {
            "bch": "bitcoincash:qphax4s4n9h60jxj2fkrjs35w2tvgd4wzvf52cgtzc"
        },
        "verify": "https://github.com/cculianu/Fulcrum"
    },
    {
        "title": "FullStack.Cash",
        "iconUrl": "https://i.imgur.com/uINFzPv.png",
        "pif": {
            "balance": 500,
            "burn": ""
        },
        "satoshis": 1234567890,
        "donation": {
            "bch": "bitcoincash:qpyu35q0ylvjjaex889phzl94taka68dsurxy6ln8u"
        },
        "verify": "https://psfoundation.cash/grants"
    },
    {
        "title": "Mark Lundeberg",
        "iconUrl": "https://i.imgur.com/6JdBd3H.png",
        "pif": {
            "balance": 500,
            "burn": ""
        },
        "satoshis": 1234567890,
        "donation": {
            "bch": "bitcoincash:qqy9myvyt7qffgye5a2mn2vn8ry95qm6asy40ptgx2"
        },
        "verify": "https://archive.is/2a1WI"
    },
    {
        "title": "Jonathan Toomim",
        "iconUrl": "https://i.imgur.com/1ZOiv57.png",
        "pif": {
            "balance": 500,
            "burn": ""
        },
        "satoshis": 1234567890,
        "donation": {
            "bch": "bitcoincash:qz6r05awt57h7cw50kwtv0lzxr2em2tjrvjgksmjru"
        },
        "verify": "https://flipstarter.toom.im"
    },
    {
        "title": "NitoJS Library & SDK",
        "iconUrl": "https://i.imgur.com/09xCklN.png",
        "pif": {
            "balance": 500,
            "burn": ""
        },
        "satoshis": 1234567890,
        "donation": {
            "bch": "bitcoincash:qq638hdce3q0pg370hfee7f7sgxkw6j46c9cw9sqer"
        },
        "verify": "https://nitojs.org/"
    },
    {
        "title": "mainnet.cash",
        "iconUrl": "https://i.imgur.com/qdmuxeq.png",
        "pif": {
            "balance": 500,
            "burn": ""
        },
        "satoshis": 1234567890,
        "donation": {
            "bch": "bitcoincash:qqgae2xl2rx7zwg4nuwv645u9pfkydrp45cy0wqfx6"
        },
        "verify": "https://flipstarter.mainnet.cash/"
    },
    {
        "title": "libauth",
        "iconUrl": "https://i.imgur.com/6C8fJvq.png",
        "pif": {
            "balance": 500,
            "burn": ""
        },
        "satoshis": 1234567890,
        "donation": {
            "bch": ""
        },
        "verify": "https://github.com/bitauth/libauth"
    },
    {
        "title": "bitcoincashj",
        "iconUrl": "https://i.imgur.com/qDSTMYV.png",
        "pif": {
            "balance": 500,
            "burn": ""
        },
        "satoshis": 1234567890,
        "donation": {
            "bch": "bitcoincash:qptnypuugy29lttleggl7l0vpls0vg295q9nsavw6g"
        },
        "verify": "https://github.com/pokkst/bitcoincashj"
    },
    {
        "title": "Flowee",
        "iconUrl": "https://i.imgur.com/bjUSsIk.png",
        "pif": {
            "balance": 500,
            "burn": ""
        },
        "satoshis": 1234567890,
        "donation": {
            "bch": "bitcoincash:qpgn5ka4jptc98a9ftycvujxx33e79nxuqlz5mvxns"
        },
        "verify": "https://flowee.org/donations/"
    },
    {
        "title": "Naomi Brockwell TV",
        "iconUrl": "https://i.imgur.com/gzDP0HX.png",
        "pif": {
            "balance": 500,
            "burn": ""
        },
        "satoshis": 1234567890,
        "donation": {
            "bch": "bitcoincash:qqepr98dtd7r0hlf05hed2j3h7t5ufjj25afrxx427"
        },
        "verify": "https://cointr.ee/naomibrockwell"
    },
    {
        "title": "Member.cash",
        "iconUrl": "https://i.imgur.com/qaTWrdd.png",
        "pif": {
            "balance": 500,
            "burn": ""
        },
        "satoshis": 1234567890,
        "donation": {
            "bch": "bitcoincash:qqlx98vrupdm9gmnenwpcgy2yv4hfzktwv6raa4n3g"
        },
        "verify": "https://flipstarter.member.cash/"
    },
    {
        "title": "Causes Cash",
        "iconUrl": "https://i.imgur.com/nLsdK3V.png",
        "pif": {
            "balance": 500,
            "burn": ""
        },
        "satoshis": 1234567890,
        "donation": {
            "bch": " bitcoincash:qrz4zlgjsqu0gu9xaayrrrlrttyv85xxzslp43veu6"
        },
        "verify": "https://causes.cash"
    },
    {
        "title": "Bitcoin Unlimited",
        "iconUrl": "https://i.imgur.com/Qt5dVWa.png",
        "pif": {
            "balance": 500,
            "burn": ""
        },
        "satoshis": 1234567890,
        "donation": {
            "bch": "bitcoincash:pq6snv5fcx2fp6dlzg7s0m9zs8yqh74335tzvvfcmq"
        },
        "verify": "https://www.bitcoinunlimited.info/donate"
    },
    {
        "title": "BCHD",
        "iconUrl": "https://i.imgur.com/1EEkagI.png",
        "pif": {
            "balance": 500,
            "burn": ""
        },
        "satoshis": 1234567890,
        "donation": {
            "bch": "bitcoincash:qp0sg3l642sy0gxs6hcm4thlcxq6ff6t6glpd0t6fv"
        },
        "verify": "https://bchd.flipstarter.cash/"
    },
    {
        "title": "Bitcoin Verde Node Development",
        "iconUrl": "https://i.imgur.com/R4fSJkG.png",
        "pif": {
            "balance": 500,
            "burn": ""
        },
        "satoshis": 1234567890,
        "donation": {
            "bch": "bitcoincash:qzv24tpyx0fxdz6q00estl5drhuu87cqysphmq8spt"
        },
        "verify": "https://donate.bitcoinverde.org/"
    },
    {
        "title": "Knuth Platform Development",
        "iconUrl": "https://i.imgur.com/bS1kMPR.png",
        "pif": {
            "balance": 500,
            "burn": ""
        },
        "satoshis": 1234567890,
        "donation": {
            "bch": "bitcoincash:qrlgfg2qkj3na2x9k7frvcmv06ljx5xlnuuwx95zfn"
        },
        "verify": "https://fund.kth.cash/"
    },
    {
        "title": "Crescent Cash",
        "iconUrl": "https://i.imgur.com/wLDeoWJ.png",
        "pif": {
            "balance": 100,
            "burn": ""
        },
        "satoshis": 1234567890,
        "donation": {
            "bch": "bitcoincash:qptnypuugy29lttleggl7l0vpls0vg295q9nsavw6g"
        },
        "verify": "https://github.com/pokkst/bitcoincashj"
    },
    {
        "title": "Cash Accounts",
        "iconUrl": "https://i.imgur.com/LUyS1iV.png",
        "pif": {
            "balance": 100,
            "burn": ""
        },
        "satoshis": 1234567890,
        "donation": {
            "bch": "bitcoincash:qr4aadjrpu73d2wxwkxkcrt6gqxgu6a7usxfm96fst"
        },
        "verify": "https://www.cashaccount.info"
    },
    {
        "title": "ElectrsCash - Electrum Server in Rust",
        "iconUrl": "https://i.imgur.com/ZSewFAE.png",
        "pif": {
            "balance": 100,
            "burn": ""
        },
        "satoshis": 1234567890,
        "donation": {
            "bch": ""
        },
        "verify": "https://github.com/BitcoinUnlimited/ElectrsCash"
    },
    {
        "title": "Cultura BCH Ryver Venezuela Organic Education and Adoption",
        "iconUrl": "https://i.imgur.com/QhFc0TV.png",
        "pif": {
            "balance": 100,
            "burn": ""
        },
        "satoshis": 1234567890,
        "donation": {
            "bch": "bitcoincash:qqqkau3r3ken5wqwsj3dc23pmnk0aeu7hq60ld2ujt"
        },
        "verify": "http://flipstarter.ryver.site/"
    },
    {
        "title": "eatBCH",
        "iconUrl": "https://i.imgur.com/mxOwx4Q.png",
        "pif": {
            "balance": 100,
            "burn": ""
        },
        "satoshis": 1234567890,
        "donation": {
            "bch": "bitcoincash:pp8skudq3x5hzw8ew7vzsw8tn4k8wxsqsv0lt0mf3g"
        },
        "verify": "https://twitter.com/EatBCH"
    },
    {
        "title": "Venezuela Workers",
        "iconUrl": "https://i.imgur.com/AKOOTa7.png",
        "pif": {
            "balance": 100,
            "burn": ""
        },
        "satoshis": 1234567890,
        "donation": {
            "bch": "bitcoincash:qrr62nk9jvnjja2355d6ln03nkj6e334sysdmjzzl0"
        },
        "verify": "https://flipstarter.venezuelaworkers.net/"
    },
    {
        "title": "Coin Dance",
        "iconUrl": "https://i.imgur.com/2cgpEok.png",
        "pif": {
            "balance": 100,
            "burn": ""
        },
        "satoshis": 1234567890,
        "donation": {
            "bch": "bitcoincash:qzqh7ej3rdrw6r32guzdg0x4a275hqwjkgtmjazc64"
        },
        "verify": "https://cash.coin.dance/"
    },
    {
        "title": "Build.Cash",
        "iconUrl": "https://i.imgur.com/2xbbrSu.png",
        "pif": {
            "balance": 100,
            "burn": ""
        },
        "satoshis": 1234567890,
        "donation": {
            "bch": "bitcoincash:qzckpuqaku2qlrk2euqj6jwgtv87h02a0c0sasf5js"
        },
        "verify": "https://flipstarter.build.cash/"
    },
    {
        "title": "The Sphere",
        "iconUrl": "https://i.imgur.com/wmX21Ns.png",
        "pif": {
            "balance": 50,
            "burn": ""
        },
        "satoshis": 1234567890,
        "donation": {
            "bch": "bitcoincash:qphd6s5hwa9wx8ptyd3vnes5rg7lw97nlgurnz5w5a"
        },
        "verify": "https://flipstarter.enter-the-sphere.com/"
    },
    {
        "title": "Bitcoin Cash House Venezuela",
        "iconUrl": "https://i.imgur.com/TIilsPs.png",
        "satoshis": 1234567890,
        "donation": {
            "bch": ""
        },
        "verify": ""
    },
    {
        "title": "Alternative Fullnode Implementation written in Javascript",
        "iconUrl": "https://i.imgur.com/rcb7ZIZ.png",
        "satoshis": 1234567890,
        "donation": {
            "bch": "bitcoincash:qz0vmcpa0kulwqhh9x8yja6ewyls7mu3jclyhtmnun"
        },
        "verify": "http://flipstarter.cashfullnode.com/"
    },
    {
        "title": "Satoshi’s Angels",
        "iconUrl": "https://i.imgur.com/VuY030o.png",
        "satoshis": 1234567890,
        "donation": {
            "bch": "bitcoincash:pq3ptaz2m656y7fa807m533wdyzmq7xta5mygmfe5t"
        },
        "verify": "https://flipstarter.satoshisangels.com/"
    },
    {
        "title": "BitcoinCash.site",
        "iconUrl": "https://i.imgur.com/jeID3bX.png",
        "satoshis": 1234567890,
        "donation": {
            "bch": "bitcoincash:qz3pxmwda8gd42wa8k9yfxcwhcaapeuhygjc8mc4m8"
        },
        "verify": "https://flipstarter.bitcoincash.site/"
    },
    {
        "title": "Satochip.io",
        "iconUrl": "https://i.imgur.com/zftfUcd.png",
        "satoshis": 1234567890,
        "donation": {
            "bch": "bitcoincash:qzdztu5tv89tv82z5htedza39cswftt7kum70ht6nd"
        },
        "verify": "http://flipstarter.satochip.io/"
    },
    {
        "title": "Bitcoin Cash in Brazil",
        "iconUrl": "https://i.imgur.com/5HCC4aP.png",
        "satoshis": 1234567890,
        "donation": {
            "bch": "bitcoincash:qz8027fxnkad33tvyp0c874m3dwy37e02gtwr4n75z"
        },
        "verify": "http://209.97.152.182/"
    },
    {
        "title": "Collin Enstad",
        "iconUrl": "https://i.imgur.com/MXcaC7r.png",
        "pif": {
            "balance": 100,
            "burn": ""
        },
        "satoshis": 1234567890,
        "donation": {
            "bch": "bitcoincash:qq78ewva4a6unvup9jruw33gk3f5ynvupvvk2ytx93"
        },
        "verify": "https://www.youtube.com/channel/UCGKUQoz7AzGxziNqHFS_2Rg"
    },
    {
        "title": "BitcoinMan of Bakersfield",
        "iconUrl": "https://i.imgur.com/24lQjEG.png",
        "satoshis": 1234567890,
        "donation": {
            "bch": "bitcoincash:qzlleks7qlhd57p6ca8mk89tf4z0x5fwjsr02mtv6f"
        },
        "verify": "https://bitcoinman.cash/"
    },
    {
        "title": "Blockhack Global",
        "iconUrl": "https://i.imgur.com/VKIVP0V.png",
        "satoshis": 1234567890,
        "donation": {
            "bch": "bitcoincash:qzn9jr9cjv6ytt2rm32yjtv5yht7nvc6p54tfncvf9"
        },
        "verify": "http://flipstarter.blockhack.ca/"
    },
    {
        "title": "SOUR SLP Token",
        "iconUrl": "https://i.imgur.com/V4Xdrsi.png",
        "satoshis": 1234567890,
        "donation": {
            "bch": "bitcoincash:qzlq5chhphjzu3gl6qs4fx4sgevv0cqfzysr8l32rr"
        },
        "verify": "https://keepbitcoinfree.org/SOUR/"
    },
    {
        "title": "MAZE SLP Token",
        "iconUrl": "https://i.imgur.com/VXZBIKk.png",
        "satoshis": 1234567890,
        "donation": {
            "bch": "bitcoincash:qpy96csk94ga3ayk44jk9marwlup9tg8ku08sjed75"
        },
        "verify": "https://mazetoken.github.io/"
    },
    {
        "title": "dSLP Token",
        "iconUrl": "https://i.imgur.com/54s44vn.png",
        "satoshis": 1234567890,
        "donation": {
            "bch": "bitcoincash:qzu270l04j8tw9cd0smawuanplvugu74ysjeu4cxq3"
        },
        "verify": "https://memo.cash/profile/1HqXGs3zXC79hbJDn9oJaCuKLH4BMsGV4m"
    },
    {
        "title": "BCH DevCon",
        "iconUrl": "https://i.imgur.com/Alizhaz.png",
        "satoshis": 1234567890,
        "donation": {
            "bch": "bitcoincash:pr508v7nem4z67u82rh5qqtpcctzkw6gfvdyvk6ag2"
        },
        "verify": "https://flipstarter.devcon.cash/"
    },
    {
        "title": "Coins 4 Clothes",
        "iconUrl": "https://i.imgur.com/h4uwXtb.png",
        "satoshis": 1234567890,
        "donation": {
            "bch": "bitcoincash:qzx4tqcldmvs4up9mewkf3ru0z6vy9wm6qm782fwla"
        },
        "verify": "https://www.coins4clothes.com/"
    },
    {
        "title": "Spedn",
        "iconUrl": "https://i.imgur.com/kEmrGHO.png",
        "satoshis": 1234567890,
        "donation": {
            "bch": "bitcoincash:qrc2jhalczuka8q3dvk0g8mnkqx79wxp9gvvqvg7qt"
        },
        "verify": "https://bitbucket.org/o-studio/spedn/src/develop/"
    },
    {
        "title": "Bitcoin Cash Telegram Tipping Bot",
        "iconUrl": "https://i.imgur.com/VdVLM00.png",
        "satoshis": 1234567890,
        "donation": {
            "bch": "bitcoincash:qqtlujldtcc65dts087luzuq77s0m5xxsqxyl8scdt"
        },
        "verify": "https://github.com/merc1er/bchtipbot"
    },
    {
        "title": "CashShuffle",
        "iconUrl": "https://i.imgur.com/osf7dCg.png",
        "pif": {
            "balance": 100,
            "burn": ""
        },
        "satoshis": 1234567890,
        "donation": {
            "bch": "bitcoincash:qqqxxmjyavdkwdj6npa5w6xl0fzq3wc5furaqdpl59"
        },
        "verify": "https://cashshuffle.com/"
    },
    {
        "title": "member.cash",
        "iconUrl": "https://i.imgur.com/8GhcBbO.png",
        "pif": {
            "balance": 100,
            "burn": ""
        },
        "satoshis": 1234567890,
        "donation": {
            "bch": "bitcoincash:qqlx98vrupdm9gmnenwpcgy2yv4hfzktwv6raa4n3g"
        },
        "verify": "http://flipstarter.member.cash/"
    },
    {
        "title": "Cash Address",
        "iconUrl": "https://i.imgur.com/4cBvQWL.png",
        "pif": {
            "balance": 100,
            "burn": ""
        },
        "satoshis": 1234567890,
        "donation": {
            "bch": "bitcoincash:qp4atx0z6h6atuzchuaqssnkdqag95ecdqtt5nx8z8"
        },
        "verify": "https://cashaddress.org/"
    },
    {
        "title": "HoneyPay",
        "iconUrl": "https://i.imgur.com/RCrUeQS.png",
        "pif": {
            "balance": 100,
            "burn": ""
        },
        "satoshis": 1234567890,
        "donation": {
            "bch": "bitcoincash:qq0ezhrh4586jcn4l3znpnlce2etevmck5kynh28z3"
        },
        "verify": "https://www.hp.cash/donate"
    },
    {
        "title": "Colin Talks Crypto",
        "iconUrl": "https://i.imgur.com/x4FlR34.png",
        "pif": {
            "balance": 100,
            "burn": ""
        },
        "satoshis": 1234567890,
        "donation": {
            "bch": "bitcoincash:qpzc3apy9s8x2qtlqxxgnalfxtzgnkg5nq352w9k2t"
        },
        "verify": "https://www.colintalkscrypto.com/"
    },
    {
        "title": "BMP: The Bitcoin Mining Parliament",
        "iconUrl": "https://i.imgur.com/5Wgp78D.png",
        "pif": {
            "balance": 100,
            "burn": ""
        },
        "satoshis": 1234567890,
        "donation": {
            "bch": ""
        },
        "verify": ""
    },
    {
        "title": "Tails",
        "iconUrl": "https://i.imgur.com/Ab8iqwj.png",
        "pif": {
            "balance": 100,
            "burn": ""
        },
        "satoshis": 1234567890,
        "donation": {
            "bch": "bitcoincash:qrzav77wkhd942nyqvya34mya3fqxzx90ypjge0njh"
        },
        "verify": "https://tails.boum.org/donate"
    },
    {
        "title": "Linux Mint",
        "iconUrl": "https://i.imgur.com/73L8SFb.png",
        "pif": {
            "balance": 100,
            "burn": ""
        },
        "satoshis": 1234567890,
        "donation": {
            "bch": "bitcoincash:qr2lmzf2qtsw06fekwwn5qj5ytrxcj2xsgtjkt5qk7"
        },
        "verify": "https://www.linuxmint.com/donors.php"
    },
    {
        "title": "Mises Institute",
        "iconUrl": "https://i.imgur.com/rlM8Noo.png",
        "pif": {
            "balance": 100,
            "burn": ""
        },
        "satoshis": 1234567890,
        "donation": {
            "bch": "bitcoincash:qqqm3qaxqyq38ydemw87mgw4ec4dgwvv0ufvtnmj9z"
        },
        "verify": "https://mises.org/giving/bitcoin-and-paypal-gifts"
    },
    {
        "title": "Bitcoin ABC",
        "iconUrl": "https://i.imgur.com/WVAETE6.png",
        "pif": {
            "balance": 100,
            "burn": ""
        },
        "satoshis": 1234567890,
        "donation": {
            "bch": "bitcoincash:qqeht8vnwag20yv8dvtcrd4ujx09fwxwsqqqw93w88"
        },
        "verify": "https://www.bitcoinabc.org"
    },
    {
        "title": "Apache Foundation",
        "iconUrl": "https://i.imgur.com/N1lUJhn.png",
        "pif": {
            "balance": 100,
            "burn": ""
        },
        "satoshis": 1234567890,
        "donation": {
            "bch": "bitcoincash:qrjkkd8hnl2mat0z396dzwm8sha2m6vpey0c3w2ezn"
        },
        "verify": "https://www-eu.apache.org/foundation/contributing.html"
    },
    {
        "title": "VeraCrypt",
        "iconUrl": "https://i.imgur.com/LSMe9NK.png",
        "satoshis": 1234567890,
        "donation": {
            "bch": "bitcoincash:qp5vrqwln247f7l9p98ucj4cqye0cjcyusc94jlpy9"
        },
        "verify": "https://www.veracrypt.fr/en/Donation.html"
    },
    {
        "title": "Karol Trzeszczkowski",
        "iconUrl": "https://i.imgur.com/063V6WV.png",
        "pif": {
            "balance": 100,
            "burn": ""
        },
        "satoshis": 1234567890,
        "donation": {
            "bch": "bitcoincash:qq93dq0j3uez8m995lrkx4a6n48j2fckfuwdaqeej2"
        },
        "verify": "https://github.com/KarolTrzeszczkowski/Mecenas-recurring-payment-EC-plugin"
    },
    {
        "title": "Mitra Labs",
        "iconUrl": "https://i.imgur.com/FE5MzRQ.png",
        "pif": {
            "balance": 100,
            "burn": ""
        },
        "satoshis": 1234567890,
        "donation": {
            "bch": "bitcoincash:qry34j3r9xffzrcvz0a7qnfyqu7z47gupvd4le6ney"
        },
        "verify": ""
    },
    {
        "title": "CryptoWoo Bitcoin Cash Add-on",
        "iconUrl": "https://i.imgur.com/B1DdO6n.png",
        "pif": {
            "balance": 100,
            "burn": ""
        },
        "satoshis": 1234567890,
        "donation": {
            "bch": "bitcoincash:qzhchn3ly6lyumv5u8w0vf5zlg35l4qnk5pu72wedy"
        },
        "verify": "https://github.com/WeProgramIT/cryptowoo-bitcoin-cash-addon"
    },
    {
        "title": "Badger Mobile Wallet",
        "iconUrl": "https://i.imgur.com/QV66m6d.png",
        "pif": {
            "balance": 100,
            "burn": ""
        },
        "satoshis": 1234567890,
        "donation": {
            "bch": ""
        },
        "verify": "https://github.com/Bitcoin-com/badger-mobile"
    },
    {
        "title": "Badger Browser Plugin",
        "iconUrl": "https://i.imgur.com/QV66m6d.png",
        "pif": {
            "balance": 100,
            "burn": ""
        },
        "satoshis": 1234567890,
        "donation": {
            "bch": ""
        },
        "verify": "https://github.com/Bitcoin-com/badger"
    },
    {
        "title": "Gateway Cash",
        "iconUrl": "https://i.imgur.com/zcz44Hq.png",
        "pif": {
            "balance": 100,
            "burn": ""
        },
        "satoshis": 1234567890,
        "donation": {
            "bch": "bitcoincash:pz3txlyql9vc08px98v69a7700g6aecj5gc0q3xhng"
        },
        "verify": "https://github.com/gatewaycash/gateway"
    },
    {
        "title": "GitCash",
        "iconUrl": "https://i.imgur.com/79lONy5.png",
        "pif": {
            "balance": 100,
            "burn": ""
        },
        "satoshis": 1234567890,
        "donation": {
            "bch": "bitcoincash:qrdf9w034w9l7lgu7yt2tem7403paeky2geytpuccn"
        },
        "verify": "https://gitcash.io/"
    },
    {
        "title": "The Future of Bitcoin Cash",
        "iconUrl": "https://i.imgur.com/ciPykWZ.png",
        "pif": {
            "balance": 100,
            "burn": ""
        },
        "satoshis": 1234567890,
        "donation": {
            "bch": "bitcoincash:qrwyeh8r09rgmpcc6adde6l7u0yp9c7wxcc65qck7j"
        },
        "verify": "https://www.thefutureofbitcoin.cash/"
    },
    {
        "title": "TxStreet",
        "iconUrl": "https://i.imgur.com/DHTKFrc.png",
        "pif": {
            "balance": 100,
            "burn": ""
        },
        "satoshis": 1234567890,
        "donation": {
            "bch": "bitcoincash:qpyuhug3xvcg4lpp2d8edymd75peh8rd6yg3mhn3p5"
        },
        "verify": "https://txstreet.com/v/bch-eth"
    },
    {
        "title": "Keep Bitcoin FREE",
        "iconUrl": "https://i.imgur.com/EwlKPwg.png",
        "satoshis": 1234567890,
        "donation": {
            "bch": "bitcoincash:qzlq5chhphjzu3gl6qs4fx4sgevv0cqfzysr8l32rr"
        },
        "verify": "https://keepbitcoinfree.org/bch-dev/"
    },
    {
        "title": "Blockparty Wallet (alpha)",
        "iconUrl": "https://i.imgur.com/fnuLphA.png",
        "satoshis": 1234567890,
        "donation": {
            "bch": "bitcoincash:qpygaungmfry8xzxphj4pw24kk5l9vfxlyhy0z36al"
        },
        "verify": "https://fountainhead.cash/"
    },
    {
        "title": "Cronnit",
        "iconUrl": "https://i.imgur.com/QQelHSe.png",
        "satoshis": 1234567890,
        "donation": {
            "bch": "bitcoincash:qza0tk3tmp9pvs8te65lypr9h76tkfv3sqtp38tedd"
        },
        "verify": "https://cronnit.us/donate"
    },
    {
        "title": "Gameflame.cash",
        "iconUrl": "https://i.imgur.com/lQtJTIB.png",
        "pif": {
            "balance": 100,
            "burn": ""
        },
        "satoshis": 1234567890,
        "donation": {
            "bch": "bitcoincash:qqnqh9ku0gjkqcj0jfwn2jf9var277xlk5f7qr4r66"
        },
        "verify": "http://flipstarter.gameflame.cash/"
    },
    {
        "title": "PayButton",
        "iconUrl": "https://i.imgur.com/74DpDoG.png",
        "pif": {
            "balance": 100,
            "burn": ""
        },
        "satoshis": 1234567890,
        "donation": {
            "bch": "bitcoincash:qrmm7edwuj4jf7tnvygjyztyy0a0qxvl7q9ayphulp"
        },
        "verify": "https://flipstarter.paybutton.org/"
    },
    {
        "title": "BCH on CoinKit",
        "iconUrl": "https://i.imgur.com/hRP9gxH.png",
        "pif": {
            "balance": 100,
            "burn": ""
        },
        "satoshis": 1234567890,
        "donation": {
            "bch": "bitcoincash:qq547dp7lke69ju5kkc076g4hamfhau8rs3j08nt37"
        },
        "verify": "https://flipstarter-coinkit.blockcurators.com/"
    },
    {
        "title": "Tew Tew",
        "iconUrl": "https://i.imgur.com/uA3s9iJ.png",
        "pif": {
            "balance": 100,
            "burn": ""
        },
        "satoshis": 1234567890,
        "donation": {
            "bch": "bitcoincash:qzs6jdkt752fahvrff5psy4d6cxc02ep3cx74hpycl"
        },
        "verify": "https://tewtew.com/"
    }
]
