module github.com/ipfs-force-community/sophon-miner

go 1.19

retract v1.14.0 // Accidentally force-pushed tag, use v1.14.1+ instead.

require (
	contrib.go.opencensus.io/exporter/jaeger v0.2.1
	github.com/BurntSushi/toml v1.2.0
	github.com/etherlabsio/healthcheck/v2 v2.0.0
	github.com/filecoin-project/go-address v1.1.0
	github.com/filecoin-project/go-bitfield v0.2.4
	github.com/filecoin-project/go-jsonrpc v0.1.8
	github.com/filecoin-project/go-state-types v0.11.1
	github.com/filecoin-project/specs-actors/v2 v2.3.6
	github.com/filecoin-project/specs-actors/v7 v7.0.1
	github.com/filecoin-project/venus v1.13.0-rc1
	github.com/golang/mock v1.6.0
	github.com/google/uuid v1.3.0
	github.com/gorilla/mux v1.8.0
	github.com/ipfs-force-community/metrics v1.0.1-0.20230626064437-eed34cb166f5
	github.com/ipfs-force-community/sophon-auth v1.13.0-rc1
	github.com/ipfs/go-cid v0.4.1
	github.com/ipfs/go-datastore v0.6.0
	github.com/ipfs/go-ds-leveldb v0.5.0
	github.com/ipfs/go-ds-measure v0.2.0
	github.com/ipfs/go-fs-lock v0.0.7
	github.com/ipfs/go-log/v2 v2.5.1
	github.com/ipfs/go-metrics-interface v0.0.1
	github.com/minio/blake2b-simd v0.0.0-20160723061019-3f5f724cb5b1
	github.com/mitchellh/go-homedir v1.1.0
	github.com/multiformats/go-multiaddr v0.9.0
	github.com/raulk/clock v1.1.0
	github.com/stretchr/testify v1.8.3
	github.com/syndtr/goleveldb v1.0.1-0.20210819022825-2ae1ddf74ef7
	github.com/urfave/cli/v2 v2.16.3
	go.opencensus.io v0.24.0
	go.uber.org/fx v1.19.2
	go.uber.org/zap v1.24.0
	golang.org/x/text v0.10.0
	golang.org/x/tools v0.7.0
	gorm.io/driver/mysql v1.3.5
	gorm.io/driver/sqlite v1.3.6
	gorm.io/gorm v1.23.8
)

require (
	contrib.go.opencensus.io/exporter/graphite v0.0.0-20200424223504-26b90655e0ce // indirect
	contrib.go.opencensus.io/exporter/prometheus v0.4.2 // indirect
	github.com/DataDog/zstd v1.4.5 // indirect
	github.com/ahmetb/go-linq/v3 v3.2.0 // indirect
	github.com/benbjohnson/clock v1.3.0 // indirect
	github.com/beorn7/perks v1.0.1 // indirect
	github.com/bluele/gcache v0.0.0-20190518031135-bc40bd653833 // indirect
	github.com/bytedance/sonic v1.9.1 // indirect
	github.com/cespare/xxhash v1.1.0 // indirect
	github.com/cespare/xxhash/v2 v2.2.0 // indirect
	github.com/chenzhuoyu/base64x v0.0.0-20221115062448-fe3a3abad311 // indirect
	github.com/cpuguy83/go-md2man/v2 v2.0.2 // indirect
	github.com/davecgh/go-spew v1.1.1 // indirect
	github.com/decred/dcrd/dcrec/secp256k1/v4 v4.1.0 // indirect
	github.com/deepmap/oapi-codegen v1.3.13 // indirect
	github.com/dgraph-io/badger/v2 v2.2007.4 // indirect
	github.com/dgraph-io/badger/v3 v3.2103.5 // indirect
	github.com/dgraph-io/ristretto v0.1.1 // indirect
	github.com/dgryski/go-farm v0.0.0-20200201041132-a6ae2369ad13 // indirect
	github.com/dustin/go-humanize v1.0.1 // indirect
	github.com/filecoin-project/go-amt-ipld/v2 v2.1.1-0.20201006184820-924ee87a1349 // indirect
	github.com/filecoin-project/go-amt-ipld/v3 v3.1.0 // indirect
	github.com/filecoin-project/go-amt-ipld/v4 v4.0.0 // indirect
	github.com/filecoin-project/go-cbor-util v0.0.1 // indirect
	github.com/filecoin-project/go-crypto v0.0.1 // indirect
	github.com/filecoin-project/go-data-transfer/v2 v2.0.0-rc4 // indirect
	github.com/filecoin-project/go-ds-versioning v0.1.2 // indirect
	github.com/filecoin-project/go-fil-markets v1.27.0-rc1 // indirect
	github.com/filecoin-project/go-hamt-ipld v0.1.5 // indirect
	github.com/filecoin-project/go-hamt-ipld/v2 v2.0.0 // indirect
	github.com/filecoin-project/go-hamt-ipld/v3 v3.1.0 // indirect
	github.com/filecoin-project/go-padreader v0.0.1 // indirect
	github.com/filecoin-project/go-statemachine v1.0.3 // indirect
	github.com/filecoin-project/go-statestore v0.2.0 // indirect
	github.com/filecoin-project/specs-actors v0.9.15 // indirect
	github.com/filecoin-project/specs-actors/v3 v3.1.2 // indirect
	github.com/filecoin-project/specs-actors/v4 v4.0.2 // indirect
	github.com/filecoin-project/specs-actors/v5 v5.0.6 // indirect
	github.com/filecoin-project/specs-actors/v6 v6.0.2 // indirect
	github.com/fsnotify/fsnotify v1.6.0 // indirect
	github.com/fxamacker/cbor/v2 v2.4.0 // indirect
	github.com/gabriel-vasile/mimetype v1.4.2 // indirect
	github.com/gbrlsnchs/jwt/v3 v3.0.1 // indirect
	github.com/gin-contrib/sse v0.1.0 // indirect
	github.com/gin-gonic/gin v1.9.1 // indirect
	github.com/go-kit/log v0.2.1 // indirect
	github.com/go-logfmt/logfmt v0.6.0 // indirect
	github.com/go-logr/logr v1.2.4 // indirect
	github.com/go-logr/stdr v1.2.2 // indirect
	github.com/go-playground/locales v0.14.1 // indirect
	github.com/go-playground/universal-translator v0.18.1 // indirect
	github.com/go-playground/validator/v10 v10.14.0 // indirect
	github.com/go-redis/redis/v7 v7.0.0-beta // indirect
	github.com/go-redis/redis_rate/v7 v7.0.1 // indirect
	github.com/go-resty/resty/v2 v2.4.0 // indirect
	github.com/go-sql-driver/mysql v1.6.0 // indirect
	github.com/goccy/go-json v0.10.2 // indirect
	github.com/gogo/protobuf v1.3.2 // indirect
	github.com/golang/glog v1.1.1 // indirect
	github.com/golang/groupcache v0.0.0-20210331224755-41bb18bfe9da // indirect
	github.com/golang/protobuf v1.5.3 // indirect
	github.com/golang/snappy v0.0.4 // indirect
	github.com/google/flatbuffers v23.5.26+incompatible // indirect
	github.com/gorilla/websocket v1.5.0 // indirect
	github.com/hannahhoward/cbor-gen-for v0.0.0-20230214144701-5d17c9d5243c // indirect
	github.com/hannahhoward/go-pubsub v0.0.0-20200423002714-8d62886cc36e // indirect
	github.com/hashicorp/golang-lru v0.5.4 // indirect
	github.com/hashicorp/golang-lru/v2 v2.0.2 // indirect
	github.com/hashicorp/hcl v1.0.0 // indirect
	github.com/influxdata/influxdb-client-go/v2 v2.2.2 // indirect
	github.com/influxdata/line-protocol v0.0.0-20200327222509-2487e7298839 // indirect
	github.com/ipfs/bbloom v0.0.4 // indirect
	github.com/ipfs/go-block-format v0.1.2 // indirect
	github.com/ipfs/go-blockservice v0.5.0 // indirect
	github.com/ipfs/go-ipfs-blockstore v1.3.0 // indirect
	github.com/ipfs/go-ipfs-ds-help v1.1.0 // indirect
	github.com/ipfs/go-ipfs-exchange-interface v0.2.0 // indirect
	github.com/ipfs/go-ipfs-util v0.0.3 // indirect
	github.com/ipfs/go-ipld-cbor v0.0.6 // indirect
	github.com/ipfs/go-ipld-format v0.4.0 // indirect
	github.com/ipfs/go-ipld-legacy v0.1.1 // indirect
	github.com/ipfs/go-log v1.0.5 // indirect
	github.com/ipfs/go-merkledag v0.10.0 // indirect
	github.com/ipfs/go-verifcid v0.0.2 // indirect
	github.com/ipld/go-car v0.5.0 // indirect
	github.com/ipld/go-codec-dagpb v1.6.0 // indirect
	github.com/ipld/go-ipld-prime v0.20.0 // indirect
	github.com/ipsn/go-secp256k1 v0.0.0-20180726113642-9d62b9f0bc52 // indirect
	github.com/jbenet/goprocess v0.1.4 // indirect
	github.com/jinzhu/inflection v1.0.0 // indirect
	github.com/jinzhu/now v1.1.5 // indirect
	github.com/jpillora/backoff v1.0.0 // indirect
	github.com/json-iterator/go v1.1.12 // indirect
	github.com/klauspost/compress v1.16.6 // indirect
	github.com/klauspost/cpuid/v2 v2.2.5 // indirect
	github.com/leodido/go-urn v1.2.4 // indirect
	github.com/libp2p/go-buffer-pool v0.1.0 // indirect
	github.com/libp2p/go-flow-metrics v0.1.0 // indirect
	github.com/libp2p/go-libp2p v0.27.8 // indirect
	github.com/libp2p/go-libp2p-pubsub v0.9.3 // indirect
	github.com/libp2p/go-msgio v0.3.0 // indirect
	github.com/magefile/mage v1.11.0 // indirect
	github.com/magiconair/properties v1.8.6 // indirect
	github.com/mattn/go-isatty v0.0.19 // indirect
	github.com/mattn/go-sqlite3 v1.14.16 // indirect
	github.com/matttproud/golang_protobuf_extensions v1.0.4 // indirect
	github.com/minio/sha256-simd v1.0.1 // indirect
	github.com/mitchellh/mapstructure v1.5.0 // indirect
	github.com/modern-go/concurrent v0.0.0-20180306012644-bacd9c7ef1dd // indirect
	github.com/modern-go/reflect2 v1.0.2 // indirect
	github.com/mr-tron/base58 v1.2.0 // indirect
	github.com/multiformats/go-base32 v0.1.0 // indirect
	github.com/multiformats/go-base36 v0.2.0 // indirect
	github.com/multiformats/go-multibase v0.2.0 // indirect
	github.com/multiformats/go-multicodec v0.8.1 // indirect
	github.com/multiformats/go-multihash v0.2.3 // indirect
	github.com/multiformats/go-multistream v0.4.1 // indirect
	github.com/multiformats/go-varint v0.0.7 // indirect
	github.com/opentracing/opentracing-go v1.2.0 // indirect
	github.com/patrickmn/go-cache v2.1.0+incompatible // indirect
	github.com/pelletier/go-toml v1.9.5 // indirect
	github.com/pelletier/go-toml/v2 v2.0.8 // indirect
	github.com/pkg/errors v0.9.1 // indirect
	github.com/pmezard/go-difflib v1.0.0 // indirect
	github.com/polydawn/refmt v0.89.0 // indirect
	github.com/prometheus/client_golang v1.14.0 // indirect
	github.com/prometheus/client_model v0.3.0 // indirect
	github.com/prometheus/common v0.42.0 // indirect
	github.com/prometheus/procfs v0.9.0 // indirect
	github.com/prometheus/statsd_exporter v0.23.0 // indirect
	github.com/russross/blackfriday/v2 v2.1.0 // indirect
	github.com/sirupsen/logrus v1.9.0 // indirect
	github.com/spaolacci/murmur3 v1.1.0 // indirect
	github.com/spf13/afero v1.8.2 // indirect
	github.com/spf13/cast v1.5.0 // indirect
	github.com/spf13/jwalterweatherman v1.1.0 // indirect
	github.com/spf13/pflag v1.0.5 // indirect
	github.com/spf13/viper v1.12.0 // indirect
	github.com/subosito/gotenv v1.4.0 // indirect
	github.com/twitchyliquid64/golang-asm v0.15.1 // indirect
	github.com/uber/jaeger-client-go v2.25.0+incompatible // indirect
	github.com/ugorji/go/codec v1.2.11 // indirect
	github.com/whyrusleeping/cbor-gen v0.0.0-20230126041949-52956bd4c9aa // indirect
	github.com/whyrusleeping/go-logging v0.0.1 // indirect
	github.com/x448/float16 v0.8.4 // indirect
	github.com/xrash/smetrics v0.0.0-20201216005158-039620a65673 // indirect
	go.opentelemetry.io/otel v1.16.0 // indirect
	go.opentelemetry.io/otel/bridge/opencensus v0.39.0 // indirect
	go.opentelemetry.io/otel/exporters/jaeger v1.14.0 // indirect
	go.opentelemetry.io/otel/metric v1.16.0 // indirect
	go.opentelemetry.io/otel/sdk v1.16.0 // indirect
	go.opentelemetry.io/otel/sdk/metric v0.39.0 // indirect
	go.opentelemetry.io/otel/trace v1.16.0 // indirect
	go.uber.org/atomic v1.10.0 // indirect
	go.uber.org/dig v1.16.1 // indirect
	go.uber.org/multierr v1.11.0 // indirect
	go4.org v0.0.0-20200411211856-f5505b9728dd // indirect
	golang.org/x/arch v0.3.0 // indirect
	golang.org/x/crypto v0.10.0 // indirect
	golang.org/x/mod v0.10.0 // indirect
	golang.org/x/net v0.11.0 // indirect
	golang.org/x/sync v0.1.0 // indirect
	golang.org/x/sys v0.9.0 // indirect
	golang.org/x/time v0.0.0-20220722155302-e5dcc9cfc0b9 // indirect
	golang.org/x/xerrors v0.0.0-20220907171357-04be3eba64a2 // indirect
	google.golang.org/api v0.81.0 // indirect
	google.golang.org/protobuf v1.31.0 // indirect
	gopkg.in/ini.v1 v1.66.6 // indirect
	gopkg.in/yaml.v2 v2.4.0 // indirect
	gopkg.in/yaml.v3 v3.0.1 // indirect
	lukechampine.com/blake3 v1.2.1 // indirect
)

replace github.com/ipfs-force-community/sophon-miner => ./

replace github.com/golangci/golangci-lint => github.com/golangci/golangci-lint v1.18.0

replace github.com/filecoin-project/go-jsonrpc => github.com/ipfs-force-community/go-jsonrpc v0.1.7
