﻿Designator,Footprint,Quantity,Value,LCSC Part #
C1,0603,1,10µF,
"C10, C11, C12, C13, C14, C15, C16, C17, C18, C19, C20, C21, C22, C23, C31, C36, C7, C8, C9",0603,19,1µ,
"C24, C25",0603,2,6p,
"C26, C27, C28, C29, C32, C33, C37, C38, C39, C40, C41, C42, C43, C44, C45, C46, C47, C48, C49, C5, C50, C51, C59, C6, C60, C61",0603,26,100n,
C30,0603,1,4.7µ,
"C34, C35",0603,2,2.2µ,
C4,CP_Elec_4x5.4,1,22µ,
"C52, C53, C54, C56, C57, C58, C64, C65, C66, C67",0603,10,10uF,
C55,0603,1,100n 100v,
C62,0603,1,10u 35v,
C63,0603,1,1.2nF,
C68,CP_EIA-7343-31_Kemet-D,1,100uF,
"D10, D11, D12, D13, D14, D15, D16, D17, D18, D2, D21, D3, D4, D5, D6, D7, D8, D9",D_SOD-323,18,1N4148WX-TP,
D19,0603,1,LTST-C191KRKT,
D20,0603,1,LTST-C191KGKT,
D22,SOT-23-3,1,MMBZ5242BLT3G,
"H1, H2, H3, H4",MountingHole_3.2mm_M3_Pad_Via,4,MountingHole_Pad,
"J1, J3",PinHeader_1x04_P2.54mm_Vertical,2,Conn_01x04_Male,
"J10, J11, J12, J13, J14, J15, J16, J17, J18, J19, J20, J21, J22, J23, J6, J7, J8, J9",JST_XH_B2B-XH-A_1x02_P2.50mm_Vertical,18,Conn_01x02_Male,
"J2, J4",RJ45_Ninigi_GE,2,RJ45_Shielded,
J24,PinHeader_2x03_P2.54mm_Vertical,1,Conn_02x03_Odd_Even,
J25,PinHeader_2x14_P2.54mm_Vertical,1,Conn_02x14_Odd_Even,
J26,TerminalBlock_RND_205-00297_1x12_P5.08mm_Horizontal,1,Screw_Terminal_01x12,
J5,TerminalBlock_RND_205-00291_1x06_P5.08mm_Horizontal,1,Screw_Terminal_01x06,
"JP10, JP11, JP12, JP13, JP14, JP15, JP16, JP17, JP18, JP19, JP20, JP21, JP22, JP5, JP6, JP7, JP8, JP9",SolderJumper-2_P1.3mm_Open_TrianglePad1.0x1.5mm,18,SolderJumper_2_Open,
"JP23, JP24",SolderJumper-3_P1.3mm_Open_RoundedPad1.0x1.5mm,2,SolderJumper_3_Open,
L2,L_Bourns_SRN6045TA,1,SRN6045TA-3R3Y,
"Q1, Q10, Q11, Q12, Q2, Q3, Q4, Q5, Q6, Q7, Q8, Q9",TO-252-2,12,DMN10H170SK3-13,
Q13,Diodes_PowerDI3333-8,1,DMP3013SFV-7,
"R10, R12, R14, R16, R18, R2, R20, R22, R24, R26, R28, R30, R32, R34, R36, R38, R39, R4, R40, R41, R42, R45, R47, R48, R49, R50, R51, R52, R53, R54, R59, R6, R60, R61, R62, R63, R64, R65, R66, R71, R72, R73, R74, R75, R76, R77, R78, R8",0603,48,10k,
"R11, R13, R15, R17, R19, R21, R23, R25, R27, R29, R31, R33, R35, R37, R46, R5, R7, R9",0603,18,10,
R3,0603,1,120,
"R43, R44",0603,2,1k,
"R55, R56, R57, R58, R67, R68, R69, R70, R79, R80, R81, R82",2512,12,Shunt/R=20mOhm,
"R83, R86",0603,2,12K 1%,
R84,0603,1,10R,
R85,0603,1,20K 1%,
R87,0603,1,2.2K 1%,
SW1,SW_DS04-254-2-03BK-SMT,1,DS04-254-2-03BK-SMT,
SW2,SW_TS-1187A-B-A-B,1,SW_Push,
"TP1, TP2, TP3, TP4, TP5, TP6",TestPoint_Pad_D1.0mm,6,TestPoint,
"U10, U15, U5",SOIC-14_3.9x8.7mm_P1.27mm,3,SN74LV08ADR,
"U11, U12, U13, U14, U16, U17, U18, U19, U6, U7, U8, U9",SOT-23-5,12,IX4310TTR,
U2,SOT-223-3_TabPin2,1,AMS1117-3.3,
U20,SOIC-8-1EP_3.9x4.9mm_P1.27mm_EP2.95x4.9mm_Mask2.71x3.4mm_ThermalVias,1,AP64501SP-13,
U3,SOIC-8_3.9x4.9mm_P1.27mm,1,TJA1051T-3,
U4,LQFP-64_10x10mm_P0.5mm,1,STM32F446RETx,
Y1,Crystal_SMD_5032-2Pin_5.0x3.2mm,1,8MHz,
