(footprint "SW_TS-1187A-B-A-B" (version 20221018) (generator pcbnew)
  (layer "F.Cu")
  (attr smd)
  (fp_text reference "REF**" (at -0.825 -3.635) (layer "F.SilkS")
      (effects (font (size 1 1) (thickness 0.15)))
    (tstamp 4f662a00-2d4b-4dbf-a397-106695bbab8f)
  )
  (fp_text value "SW_TS-1187A-B-A-B" (at 6.795 3.565) (layer "F.Fab")
      (effects (font (size 1 1) (thickness 0.15)))
    (tstamp e53c405f-c28b-4b3c-8db3-6f250f6af713)
  )
  (fp_line (start -2.55 -1.18) (end -2.55 1.18)
    (stroke (width 0.127) (type solid)) (layer "F.SilkS") (tstamp 62714e46-2bdc-40e4-9419-72f6a2ed0050))
  (fp_line (start 2.25 -2.55) (end -2.25 -2.55)
    (stroke (width 0.127) (type solid)) (layer "F.SilkS") (tstamp eb88cd66-90b8-409e-8589-213a336ac08a))
  (fp_line (start 2.25 2.55) (end -2.25 2.55)
    (stroke (width 0.127) (type solid)) (layer "F.SilkS") (tstamp 531294e5-e3c8-41f2-a711-724556c1ebb0))
  (fp_line (start 2.55 1.18) (end 2.55 -1.18)
    (stroke (width 0.127) (type solid)) (layer "F.SilkS") (tstamp 14579d14-75ae-4825-acc1-af1119dafabc))
  (fp_circle (center -4.25 -1.875) (end -4.15 -1.875)
    (stroke (width 0.2) (type solid)) (fill none) (layer "F.SilkS") (tstamp d741a112-022c-4e1e-9bee-77151008c2f3))
  (fp_line (start -3.75 -2.5) (end -3.75 -1.25)
    (stroke (width 0.05) (type solid)) (layer "F.CrtYd") (tstamp fae9f32e-82bc-4ef0-80aa-ff280916ecb4))
  (fp_line (start -3.75 -2.5) (end -2.8 -2.5)
    (stroke (width 0.05) (type solid)) (layer "F.CrtYd") (tstamp c373de9e-55ca-4d74-91a7-1197f60825a7))
  (fp_line (start -3.75 -1.25) (end -2.8 -1.25)
    (stroke (width 0.05) (type solid)) (layer "F.CrtYd") (tstamp f2172689-7b84-4c46-96c2-155052e460cc))
  (fp_line (start -3.75 1.25) (end -2.8 1.25)
    (stroke (width 0.05) (type solid)) (layer "F.CrtYd") (tstamp 09fbb31a-7bea-41a0-80b1-1dd6667447f5))
  (fp_line (start -3.75 2.5) (end -3.75 1.25)
    (stroke (width 0.05) (type solid)) (layer "F.CrtYd") (tstamp 63c1355c-bec6-4e33-b41b-c8bb3faf2be7))
  (fp_line (start -3.75 2.5) (end -2.8 2.5)
    (stroke (width 0.05) (type solid)) (layer "F.CrtYd") (tstamp 9b0a0232-96ad-4469-b330-e1638d78ed3c))
  (fp_line (start -2.8 -2.8) (end -2.8 -2.5)
    (stroke (width 0.05) (type solid)) (layer "F.CrtYd") (tstamp b94a62b0-7334-4cd1-ad3b-ce84777be878))
  (fp_line (start -2.8 -1.25) (end -2.8 1.25)
    (stroke (width 0.05) (type solid)) (layer "F.CrtYd") (tstamp 143d1e9d-20b2-44c8-96a5-2b334ec9c6e6))
  (fp_line (start -2.8 2.8) (end -2.8 2.5)
    (stroke (width 0.05) (type solid)) (layer "F.CrtYd") (tstamp a82f3cd9-ffb5-4a44-a83e-586f4ca70fed))
  (fp_line (start -2.8 2.8) (end 2.8 2.8)
    (stroke (width 0.05) (type solid)) (layer "F.CrtYd") (tstamp e0e24c88-9a0c-4ed0-a2db-148596bf328e))
  (fp_line (start 2.8 -2.8) (end -2.8 -2.8)
    (stroke (width 0.05) (type solid)) (layer "F.CrtYd") (tstamp 9193e85d-5502-47db-a8c2-91c3ed8c6bec))
  (fp_line (start 2.8 -2.8) (end 2.8 -2.5)
    (stroke (width 0.05) (type solid)) (layer "F.CrtYd") (tstamp 5a999c25-7b19-48ef-8f8d-39fc3d7e66bd))
  (fp_line (start 2.8 -1.25) (end 2.8 1.25)
    (stroke (width 0.05) (type solid)) (layer "F.CrtYd") (tstamp 22642f75-01e6-4f86-a5b9-5c1e37a9c4b9))
  (fp_line (start 2.8 2.8) (end 2.8 2.5)
    (stroke (width 0.05) (type solid)) (layer "F.CrtYd") (tstamp 32a9f81e-6e26-42bf-8b0d-66476921bb26))
  (fp_line (start 3.75 -2.5) (end 2.8 -2.5)
    (stroke (width 0.05) (type solid)) (layer "F.CrtYd") (tstamp af556649-0d7a-4091-8a60-3f404b8558ea))
  (fp_line (start 3.75 -2.5) (end 3.75 -1.25)
    (stroke (width 0.05) (type solid)) (layer "F.CrtYd") (tstamp ae6e3ee5-c01d-4126-8275-8a1da580c4b0))
  (fp_line (start 3.75 -1.25) (end 2.8 -1.25)
    (stroke (width 0.05) (type solid)) (layer "F.CrtYd") (tstamp ae46c85b-1cbd-4650-916d-68b08d6876ff))
  (fp_line (start 3.75 1.25) (end 2.8 1.25)
    (stroke (width 0.05) (type solid)) (layer "F.CrtYd") (tstamp c8f7b2c0-6060-49a0-bde6-c9ad5cf2ec08))
  (fp_line (start 3.75 2.5) (end 2.8 2.5)
    (stroke (width 0.05) (type solid)) (layer "F.CrtYd") (tstamp 53fe6556-7d5a-48e4-9cf3-711ae41663ed))
  (fp_line (start 3.75 2.5) (end 3.75 1.25)
    (stroke (width 0.05) (type solid)) (layer "F.CrtYd") (tstamp 538f70f2-e2e0-47d7-9992-26c85f2c2917))
  (fp_line (start -2.55 -2.55) (end -2.55 2.55)
    (stroke (width 0.127) (type solid)) (layer "F.Fab") (tstamp 1ac3edce-40d6-4546-ac22-a2428153a28a))
  (fp_line (start -2.55 2.55) (end 2.55 2.55)
    (stroke (width 0.127) (type solid)) (layer "F.Fab") (tstamp 372e79e9-13c4-4409-b1e2-55d99a631284))
  (fp_line (start 2.55 -2.55) (end -2.55 -2.55)
    (stroke (width 0.127) (type solid)) (layer "F.Fab") (tstamp 216da083-d7d9-4ee0-8d68-488655186db1))
  (fp_line (start 2.55 2.55) (end 2.55 -2.55)
    (stroke (width 0.127) (type solid)) (layer "F.Fab") (tstamp 82e336dd-8c03-4e5e-8dca-ab9212567447))
  (fp_circle (center -4.25 -1.875) (end -4.15 -1.875)
    (stroke (width 0.2) (type solid)) (fill none) (layer "F.Fab") (tstamp 55b1c9f0-fabd-4b56-aedf-a39bca16347e))
  (pad "1" smd rect (at -3 -1.875) (size 1 0.75) (layers "F.Cu" "F.Paste" "F.Mask")
    (solder_mask_margin 0.102) (tstamp 3328195f-01e7-415d-bc89-53c052f156af))
  (pad "1" smd rect (at 3 -1.875) (size 1 0.75) (layers "F.Cu" "F.Paste" "F.Mask")
    (solder_mask_margin 0.102) (tstamp 2bdf1d32-8556-4a11-aa74-0299365241fb))
  (pad "2" smd rect (at -3 1.875) (size 1 0.75) (layers "F.Cu" "F.Paste" "F.Mask")
    (solder_mask_margin 0.102) (tstamp 60f23e57-2472-4d86-94f8-36ad0f4cdd00))
  (pad "2" smd rect (at 3 1.875) (size 1 0.75) (layers "F.Cu" "F.Paste" "F.Mask")
    (solder_mask_margin 0.102) (tstamp 233b7635-c552-464a-92c6-84afc76eeb83))
)
