
(kicad_symbol_lib (version 20211014) (generator kicad_symbol_editor)
  (symbol "ABLS7M-16.000MHZ-B-2-T" (pin_names (offset 1.016)) (in_bom yes) (on_board yes)
    (property "Reference" "Y" (id 0) (at -5.0878 3.81585 0)
      (effects (font (size 1.27 1.27)) (justify bottom left))
    )
    (property "Value" "ABLS7M-16.000MHZ-B-2-T" (id 1) (at -5.09439 -5.09439 0)
      (effects (font (size 1.27 1.27)) (justify bottom left))
    )
    (property "Footprint" "ABLS7M-16.000MHZ-B-2-T:XTAL_ABLS7M-16.000MHZ-B-2-T" (id 2) (at 0 0 0)
      (effects (font (size 1.27 1.27)) (justify bottom) hide)
    )
    (property "MF" "Abracon LLC" (id 4) (at 0 0 0)
      (effects (font (size 1.27 1.27)) (justify bottom) hide)
    )
    (property "MAXIMUM_PACKAGE_HEIGHT" "2.3 mm" (id 5) (at 0 0 0)
      (effects (font (size 1.27 1.27)) (justify bottom) hide)
    )
    (property "Package" "SMD-2 Abracon LLC" (id 6) (at 0 0 0)
      (effects (font (size 1.27 1.27)) (justify bottom) hide)
    )
    (property "Price" "None" (id 7) (at 0 0 0)
      (effects (font (size 1.27 1.27)) (justify bottom) hide)
    )
    (property "Check_prices" "https://www.snapeda.com/parts/ABLS7M-16.000MHZ-B-2-T/Abracon+LLC/view-part/?ref=eda" (id 8) (at 0 0 0)
      (effects (font (size 1.27 1.27)) (justify bottom) hide)
    )
    (property "STANDARD" "Manufacturer Recommendations" (id 9) (at 0 0 0)
      (effects (font (size 1.27 1.27)) (justify bottom) hide)
    )
    (property "PARTREV" "01.06.15" (id 10) (at 0 0 0)
      (effects (font (size 1.27 1.27)) (justify bottom) hide)
    )
    (property "SnapEDA_Link" "https://www.snapeda.com/parts/ABLS7M-16.000MHZ-B-2-T/Abracon+LLC/view-part/?ref=snap" (id 11) (at 0 0 0)
      (effects (font (size 1.27 1.27)) (justify bottom) hide)
    )
    (property "MP" "ABLS7M-16.000MHZ-B-2-T" (id 12) (at 0 0 0)
      (effects (font (size 1.27 1.27)) (justify bottom) hide)
    )
    (property "Purchase-URL" "https://www.snapeda.com/api/url_track_click_mouser/?unipart_id=519078&manufacturer=Abracon LLC&part_name=ABLS7M-16.000MHZ-B-2-T&search_term=abls7m-16.000mhz-b-2-t" (id 13) (at 0 0 0)
      (effects (font (size 1.27 1.27)) (justify bottom) hide)
    )
    (property "Description" "\nSMD MICROPROCESSOR CRYSTAL\n" (id 14) (at 0 0 0)
      (effects (font (size 1.27 1.27)) (justify bottom) hide)
    )
    (property "Availability" "In Stock" (id 15) (at 0 0 0)
      (effects (font (size 1.27 1.27)) (justify bottom) hide)
    )
    (property "MANUFACTURER" "Abracon" (id 16) (at 0 0 0)
      (effects (font (size 1.27 1.27)) (justify bottom) hide)
    )
    (symbol "ABLS7M-16.000MHZ-B-2-T_0_0"
      (polyline
        (pts (xy -1.397 2.54) (xy 1.397 2.54)) (stroke (width 0.4064))
      )
      (polyline
        (pts (xy 1.397 2.54) (xy 1.397 -2.54)) (stroke (width 0.4064))
      )
      (polyline
        (pts (xy 1.397 -2.54) (xy -1.397 -2.54)) (stroke (width 0.4064))
      )
      (polyline
        (pts (xy -1.397 2.54) (xy -1.397 -2.54)) (stroke (width 0.4064))
      )
      (polyline
        (pts (xy 2.3368 2.54) (xy 2.3368 -2.54)) (stroke (width 0.4064))
      )
      (polyline
        (pts (xy -2.3368 2.54) (xy -2.3368 -2.54)) (stroke (width 0.4064))
      )
      (pin passive line (at 5.08 0.0 180.0) (length 2.54)
        (name "~"
          (effects (font (size 1.016 1.016)))
        )
        (number "2"
          (effects (font (size 1.016 1.016)))
        )
      )
      (pin passive line (at -5.08 0.0 0) (length 2.54)
        (name "~"
          (effects (font (size 1.016 1.016)))
        )
        (number "1"
          (effects (font (size 1.016 1.016)))
        )
      )
    )
  )
)