(kicad_sch (version 20230121) (generator eeschema)

  (uuid 9d46446c-f507-4d22-a063-cc459b4056a6)

  (paper "A4")

  (title_block
    (title "CAN-Transreciever")
    (date "02.12.2023")
    (rev "1")
    (company "Technische Hochschule Augsburg")
    (comment 1 "Johannes Hofmann TI5")
  )

  (lib_symbols
    (symbol "Connector:TestPoint" (pin_numbers hide) (pin_names (offset 0.762) hide) (in_bom yes) (on_board yes)
      (property "Reference" "TP" (at 0 6.858 0)
        (effects (font (size 1.27 1.27)))
      )
      (property "Value" "TestPoint" (at 0 5.08 0)
        (effects (font (size 1.27 1.27)))
      )
      (property "Footprint" "" (at 5.08 0 0)
        (effects (font (size 1.27 1.27)) hide)
      )
      (property "Datasheet" "~" (at 5.08 0 0)
        (effects (font (size 1.27 1.27)) hide)
      )
      (property "ki_keywords" "test point tp" (at 0 0 0)
        (effects (font (size 1.27 1.27)) hide)
      )
      (property "ki_description" "test point" (at 0 0 0)
        (effects (font (size 1.27 1.27)) hide)
      )
      (property "ki_fp_filters" "Pin* Test*" (at 0 0 0)
        (effects (font (size 1.27 1.27)) hide)
      )
      (symbol "TestPoint_0_1"
        (circle (center 0 3.302) (radius 0.762)
          (stroke (width 0) (type default))
          (fill (type none))
        )
      )
      (symbol "TestPoint_1_1"
        (pin passive line (at 0 0 90) (length 2.54)
          (name "1" (effects (font (size 1.27 1.27))))
          (number "1" (effects (font (size 1.27 1.27))))
        )
      )
    )
    (symbol "Device:C" (pin_numbers hide) (pin_names (offset 0.254)) (in_bom yes) (on_board yes)
      (property "Reference" "C" (at 0.635 2.54 0)
        (effects (font (size 1.27 1.27)) (justify left))
      )
      (property "Value" "C" (at 0.635 -2.54 0)
        (effects (font (size 1.27 1.27)) (justify left))
      )
      (property "Footprint" "" (at 0.9652 -3.81 0)
        (effects (font (size 1.27 1.27)) hide)
      )
      (property "Datasheet" "~" (at 0 0 0)
        (effects (font (size 1.27 1.27)) hide)
      )
      (property "ki_keywords" "cap capacitor" (at 0 0 0)
        (effects (font (size 1.27 1.27)) hide)
      )
      (property "ki_description" "Unpolarized capacitor" (at 0 0 0)
        (effects (font (size 1.27 1.27)) hide)
      )
      (property "ki_fp_filters" "C_*" (at 0 0 0)
        (effects (font (size 1.27 1.27)) hide)
      )
      (symbol "C_0_1"
        (polyline
          (pts
            (xy -2.032 -0.762)
            (xy 2.032 -0.762)
          )
          (stroke (width 0.508) (type default))
          (fill (type none))
        )
        (polyline
          (pts
            (xy -2.032 0.762)
            (xy 2.032 0.762)
          )
          (stroke (width 0.508) (type default))
          (fill (type none))
        )
      )
      (symbol "C_1_1"
        (pin passive line (at 0 3.81 270) (length 2.794)
          (name "~" (effects (font (size 1.27 1.27))))
          (number "1" (effects (font (size 1.27 1.27))))
        )
        (pin passive line (at 0 -3.81 90) (length 2.794)
          (name "~" (effects (font (size 1.27 1.27))))
          (number "2" (effects (font (size 1.27 1.27))))
        )
      )
    )
    (symbol "Device:R" (pin_numbers hide) (pin_names (offset 0)) (in_bom yes) (on_board yes)
      (property "Reference" "R" (at 2.032 0 90)
        (effects (font (size 1.27 1.27)))
      )
      (property "Value" "R" (at 0 0 90)
        (effects (font (size 1.27 1.27)))
      )
      (property "Footprint" "" (at -1.778 0 90)
        (effects (font (size 1.27 1.27)) hide)
      )
      (property "Datasheet" "~" (at 0 0 0)
        (effects (font (size 1.27 1.27)) hide)
      )
      (property "ki_keywords" "R res resistor" (at 0 0 0)
        (effects (font (size 1.27 1.27)) hide)
      )
      (property "ki_description" "Resistor" (at 0 0 0)
        (effects (font (size 1.27 1.27)) hide)
      )
      (property "ki_fp_filters" "R_*" (at 0 0 0)
        (effects (font (size 1.27 1.27)) hide)
      )
      (symbol "R_0_1"
        (rectangle (start -1.016 -2.54) (end 1.016 2.54)
          (stroke (width 0.254) (type default))
          (fill (type none))
        )
      )
      (symbol "R_1_1"
        (pin passive line (at 0 3.81 270) (length 1.27)
          (name "~" (effects (font (size 1.27 1.27))))
          (number "1" (effects (font (size 1.27 1.27))))
        )
        (pin passive line (at 0 -3.81 90) (length 1.27)
          (name "~" (effects (font (size 1.27 1.27))))
          (number "2" (effects (font (size 1.27 1.27))))
        )
      )
    )
    (symbol "Interface_CAN_LIN:TJA1051T-3" (pin_names (offset 1.016)) (in_bom yes) (on_board yes)
      (property "Reference" "U" (at -10.16 8.89 0)
        (effects (font (size 1.27 1.27)) (justify left))
      )
      (property "Value" "TJA1051T-3" (at 1.27 8.89 0)
        (effects (font (size 1.27 1.27)) (justify left))
      )
      (property "Footprint" "Package_SO:SOIC-8_3.9x4.9mm_P1.27mm" (at 0 -12.7 0)
        (effects (font (size 1.27 1.27) italic) hide)
      )
      (property "Datasheet" "http://www.nxp.com/documents/data_sheet/TJA1051.pdf" (at 0 0 0)
        (effects (font (size 1.27 1.27)) hide)
      )
      (property "ki_keywords" "High-Speed CAN Transceiver" (at 0 0 0)
        (effects (font (size 1.27 1.27)) hide)
      )
      (property "ki_description" "High-Speed CAN Transceiver, separate VIO, silent mode, SOIC-8" (at 0 0 0)
        (effects (font (size 1.27 1.27)) hide)
      )
      (property "ki_fp_filters" "SOIC*3.9x4.9mm*P1.27mm*" (at 0 0 0)
        (effects (font (size 1.27 1.27)) hide)
      )
      (symbol "TJA1051T-3_0_1"
        (rectangle (start -10.16 7.62) (end 10.16 -7.62)
          (stroke (width 0.254) (type default))
          (fill (type background))
        )
      )
      (symbol "TJA1051T-3_1_1"
        (pin input line (at -12.7 5.08 0) (length 2.54)
          (name "TXD" (effects (font (size 1.27 1.27))))
          (number "1" (effects (font (size 1.27 1.27))))
        )
        (pin power_in line (at 0 -10.16 90) (length 2.54)
          (name "GND" (effects (font (size 1.27 1.27))))
          (number "2" (effects (font (size 1.27 1.27))))
        )
        (pin power_in line (at 0 10.16 270) (length 2.54)
          (name "VCC" (effects (font (size 1.27 1.27))))
          (number "3" (effects (font (size 1.27 1.27))))
        )
        (pin output line (at -12.7 2.54 0) (length 2.54)
          (name "RXD" (effects (font (size 1.27 1.27))))
          (number "4" (effects (font (size 1.27 1.27))))
        )
        (pin power_in line (at -12.7 -2.54 0) (length 2.54)
          (name "VIO" (effects (font (size 1.27 1.27))))
          (number "5" (effects (font (size 1.27 1.27))))
        )
        (pin bidirectional line (at 12.7 -2.54 180) (length 2.54)
          (name "CANL" (effects (font (size 1.27 1.27))))
          (number "6" (effects (font (size 1.27 1.27))))
        )
        (pin bidirectional line (at 12.7 2.54 180) (length 2.54)
          (name "CANH" (effects (font (size 1.27 1.27))))
          (number "7" (effects (font (size 1.27 1.27))))
        )
        (pin input line (at -12.7 -5.08 0) (length 2.54)
          (name "S" (effects (font (size 1.27 1.27))))
          (number "8" (effects (font (size 1.27 1.27))))
        )
      )
    )
    (symbol "power:+3V3" (power) (pin_names (offset 0)) (in_bom yes) (on_board yes)
      (property "Reference" "#PWR" (at 0 -3.81 0)
        (effects (font (size 1.27 1.27)) hide)
      )
      (property "Value" "+3V3" (at 0 3.556 0)
        (effects (font (size 1.27 1.27)))
      )
      (property "Footprint" "" (at 0 0 0)
        (effects (font (size 1.27 1.27)) hide)
      )
      (property "Datasheet" "" (at 0 0 0)
        (effects (font (size 1.27 1.27)) hide)
      )
      (property "ki_keywords" "global power" (at 0 0 0)
        (effects (font (size 1.27 1.27)) hide)
      )
      (property "ki_description" "Power symbol creates a global label with name \"+3V3\"" (at 0 0 0)
        (effects (font (size 1.27 1.27)) hide)
      )
      (symbol "+3V3_0_1"
        (polyline
          (pts
            (xy -0.762 1.27)
            (xy 0 2.54)
          )
          (stroke (width 0) (type default))
          (fill (type none))
        )
        (polyline
          (pts
            (xy 0 0)
            (xy 0 2.54)
          )
          (stroke (width 0) (type default))
          (fill (type none))
        )
        (polyline
          (pts
            (xy 0 2.54)
            (xy 0.762 1.27)
          )
          (stroke (width 0) (type default))
          (fill (type none))
        )
      )
      (symbol "+3V3_1_1"
        (pin power_in line (at 0 0 90) (length 0) hide
          (name "+3V3" (effects (font (size 1.27 1.27))))
          (number "1" (effects (font (size 1.27 1.27))))
        )
      )
    )
    (symbol "power:+5V" (power) (pin_names (offset 0)) (in_bom yes) (on_board yes)
      (property "Reference" "#PWR" (at 0 -3.81 0)
        (effects (font (size 1.27 1.27)) hide)
      )
      (property "Value" "+5V" (at 0 3.556 0)
        (effects (font (size 1.27 1.27)))
      )
      (property "Footprint" "" (at 0 0 0)
        (effects (font (size 1.27 1.27)) hide)
      )
      (property "Datasheet" "" (at 0 0 0)
        (effects (font (size 1.27 1.27)) hide)
      )
      (property "ki_keywords" "power-flag" (at 0 0 0)
        (effects (font (size 1.27 1.27)) hide)
      )
      (property "ki_description" "Power symbol creates a global label with name \"+5V\"" (at 0 0 0)
        (effects (font (size 1.27 1.27)) hide)
      )
      (symbol "+5V_0_1"
        (polyline
          (pts
            (xy -0.762 1.27)
            (xy 0 2.54)
          )
          (stroke (width 0) (type default))
          (fill (type none))
        )
        (polyline
          (pts
            (xy 0 0)
            (xy 0 2.54)
          )
          (stroke (width 0) (type default))
          (fill (type none))
        )
        (polyline
          (pts
            (xy 0 2.54)
            (xy 0.762 1.27)
          )
          (stroke (width 0) (type default))
          (fill (type none))
        )
      )
      (symbol "+5V_1_1"
        (pin power_in line (at 0 0 90) (length 0) hide
          (name "+5V" (effects (font (size 1.27 1.27))))
          (number "1" (effects (font (size 1.27 1.27))))
        )
      )
    )
    (symbol "power:GND" (power) (pin_names (offset 0)) (in_bom yes) (on_board yes)
      (property "Reference" "#PWR" (at 0 -6.35 0)
        (effects (font (size 1.27 1.27)) hide)
      )
      (property "Value" "GND" (at 0 -3.81 0)
        (effects (font (size 1.27 1.27)))
      )
      (property "Footprint" "" (at 0 0 0)
        (effects (font (size 1.27 1.27)) hide)
      )
      (property "Datasheet" "" (at 0 0 0)
        (effects (font (size 1.27 1.27)) hide)
      )
      (property "ki_keywords" "power-flag" (at 0 0 0)
        (effects (font (size 1.27 1.27)) hide)
      )
      (property "ki_description" "Power symbol creates a global label with name \"GND\" , ground" (at 0 0 0)
        (effects (font (size 1.27 1.27)) hide)
      )
      (symbol "GND_0_1"
        (polyline
          (pts
            (xy 0 0)
            (xy 0 -1.27)
            (xy 1.27 -1.27)
            (xy 0 -2.54)
            (xy -1.27 -1.27)
            (xy 0 -1.27)
          )
          (stroke (width 0) (type default))
          (fill (type none))
        )
      )
      (symbol "GND_1_1"
        (pin power_in line (at 0 0 270) (length 0) hide
          (name "GND" (effects (font (size 1.27 1.27))))
          (number "1" (effects (font (size 1.27 1.27))))
        )
      )
    )
  )

  (junction (at 110.49 93.98) (diameter 0) (color 0 0 0 0)
    (uuid 3bd0fbf7-b040-4326-82a8-85e13a9a1963)
  )
  (junction (at 171.45 83.82) (diameter 0) (color 0 0 0 0)
    (uuid 3f1c2294-e0ef-48e6-8291-308abe586a49)
  )
  (junction (at 153.67 77.47) (diameter 0) (color 0 0 0 0)
    (uuid 89cfe9be-1d87-4375-afab-82c7f2e91bdb)
  )
  (junction (at 171.45 93.98) (diameter 0) (color 0 0 0 0)
    (uuid 9cb7de84-50b6-4a56-ac69-dcda93819ba9)
  )
  (junction (at 128.27 91.44) (diameter 0) (color 0 0 0 0)
    (uuid e147818a-68bb-4de2-9920-cbda806f72a6)
  )

  (wire (pts (xy 110.49 95.25) (xy 110.49 93.98))
    (stroke (width 0) (type default))
    (uuid 0f38c1db-5813-48b3-8a16-776fb095282d)
  )
  (wire (pts (xy 171.45 92.71) (xy 171.45 93.98))
    (stroke (width 0) (type default))
    (uuid 2075b7cd-1e68-4018-b784-9ebf2ac0473c)
  )
  (wire (pts (xy 166.37 83.82) (xy 171.45 83.82))
    (stroke (width 0) (type default))
    (uuid 48617618-6381-4ecc-896f-e515da58bd02)
  )
  (wire (pts (xy 128.27 91.44) (xy 140.97 91.44))
    (stroke (width 0) (type default))
    (uuid 4df8530a-bda5-486c-84bd-8bf5625fe779)
  )
  (wire (pts (xy 166.37 86.36) (xy 166.37 83.82))
    (stroke (width 0) (type default))
    (uuid 5801a107-4faa-42ea-a508-63e3bf553358)
  )
  (wire (pts (xy 153.67 76.2) (xy 153.67 77.47))
    (stroke (width 0) (type default))
    (uuid 58762a37-ede5-4848-b6ac-971b7c5181ae)
  )
  (wire (pts (xy 110.49 93.98) (xy 140.97 93.98))
    (stroke (width 0) (type default))
    (uuid 5e32854c-316a-4aac-9835-5b7311e10e9e)
  )
  (wire (pts (xy 171.45 83.82) (xy 171.45 85.09))
    (stroke (width 0) (type default))
    (uuid 88f137c8-1512-4139-b595-36ec6d271114)
  )
  (wire (pts (xy 109.22 93.98) (xy 110.49 93.98))
    (stroke (width 0) (type default))
    (uuid 8f7c8c90-50d1-47c4-868c-a0e70d4cb0f6)
  )
  (wire (pts (xy 171.45 83.82) (xy 179.07 83.82))
    (stroke (width 0) (type default))
    (uuid ab49b103-41b7-4024-948f-9edc9992e4c1)
  )
  (wire (pts (xy 153.67 77.47) (xy 161.29 77.47))
    (stroke (width 0) (type default))
    (uuid bb710fe5-b259-4aa4-9d79-398163619395)
  )
  (wire (pts (xy 153.67 77.47) (xy 153.67 78.74))
    (stroke (width 0) (type default))
    (uuid c17a5fc8-3899-4de5-bb2e-7847ba186a08)
  )
  (wire (pts (xy 166.37 93.98) (xy 166.37 91.44))
    (stroke (width 0) (type default))
    (uuid cccb182b-f904-42e8-a1fb-13500fc3db1c)
  )
  (wire (pts (xy 171.45 93.98) (xy 166.37 93.98))
    (stroke (width 0) (type default))
    (uuid d08dabd4-a5a3-407a-83ea-2320fb255009)
  )
  (wire (pts (xy 128.27 91.44) (xy 128.27 96.52))
    (stroke (width 0) (type default))
    (uuid d1417bba-5cbc-44d4-8380-49849561c48a)
  )
  (wire (pts (xy 171.45 93.98) (xy 179.07 93.98))
    (stroke (width 0) (type default))
    (uuid ee134a83-8ce9-476f-9385-e1a26780d662)
  )
  (wire (pts (xy 128.27 86.36) (xy 128.27 91.44))
    (stroke (width 0) (type default))
    (uuid fff017b5-2528-4440-8acf-4dd1b6e50386)
  )

  (hierarchical_label "CAN_RX" (shape output) (at 177.8 114.3 90) (fields_autoplaced)
    (effects (font (size 1.27 1.27)) (justify left))
    (uuid 080bc54e-0a64-440b-8301-ee2cd56eea10)
  )
  (hierarchical_label "CAN_HIGH" (shape bidirectional) (at 179.07 83.82 0) (fields_autoplaced)
    (effects (font (size 1.27 1.27)) (justify left))
    (uuid 1f9cc78f-4c58-4025-872a-5b6c5db9ba5d)
  )
  (hierarchical_label "CAN_LOW" (shape bidirectional) (at 179.07 93.98 0) (fields_autoplaced)
    (effects (font (size 1.27 1.27)) (justify left))
    (uuid 3cfc34c7-7fd8-4bc8-83ee-71c39071bab6)
  )
  (hierarchical_label "CAN_TX" (shape input) (at 168.91 114.3 90) (fields_autoplaced)
    (effects (font (size 1.27 1.27)) (justify left))
    (uuid 665faf66-a1c5-4bde-a4a2-a4c9d2cdf0fb)
  )
  (hierarchical_label "CAN_SILENT" (shape input) (at 109.22 93.98 180) (fields_autoplaced)
    (effects (font (size 1.27 1.27)) (justify right))
    (uuid a1c5ca84-5e01-4455-922d-a01b5f42a845)
  )
  (hierarchical_label "CAN_TX" (shape input) (at 140.97 83.82 180) (fields_autoplaced)
    (effects (font (size 1.27 1.27)) (justify right))
    (uuid e27e0175-eca3-476e-b68f-6aeb0ee3d814)
  )
  (hierarchical_label "CAN_RX" (shape output) (at 140.97 86.36 180) (fields_autoplaced)
    (effects (font (size 1.27 1.27)) (justify right))
    (uuid f44fbade-e516-439b-a3d3-fe191d582622)
  )

  (symbol (lib_id "Device:C") (at 161.29 73.66 0) (unit 1)
    (in_bom yes) (on_board yes) (dnp no) (fields_autoplaced)
    (uuid 02186b95-8f46-413e-9335-97a339ccc644)
    (property "Reference" "C?" (at 165.1 72.3899 0)
      (effects (font (size 1.27 1.27)) (justify left))
    )
    (property "Value" "100n" (at 165.1 74.9299 0)
      (effects (font (size 1.27 1.27)) (justify left))
    )
    (property "Footprint" "Capacitor_SMD:C_0603_1608Metric" (at 162.2552 77.47 0)
      (effects (font (size 1.27 1.27)) hide)
    )
    (property "Datasheet" "~" (at 161.29 73.66 0)
      (effects (font (size 1.27 1.27)) hide)
    )
    (pin "1" (uuid 3f9d0f2a-85df-45fc-add3-039bbc19e773))
    (pin "2" (uuid 388013fc-62c0-45b1-ab1a-3d4ff86116f3))
    (instances
      (project "Satellite"
        (path "/e63e39d7-6ac0-4ffd-8aa3-1841a4541b55"
          (reference "C?") (unit 1)
        )
        (path "/e63e39d7-6ac0-4ffd-8aa3-1841a4541b55/a7cd1d5d-fc52-48a5-9f1a-2eb496f13c9f"
          (reference "C21") (unit 1)
        )
      )
    )
  )

  (symbol (lib_id "Interface_CAN_LIN:TJA1051T-3") (at 153.67 88.9 0) (unit 1)
    (in_bom yes) (on_board yes) (dnp no) (fields_autoplaced)
    (uuid 0a1ce468-43d4-4014-a11a-fcdb5d34153e)
    (property "Reference" "U?" (at 155.6894 76.2 0)
      (effects (font (size 1.27 1.27)) (justify left))
    )
    (property "Value" "TJA1051T-3" (at 155.6894 78.74 0)
      (effects (font (size 1.27 1.27)) (justify left))
    )
    (property "Footprint" "Package_SO:SOIC-8_3.9x4.9mm_P1.27mm" (at 153.67 101.6 0)
      (effects (font (size 1.27 1.27) italic) hide)
    )
    (property "Datasheet" "http://www.nxp.com/documents/data_sheet/TJA1051.pdf" (at 153.67 88.9 0)
      (effects (font (size 1.27 1.27)) hide)
    )
    (property "DigiKey" "568-8684-1-ND" (at 153.67 88.9 0)
      (effects (font (size 1.27 1.27)) hide)
    )
    (pin "1" (uuid 5ea39658-95da-468c-bc26-f5d448fa662d))
    (pin "2" (uuid 6c039220-c4a2-40fc-a5ec-5790106cbf37))
    (pin "3" (uuid 55f57d89-dd2c-4dd5-b030-fb0f95f7b41c))
    (pin "4" (uuid ffe5e64b-6b25-4d97-ad57-50b302cc80c2))
    (pin "5" (uuid 5ef94fa8-59e0-46f7-b7e9-b89e2097f185))
    (pin "6" (uuid 2193618c-8ccb-4b1a-a0f4-79119f5253a6))
    (pin "7" (uuid c95e82e2-636a-401a-8ccd-30f995c58309))
    (pin "8" (uuid 7ba898a4-6afd-40c2-a516-aee61665ac0e))
    (instances
      (project "Satellite"
        (path "/e63e39d7-6ac0-4ffd-8aa3-1841a4541b55"
          (reference "U?") (unit 1)
        )
        (path "/e63e39d7-6ac0-4ffd-8aa3-1841a4541b55/a7cd1d5d-fc52-48a5-9f1a-2eb496f13c9f"
          (reference "U3") (unit 1)
        )
      )
    )
  )

  (symbol (lib_id "Device:R") (at 171.45 88.9 0) (unit 1)
    (in_bom yes) (on_board yes) (dnp no) (fields_autoplaced)
    (uuid 21ef3a8b-5d31-487f-b883-aafb8ef92471)
    (property "Reference" "R?" (at 173.99 87.6299 0)
      (effects (font (size 1.27 1.27)) (justify left))
    )
    (property "Value" "120" (at 173.99 90.1699 0)
      (effects (font (size 1.27 1.27)) (justify left))
    )
    (property "Footprint" "Resistor_SMD:R_0603_1608Metric" (at 169.672 88.9 90)
      (effects (font (size 1.27 1.27)) hide)
    )
    (property "Datasheet" "~" (at 171.45 88.9 0)
      (effects (font (size 1.27 1.27)) hide)
    )
    (pin "1" (uuid fdbb11fe-2917-4d61-9365-47833a1578fb))
    (pin "2" (uuid d4b006c1-d73d-4e2e-921c-f3ba19fc9bd9))
    (instances
      (project "Satellite"
        (path "/e63e39d7-6ac0-4ffd-8aa3-1841a4541b55"
          (reference "R?") (unit 1)
        )
        (path "/e63e39d7-6ac0-4ffd-8aa3-1841a4541b55/a7cd1d5d-fc52-48a5-9f1a-2eb496f13c9f"
          (reference "R7") (unit 1)
        )
      )
    )
  )

  (symbol (lib_id "power:GND") (at 153.67 99.06 0) (unit 1)
    (in_bom yes) (on_board yes) (dnp no) (fields_autoplaced)
    (uuid 2a4f2259-3c58-4693-aa44-1ed1d8cbfd3d)
    (property "Reference" "#PWR?" (at 153.67 105.41 0)
      (effects (font (size 1.27 1.27)) hide)
    )
    (property "Value" "GND" (at 153.67 104.14 0)
      (effects (font (size 1.27 1.27)))
    )
    (property "Footprint" "" (at 153.67 99.06 0)
      (effects (font (size 1.27 1.27)) hide)
    )
    (property "Datasheet" "" (at 153.67 99.06 0)
      (effects (font (size 1.27 1.27)) hide)
    )
    (pin "1" (uuid 5422e256-7b06-4511-8674-31dcf8ba843c))
    (instances
      (project "Satellite"
        (path "/e63e39d7-6ac0-4ffd-8aa3-1841a4541b55"
          (reference "#PWR?") (unit 1)
        )
        (path "/e63e39d7-6ac0-4ffd-8aa3-1841a4541b55/a7cd1d5d-fc52-48a5-9f1a-2eb496f13c9f"
          (reference "#PWR033") (unit 1)
        )
      )
    )
  )

  (symbol (lib_id "Device:C") (at 128.27 100.33 0) (unit 1)
    (in_bom yes) (on_board yes) (dnp no) (fields_autoplaced)
    (uuid 2b1a3303-7772-4af1-96b3-a7a2092ab717)
    (property "Reference" "C?" (at 132.08 99.0599 0)
      (effects (font (size 1.27 1.27)) (justify left))
    )
    (property "Value" "100n" (at 132.08 101.5999 0)
      (effects (font (size 1.27 1.27)) (justify left))
    )
    (property "Footprint" "Capacitor_SMD:C_0603_1608Metric" (at 129.2352 104.14 0)
      (effects (font (size 1.27 1.27)) hide)
    )
    (property "Datasheet" "~" (at 128.27 100.33 0)
      (effects (font (size 1.27 1.27)) hide)
    )
    (pin "1" (uuid dd852c59-ec36-467a-a1c1-90e851f6eb4e))
    (pin "2" (uuid 7aaa5ad6-d3cd-46c7-9835-c6a8fc4343a6))
    (instances
      (project "Satellite"
        (path "/e63e39d7-6ac0-4ffd-8aa3-1841a4541b55"
          (reference "C?") (unit 1)
        )
        (path "/e63e39d7-6ac0-4ffd-8aa3-1841a4541b55/a7cd1d5d-fc52-48a5-9f1a-2eb496f13c9f"
          (reference "C20") (unit 1)
        )
      )
    )
  )

  (symbol (lib_id "Device:R") (at 110.49 99.06 0) (unit 1)
    (in_bom yes) (on_board yes) (dnp no) (fields_autoplaced)
    (uuid 39216eff-3370-40e7-adb8-e218beaa2074)
    (property "Reference" "R?" (at 113.03 97.7899 0)
      (effects (font (size 1.27 1.27)) (justify left))
    )
    (property "Value" "10k" (at 113.03 100.3299 0)
      (effects (font (size 1.27 1.27)) (justify left))
    )
    (property "Footprint" "Resistor_SMD:R_0603_1608Metric" (at 108.712 99.06 90)
      (effects (font (size 1.27 1.27)) hide)
    )
    (property "Datasheet" "~" (at 110.49 99.06 0)
      (effects (font (size 1.27 1.27)) hide)
    )
    (pin "1" (uuid fa4a1888-3cfe-4441-b67a-e946642778e4))
    (pin "2" (uuid a800a6a7-7f1f-4e32-8bfb-c716aecb98db))
    (instances
      (project "Satellite"
        (path "/e63e39d7-6ac0-4ffd-8aa3-1841a4541b55"
          (reference "R?") (unit 1)
        )
        (path "/e63e39d7-6ac0-4ffd-8aa3-1841a4541b55/a7cd1d5d-fc52-48a5-9f1a-2eb496f13c9f"
          (reference "R6") (unit 1)
        )
      )
    )
  )

  (symbol (lib_id "Connector:TestPoint") (at 168.91 114.3 180) (unit 1)
    (in_bom yes) (on_board yes) (dnp no) (fields_autoplaced)
    (uuid 644c7e93-d55d-4db8-809c-5c3cb57ee2bf)
    (property "Reference" "TP2" (at 171.45 117.602 0)
      (effects (font (size 1.27 1.27)) (justify right))
    )
    (property "Value" "TestPoint" (at 171.45 118.872 0)
      (effects (font (size 1.27 1.27)) (justify right) hide)
    )
    (property "Footprint" "TestPoint:TestPoint_Pad_D1.0mm" (at 163.83 114.3 0)
      (effects (font (size 1.27 1.27)) hide)
    )
    (property "Datasheet" "~" (at 163.83 114.3 0)
      (effects (font (size 1.27 1.27)) hide)
    )
    (pin "1" (uuid 4b9e1cc1-cde4-4fbb-937b-f2c370b5dcf0))
    (instances
      (project "Satellite"
        (path "/e63e39d7-6ac0-4ffd-8aa3-1841a4541b55"
          (reference "TP2") (unit 1)
        )
        (path "/e63e39d7-6ac0-4ffd-8aa3-1841a4541b55/a7cd1d5d-fc52-48a5-9f1a-2eb496f13c9f"
          (reference "TP2") (unit 1)
        )
      )
    )
  )

  (symbol (lib_id "Connector:TestPoint") (at 177.8 114.3 180) (unit 1)
    (in_bom yes) (on_board yes) (dnp no) (fields_autoplaced)
    (uuid 6c9e6b83-314b-43e0-a791-5d5dd8ffef57)
    (property "Reference" "TP4" (at 180.34 117.602 0)
      (effects (font (size 1.27 1.27)) (justify right))
    )
    (property "Value" "TestPoint" (at 180.34 118.872 0)
      (effects (font (size 1.27 1.27)) (justify right) hide)
    )
    (property "Footprint" "TestPoint:TestPoint_Pad_D1.0mm" (at 172.72 114.3 0)
      (effects (font (size 1.27 1.27)) hide)
    )
    (property "Datasheet" "~" (at 172.72 114.3 0)
      (effects (font (size 1.27 1.27)) hide)
    )
    (pin "1" (uuid b70c1af5-8deb-4aa4-bf77-3bc911eb8b43))
    (instances
      (project "Satellite"
        (path "/e63e39d7-6ac0-4ffd-8aa3-1841a4541b55"
          (reference "TP4") (unit 1)
        )
        (path "/e63e39d7-6ac0-4ffd-8aa3-1841a4541b55/a7cd1d5d-fc52-48a5-9f1a-2eb496f13c9f"
          (reference "TP4") (unit 1)
        )
      )
    )
  )

  (symbol (lib_id "power:+3V3") (at 128.27 86.36 0) (unit 1)
    (in_bom yes) (on_board yes) (dnp no) (fields_autoplaced)
    (uuid 7ddf4722-888f-4a08-bb23-bcd0a4835279)
    (property "Reference" "#PWR016" (at 128.27 90.17 0)
      (effects (font (size 1.27 1.27)) hide)
    )
    (property "Value" "+3V3" (at 128.27 81.28 0)
      (effects (font (size 1.27 1.27)))
    )
    (property "Footprint" "" (at 128.27 86.36 0)
      (effects (font (size 1.27 1.27)) hide)
    )
    (property "Datasheet" "" (at 128.27 86.36 0)
      (effects (font (size 1.27 1.27)) hide)
    )
    (pin "1" (uuid d0655328-f679-4b18-be19-a4c80507be71))
    (instances
      (project "Satellite"
        (path "/e63e39d7-6ac0-4ffd-8aa3-1841a4541b55/48e34a60-0fd9-49b2-a181-7796a83b6b0e"
          (reference "#PWR016") (unit 1)
        )
        (path "/e63e39d7-6ac0-4ffd-8aa3-1841a4541b55/a7cd1d5d-fc52-48a5-9f1a-2eb496f13c9f"
          (reference "#PWR030") (unit 1)
        )
      )
    )
  )

  (symbol (lib_id "power:GND") (at 110.49 102.87 0) (unit 1)
    (in_bom yes) (on_board yes) (dnp no) (fields_autoplaced)
    (uuid 81584427-9de6-48d8-81c0-03989c370fd1)
    (property "Reference" "#PWR?" (at 110.49 109.22 0)
      (effects (font (size 1.27 1.27)) hide)
    )
    (property "Value" "GND" (at 110.49 107.95 0)
      (effects (font (size 1.27 1.27)))
    )
    (property "Footprint" "" (at 110.49 102.87 0)
      (effects (font (size 1.27 1.27)) hide)
    )
    (property "Datasheet" "" (at 110.49 102.87 0)
      (effects (font (size 1.27 1.27)) hide)
    )
    (pin "1" (uuid cba93a88-3686-4aaa-b4af-2469a0891a68))
    (instances
      (project "Satellite"
        (path "/e63e39d7-6ac0-4ffd-8aa3-1841a4541b55"
          (reference "#PWR?") (unit 1)
        )
        (path "/e63e39d7-6ac0-4ffd-8aa3-1841a4541b55/a7cd1d5d-fc52-48a5-9f1a-2eb496f13c9f"
          (reference "#PWR029") (unit 1)
        )
      )
    )
  )

  (symbol (lib_id "power:GND") (at 161.29 69.85 180) (unit 1)
    (in_bom yes) (on_board yes) (dnp no) (fields_autoplaced)
    (uuid ad76c453-ae74-4c7e-be8e-78edc21e17b0)
    (property "Reference" "#PWR?" (at 161.29 63.5 0)
      (effects (font (size 1.27 1.27)) hide)
    )
    (property "Value" "GND" (at 163.83 68.5799 0)
      (effects (font (size 1.27 1.27)) (justify right))
    )
    (property "Footprint" "" (at 161.29 69.85 0)
      (effects (font (size 1.27 1.27)) hide)
    )
    (property "Datasheet" "" (at 161.29 69.85 0)
      (effects (font (size 1.27 1.27)) hide)
    )
    (pin "1" (uuid 29ff967a-c403-4d9f-8a5a-7d747064cf21))
    (instances
      (project "Satellite"
        (path "/e63e39d7-6ac0-4ffd-8aa3-1841a4541b55"
          (reference "#PWR?") (unit 1)
        )
        (path "/e63e39d7-6ac0-4ffd-8aa3-1841a4541b55/a7cd1d5d-fc52-48a5-9f1a-2eb496f13c9f"
          (reference "#PWR034") (unit 1)
        )
      )
    )
  )

  (symbol (lib_id "power:GND") (at 128.27 104.14 0) (unit 1)
    (in_bom yes) (on_board yes) (dnp no) (fields_autoplaced)
    (uuid faf8888d-5af8-464e-9b6e-ef1c2ace2d14)
    (property "Reference" "#PWR?" (at 128.27 110.49 0)
      (effects (font (size 1.27 1.27)) hide)
    )
    (property "Value" "GND" (at 128.27 109.22 0)
      (effects (font (size 1.27 1.27)))
    )
    (property "Footprint" "" (at 128.27 104.14 0)
      (effects (font (size 1.27 1.27)) hide)
    )
    (property "Datasheet" "" (at 128.27 104.14 0)
      (effects (font (size 1.27 1.27)) hide)
    )
    (pin "1" (uuid 627832e9-69cf-48e7-9457-c95cbb6faa78))
    (instances
      (project "Satellite"
        (path "/e63e39d7-6ac0-4ffd-8aa3-1841a4541b55"
          (reference "#PWR?") (unit 1)
        )
        (path "/e63e39d7-6ac0-4ffd-8aa3-1841a4541b55/a7cd1d5d-fc52-48a5-9f1a-2eb496f13c9f"
          (reference "#PWR031") (unit 1)
        )
      )
    )
  )

  (symbol (lib_id "power:+5V") (at 153.67 76.2 0) (unit 1)
    (in_bom yes) (on_board yes) (dnp no) (fields_autoplaced)
    (uuid fd48a925-7172-4797-a495-6cea6b70444e)
    (property "Reference" "#PWR?" (at 153.67 80.01 0)
      (effects (font (size 1.27 1.27)) hide)
    )
    (property "Value" "+5V" (at 153.67 71.12 0)
      (effects (font (size 1.27 1.27)))
    )
    (property "Footprint" "" (at 153.67 76.2 0)
      (effects (font (size 1.27 1.27)) hide)
    )
    (property "Datasheet" "" (at 153.67 76.2 0)
      (effects (font (size 1.27 1.27)) hide)
    )
    (pin "1" (uuid 56e12520-e447-492b-873e-7759c28ff572))
    (instances
      (project "Satellite"
        (path "/e63e39d7-6ac0-4ffd-8aa3-1841a4541b55"
          (reference "#PWR?") (unit 1)
        )
        (path "/e63e39d7-6ac0-4ffd-8aa3-1841a4541b55/a7cd1d5d-fc52-48a5-9f1a-2eb496f13c9f"
          (reference "#PWR032") (unit 1)
        )
      )
    )
  )
)
