(kicad_sch (version 20230121) (generator eeschema)

  (uuid 46cfc2a6-8667-41b6-a8c9-0dbcd14f5771)

  (paper "A4")

  (lib_symbols
    (symbol "Device:R" (pin_numbers hide) (pin_names (offset 0)) (in_bom yes) (on_board yes)
      (property "Reference" "R" (at 2.032 0 90)
        (effects (font (size 1.27 1.27)))
      )
      (property "Value" "R" (at 0 0 90)
        (effects (font (size 1.27 1.27)))
      )
      (property "Footprint" "" (at -1.778 0 90)
        (effects (font (size 1.27 1.27)) hide)
      )
      (property "Datasheet" "~" (at 0 0 0)
        (effects (font (size 1.27 1.27)) hide)
      )
      (property "ki_keywords" "R res resistor" (at 0 0 0)
        (effects (font (size 1.27 1.27)) hide)
      )
      (property "ki_description" "Resistor" (at 0 0 0)
        (effects (font (size 1.27 1.27)) hide)
      )
      (property "ki_fp_filters" "R_*" (at 0 0 0)
        (effects (font (size 1.27 1.27)) hide)
      )
      (symbol "R_0_1"
        (rectangle (start -1.016 -2.54) (end 1.016 2.54)
          (stroke (width 0.254) (type default))
          (fill (type none))
        )
      )
      (symbol "R_1_1"
        (pin passive line (at 0 3.81 270) (length 1.27)
          (name "~" (effects (font (size 1.27 1.27))))
          (number "1" (effects (font (size 1.27 1.27))))
        )
        (pin passive line (at 0 -3.81 90) (length 1.27)
          (name "~" (effects (font (size 1.27 1.27))))
          (number "2" (effects (font (size 1.27 1.27))))
        )
      )
    )
    (symbol "Simulation_SPICE:NMOS" (pin_numbers hide) (pin_names (offset 0)) (in_bom yes) (on_board yes)
      (property "Reference" "Q" (at 5.08 1.27 0)
        (effects (font (size 1.27 1.27)) (justify left))
      )
      (property "Value" "NMOS" (at 5.08 -1.27 0)
        (effects (font (size 1.27 1.27)) (justify left))
      )
      (property "Footprint" "" (at 5.08 2.54 0)
        (effects (font (size 1.27 1.27)) hide)
      )
      (property "Datasheet" "https://ngspice.sourceforge.io/docs/ngspice-manual.pdf" (at 0 -12.7 0)
        (effects (font (size 1.27 1.27)) hide)
      )
      (property "Sim.Device" "NMOS" (at 0 -17.145 0)
        (effects (font (size 1.27 1.27)) hide)
      )
      (property "Sim.Type" "VDMOS" (at 0 -19.05 0)
        (effects (font (size 1.27 1.27)) hide)
      )
      (property "Sim.Pins" "1=D 2=G 3=S" (at 0 -15.24 0)
        (effects (font (size 1.27 1.27)) hide)
      )
      (property "ki_keywords" "transistor NMOS N-MOS N-MOSFET simulation" (at 0 0 0)
        (effects (font (size 1.27 1.27)) hide)
      )
      (property "ki_description" "N-MOSFET transistor, drain/source/gate" (at 0 0 0)
        (effects (font (size 1.27 1.27)) hide)
      )
      (symbol "NMOS_0_1"
        (polyline
          (pts
            (xy 0.254 0)
            (xy -2.54 0)
          )
          (stroke (width 0) (type default))
          (fill (type none))
        )
        (polyline
          (pts
            (xy 0.254 1.905)
            (xy 0.254 -1.905)
          )
          (stroke (width 0.254) (type default))
          (fill (type none))
        )
        (polyline
          (pts
            (xy 0.762 -1.27)
            (xy 0.762 -2.286)
          )
          (stroke (width 0.254) (type default))
          (fill (type none))
        )
        (polyline
          (pts
            (xy 0.762 0.508)
            (xy 0.762 -0.508)
          )
          (stroke (width 0.254) (type default))
          (fill (type none))
        )
        (polyline
          (pts
            (xy 0.762 2.286)
            (xy 0.762 1.27)
          )
          (stroke (width 0.254) (type default))
          (fill (type none))
        )
        (polyline
          (pts
            (xy 2.54 2.54)
            (xy 2.54 1.778)
          )
          (stroke (width 0) (type default))
          (fill (type none))
        )
        (polyline
          (pts
            (xy 2.54 -2.54)
            (xy 2.54 0)
            (xy 0.762 0)
          )
          (stroke (width 0) (type default))
          (fill (type none))
        )
        (polyline
          (pts
            (xy 0.762 -1.778)
            (xy 3.302 -1.778)
            (xy 3.302 1.778)
            (xy 0.762 1.778)
          )
          (stroke (width 0) (type default))
          (fill (type none))
        )
        (polyline
          (pts
            (xy 1.016 0)
            (xy 2.032 0.381)
            (xy 2.032 -0.381)
            (xy 1.016 0)
          )
          (stroke (width 0) (type default))
          (fill (type outline))
        )
        (polyline
          (pts
            (xy 2.794 0.508)
            (xy 2.921 0.381)
            (xy 3.683 0.381)
            (xy 3.81 0.254)
          )
          (stroke (width 0) (type default))
          (fill (type none))
        )
        (polyline
          (pts
            (xy 3.302 0.381)
            (xy 2.921 -0.254)
            (xy 3.683 -0.254)
            (xy 3.302 0.381)
          )
          (stroke (width 0) (type default))
          (fill (type none))
        )
        (circle (center 1.651 0) (radius 2.794)
          (stroke (width 0.254) (type default))
          (fill (type none))
        )
        (circle (center 2.54 -1.778) (radius 0.254)
          (stroke (width 0) (type default))
          (fill (type outline))
        )
        (circle (center 2.54 1.778) (radius 0.254)
          (stroke (width 0) (type default))
          (fill (type outline))
        )
      )
      (symbol "NMOS_1_1"
        (pin passive line (at 2.54 5.08 270) (length 2.54)
          (name "D" (effects (font (size 1.27 1.27))))
          (number "1" (effects (font (size 1.27 1.27))))
        )
        (pin input line (at -5.08 0 0) (length 2.54)
          (name "G" (effects (font (size 1.27 1.27))))
          (number "2" (effects (font (size 1.27 1.27))))
        )
        (pin passive line (at 2.54 -5.08 90) (length 2.54)
          (name "S" (effects (font (size 1.27 1.27))))
          (number "3" (effects (font (size 1.27 1.27))))
        )
      )
    )
    (symbol "Simulation_SPICE:PMOS" (pin_numbers hide) (pin_names (offset 0)) (in_bom yes) (on_board yes)
      (property "Reference" "Q" (at 5.08 1.27 0)
        (effects (font (size 1.27 1.27)) (justify left))
      )
      (property "Value" "PMOS" (at 5.08 -1.27 0)
        (effects (font (size 1.27 1.27)) (justify left))
      )
      (property "Footprint" "" (at 5.08 2.54 0)
        (effects (font (size 1.27 1.27)) hide)
      )
      (property "Datasheet" "https://ngspice.sourceforge.io/docs/ngspice-manual.pdf" (at 0 -12.7 0)
        (effects (font (size 1.27 1.27)) hide)
      )
      (property "Sim.Device" "PMOS" (at 0 -17.145 0)
        (effects (font (size 1.27 1.27)) hide)
      )
      (property "Sim.Type" "VDMOS" (at 0 -19.05 0)
        (effects (font (size 1.27 1.27)) hide)
      )
      (property "Sim.Pins" "1=D 2=G 3=S" (at 0 -15.24 0)
        (effects (font (size 1.27 1.27)) hide)
      )
      (property "ki_keywords" "transistor PMOS P-MOS P-MOSFET simulation" (at 0 0 0)
        (effects (font (size 1.27 1.27)) hide)
      )
      (property "ki_description" "P-MOSFET transistor, drain/source/gate" (at 0 0 0)
        (effects (font (size 1.27 1.27)) hide)
      )
      (symbol "PMOS_0_1"
        (polyline
          (pts
            (xy 0.254 0)
            (xy -2.54 0)
          )
          (stroke (width 0) (type default))
          (fill (type none))
        )
        (polyline
          (pts
            (xy 0.254 1.905)
            (xy 0.254 -1.905)
          )
          (stroke (width 0.254) (type default))
          (fill (type none))
        )
        (polyline
          (pts
            (xy 0.762 -1.27)
            (xy 0.762 -2.286)
          )
          (stroke (width 0.254) (type default))
          (fill (type none))
        )
        (polyline
          (pts
            (xy 0.762 0.508)
            (xy 0.762 -0.508)
          )
          (stroke (width 0.254) (type default))
          (fill (type none))
        )
        (polyline
          (pts
            (xy 0.762 2.286)
            (xy 0.762 1.27)
          )
          (stroke (width 0.254) (type default))
          (fill (type none))
        )
        (polyline
          (pts
            (xy 2.54 2.54)
            (xy 2.54 1.778)
          )
          (stroke (width 0) (type default))
          (fill (type none))
        )
        (polyline
          (pts
            (xy 2.54 -2.54)
            (xy 2.54 0)
            (xy 0.762 0)
          )
          (stroke (width 0) (type default))
          (fill (type none))
        )
        (polyline
          (pts
            (xy 0.762 1.778)
            (xy 3.302 1.778)
            (xy 3.302 -1.778)
            (xy 0.762 -1.778)
          )
          (stroke (width 0) (type default))
          (fill (type none))
        )
        (polyline
          (pts
            (xy 2.286 0)
            (xy 1.27 0.381)
            (xy 1.27 -0.381)
            (xy 2.286 0)
          )
          (stroke (width 0) (type default))
          (fill (type outline))
        )
        (polyline
          (pts
            (xy 2.794 -0.508)
            (xy 2.921 -0.381)
            (xy 3.683 -0.381)
            (xy 3.81 -0.254)
          )
          (stroke (width 0) (type default))
          (fill (type none))
        )
        (polyline
          (pts
            (xy 3.302 -0.381)
            (xy 2.921 0.254)
            (xy 3.683 0.254)
            (xy 3.302 -0.381)
          )
          (stroke (width 0) (type default))
          (fill (type none))
        )
        (circle (center 1.651 0) (radius 2.794)
          (stroke (width 0.254) (type default))
          (fill (type none))
        )
        (circle (center 2.54 -1.778) (radius 0.254)
          (stroke (width 0) (type default))
          (fill (type outline))
        )
        (circle (center 2.54 1.778) (radius 0.254)
          (stroke (width 0) (type default))
          (fill (type outline))
        )
      )
      (symbol "PMOS_1_1"
        (pin passive line (at 2.54 5.08 270) (length 2.54)
          (name "D" (effects (font (size 1.27 1.27))))
          (number "1" (effects (font (size 1.27 1.27))))
        )
        (pin input line (at -5.08 0 0) (length 2.54)
          (name "G" (effects (font (size 1.27 1.27))))
          (number "2" (effects (font (size 1.27 1.27))))
        )
        (pin passive line (at 2.54 -5.08 90) (length 2.54)
          (name "S" (effects (font (size 1.27 1.27))))
          (number "3" (effects (font (size 1.27 1.27))))
        )
      )
    )
    (symbol "power:GND" (power) (pin_names (offset 0)) (in_bom yes) (on_board yes)
      (property "Reference" "#PWR" (at 0 -6.35 0)
        (effects (font (size 1.27 1.27)) hide)
      )
      (property "Value" "GND" (at 0 -3.81 0)
        (effects (font (size 1.27 1.27)))
      )
      (property "Footprint" "" (at 0 0 0)
        (effects (font (size 1.27 1.27)) hide)
      )
      (property "Datasheet" "" (at 0 0 0)
        (effects (font (size 1.27 1.27)) hide)
      )
      (property "ki_keywords" "global power" (at 0 0 0)
        (effects (font (size 1.27 1.27)) hide)
      )
      (property "ki_description" "Power symbol creates a global label with name \"GND\" , ground" (at 0 0 0)
        (effects (font (size 1.27 1.27)) hide)
      )
      (symbol "GND_0_1"
        (polyline
          (pts
            (xy 0 0)
            (xy 0 -1.27)
            (xy 1.27 -1.27)
            (xy 0 -2.54)
            (xy -1.27 -1.27)
            (xy 0 -1.27)
          )
          (stroke (width 0) (type default))
          (fill (type none))
        )
      )
      (symbol "GND_1_1"
        (pin power_in line (at 0 0 270) (length 0) hide
          (name "GND" (effects (font (size 1.27 1.27))))
          (number "1" (effects (font (size 1.27 1.27))))
        )
      )
    )
  )

  (junction (at 149.86 116.84) (diameter 0) (color 0 0 0 0)
    (uuid 335b872c-59ea-4f5a-9f5c-1c82359a1c3e)
  )
  (junction (at 139.7 100.33) (diameter 0) (color 0 0 0 0)
    (uuid 6c41a0e6-c117-49da-893f-41b22abaeff9)
  )
  (junction (at 149.86 100.33) (diameter 0) (color 0 0 0 0)
    (uuid a48c0bda-0740-4564-a684-39e7cb5e1238)
  )
  (junction (at 172.72 106.68) (diameter 0) (color 0 0 0 0)
    (uuid f1d4c8f6-f3d2-4b84-9166-338c6c6be8fd)
  )

  (wire (pts (xy 172.72 106.68) (xy 172.72 107.95))
    (stroke (width 0) (type default))
    (uuid 085c538b-9fdd-4ecd-a1a3-65f1ff6c2315)
  )
  (wire (pts (xy 128.27 74.93) (xy 149.86 74.93))
    (stroke (width 0) (type default))
    (uuid 2edff5ac-4dbd-4573-a2ea-781884201045)
  )
  (wire (pts (xy 172.72 95.25) (xy 172.72 90.17))
    (stroke (width 0) (type default))
    (uuid 450cc198-e6de-4a75-8fe2-c177014cb041)
  )
  (wire (pts (xy 137.16 100.33) (xy 139.7 100.33))
    (stroke (width 0) (type default))
    (uuid 60c72112-58eb-48a5-b472-3aa23730c447)
  )
  (wire (pts (xy 172.72 115.57) (xy 172.72 116.84))
    (stroke (width 0) (type default))
    (uuid 6c7b6287-6ba0-4b80-bfa3-21953b4cd1c3)
  )
  (wire (pts (xy 142.24 92.71) (xy 139.7 92.71))
    (stroke (width 0) (type default))
    (uuid 83b4ad98-eebd-449a-9c9b-130ba6ece98c)
  )
  (wire (pts (xy 149.86 85.09) (xy 149.86 87.63))
    (stroke (width 0) (type default))
    (uuid 8a2d4423-64df-45e0-aeee-af1cfd6148c4)
  )
  (wire (pts (xy 127 100.33) (xy 129.54 100.33))
    (stroke (width 0) (type default))
    (uuid 8c3871d1-897e-418c-86f1-73ecb74afe38)
  )
  (wire (pts (xy 149.86 77.47) (xy 149.86 74.93))
    (stroke (width 0) (type default))
    (uuid 95f69d1e-961b-4e12-831d-bee8349bba4f)
  )
  (wire (pts (xy 139.7 92.71) (xy 139.7 100.33))
    (stroke (width 0) (type default))
    (uuid a3dbbf39-a0dc-48ee-939d-c9a086f3313a)
  )
  (wire (pts (xy 142.24 109.22) (xy 139.7 109.22))
    (stroke (width 0) (type default))
    (uuid b3e49cf6-d1cf-425c-84db-67bd3dfc777a)
  )
  (wire (pts (xy 161.29 100.33) (xy 165.1 100.33))
    (stroke (width 0) (type default))
    (uuid b72209dd-2adf-4d9b-8046-77e32a5b2047)
  )
  (wire (pts (xy 172.72 106.68) (xy 175.26 106.68))
    (stroke (width 0) (type default))
    (uuid be64558d-732c-46af-a594-438659582481)
  )
  (wire (pts (xy 149.86 100.33) (xy 149.86 104.14))
    (stroke (width 0) (type default))
    (uuid c7f2cf52-6a2a-4a4d-b870-46871a07705a)
  )
  (wire (pts (xy 149.86 97.79) (xy 149.86 100.33))
    (stroke (width 0) (type default))
    (uuid c96b493a-5e34-45fd-b03f-365cfa7337d7)
  )
  (wire (pts (xy 139.7 100.33) (xy 139.7 109.22))
    (stroke (width 0) (type default))
    (uuid cc53be8d-29b4-4afd-a206-8b19e4463f1b)
  )
  (wire (pts (xy 172.72 116.84) (xy 149.86 116.84))
    (stroke (width 0) (type default))
    (uuid d518257d-2b5b-49fd-acec-286848a5ed9d)
  )
  (wire (pts (xy 172.72 105.41) (xy 172.72 106.68))
    (stroke (width 0) (type default))
    (uuid db622745-0f09-470a-9c30-7c227a56b56d)
  )
  (wire (pts (xy 149.86 116.84) (xy 149.86 119.38))
    (stroke (width 0) (type default))
    (uuid de34b0bf-adcf-4e4a-8814-b0e8ead25103)
  )
  (wire (pts (xy 149.86 100.33) (xy 153.67 100.33))
    (stroke (width 0) (type default))
    (uuid e6d55c7f-7988-4429-ac72-ee4c269bb799)
  )
  (wire (pts (xy 149.86 114.3) (xy 149.86 116.84))
    (stroke (width 0) (type default))
    (uuid e8f37cf0-24fc-4d7e-9134-17766d791a14)
  )
  (wire (pts (xy 172.72 90.17) (xy 177.8 90.17))
    (stroke (width 0) (type default))
    (uuid f27490a2-b1e8-461a-b08d-b3f5c2098b1b)
  )

  (text "Open Drain Driver\n" (at 77.47 45.72 0)
    (effects (font (size 10 10) (thickness 2) bold) (justify left bottom))
    (uuid a4de3f00-c6e8-45ac-b0b0-cf64f40ee899)
  )

  (hierarchical_label "VCC" (shape input) (at 128.27 74.93 180) (fields_autoplaced)
    (effects (font (size 1.27 1.27)) (justify right))
    (uuid 5fa68d27-1f11-4b5c-b406-90d36a56551b)
  )
  (hierarchical_label "OUTPUT" (shape input) (at 177.8 90.17 0) (fields_autoplaced)
    (effects (font (size 1.27 1.27)) (justify left))
    (uuid 84f74dd8-bd42-4a49-81c0-24201884d958)
  )
  (hierarchical_label "SENS" (shape input) (at 175.26 106.68 0) (fields_autoplaced)
    (effects (font (size 1.27 1.27) bold) (justify left))
    (uuid d21cd153-16a6-4409-9edc-8933708eb631)
  )
  (hierarchical_label "INPUT" (shape input) (at 127 100.33 180) (fields_autoplaced)
    (effects (font (size 1.27 1.27)) (justify right))
    (uuid f26b8477-c5c3-4905-ab10-0ee310f04f21)
  )

  (symbol (lib_id "Device:R") (at 157.48 100.33 90) (unit 1)
    (in_bom yes) (on_board yes) (dnp no)
    (uuid 3a789017-00ef-4ccc-9f28-d08d89a85bd6)
    (property "Reference" "R2" (at 157.48 95.25 90)
      (effects (font (size 1.27 1.27)))
    )
    (property "Value" "2R" (at 157.48 97.79 90)
      (effects (font (size 1.27 1.27)))
    )
    (property "Footprint" "Resistor_SMD:R_0603_1608Metric_Pad0.98x0.95mm_HandSolder" (at 157.48 102.108 90)
      (effects (font (size 1.27 1.27)) hide)
    )
    (property "Datasheet" "~" (at 157.48 100.33 0)
      (effects (font (size 1.27 1.27)) hide)
    )
    (pin "1" (uuid 2c331132-5761-48e5-8705-792f3bcf363d))
    (pin "2" (uuid 55222e94-2505-4531-885a-91992fd0a81e))
    (instances
      (project "Coildriver"
        (path "/b9c6537b-9919-4452-86c5-0a2d0440a6ff/6d4c0bae-e04f-4783-ad85-d7ccd98fc9d3"
          (reference "R2") (unit 1)
        )
        (path "/b9c6537b-9919-4452-86c5-0a2d0440a6ff/8221bd1d-9d84-4cea-920e-e8cfcb450903"
          (reference "R12") (unit 1)
        )
        (path "/b9c6537b-9919-4452-86c5-0a2d0440a6ff/4f458e3a-84a4-41d0-87d7-550da6ef8c37"
          (reference "R18") (unit 1)
        )
        (path "/b9c6537b-9919-4452-86c5-0a2d0440a6ff/dcf4c223-77c6-4c59-aaa5-be70f8c8b85b"
          (reference "R22") (unit 1)
        )
      )
    )
  )

  (symbol (lib_id "Simulation_SPICE:NMOS") (at 170.18 100.33 0) (unit 1)
    (in_bom yes) (on_board yes) (dnp no) (fields_autoplaced)
    (uuid 5aa0b137-0d7e-4e1a-b012-9bc858f8460e)
    (property "Reference" "Q1" (at 176.53 99.06 0)
      (effects (font (size 1.27 1.27)) (justify left))
    )
    (property "Value" "TJ20S04M3L" (at 176.53 101.6 0)
      (effects (font (size 1.27 1.27)) (justify left))
    )
    (property "Footprint" "Package_TO_SOT_SMD:TO-252-3_TabPin2" (at 175.26 97.79 0)
      (effects (font (size 1.27 1.27)) hide)
    )
    (property "Datasheet" "https://ngspice.sourceforge.io/docs/ngspice-manual.pdf" (at 170.18 113.03 0)
      (effects (font (size 1.27 1.27)) hide)
    )
    (property "Sim.Device" "NMOS" (at 170.18 117.475 0)
      (effects (font (size 1.27 1.27)) hide)
    )
    (property "Sim.Type" "VDMOS" (at 170.18 119.38 0)
      (effects (font (size 1.27 1.27)) hide)
    )
    (property "Sim.Pins" "1=D 2=G 3=S" (at 170.18 115.57 0)
      (effects (font (size 1.27 1.27)) hide)
    )
    (property "DigiKey" "TJ20S04M3L" (at 170.18 100.33 0)
      (effects (font (size 1.27 1.27)) hide)
    )
    (property "DigiKeyWeb" "https://toshiba.semicon-storage.com/info/TJ20S04M3L_datasheet_en_20200624.pdf?did=11300&prodName=TJ20S04M3L" (at 170.18 100.33 0)
      (effects (font (size 1.27 1.27)) hide)
    )
    (pin "1" (uuid 41dc918c-15fc-4444-81eb-fd95337e5b9d))
    (pin "2" (uuid f9e50a1e-af31-48d2-ae04-eddd4d75d69c))
    (pin "3" (uuid 001aa688-0135-4b09-828a-c8988796cc9e))
    (instances
      (project "Coildriver"
        (path "/b9c6537b-9919-4452-86c5-0a2d0440a6ff/6d4c0bae-e04f-4783-ad85-d7ccd98fc9d3"
          (reference "Q1") (unit 1)
        )
        (path "/b9c6537b-9919-4452-86c5-0a2d0440a6ff/8221bd1d-9d84-4cea-920e-e8cfcb450903"
          (reference "Q5") (unit 1)
        )
        (path "/b9c6537b-9919-4452-86c5-0a2d0440a6ff/4f458e3a-84a4-41d0-87d7-550da6ef8c37"
          (reference "Q7") (unit 1)
        )
        (path "/b9c6537b-9919-4452-86c5-0a2d0440a6ff/dcf4c223-77c6-4c59-aaa5-be70f8c8b85b"
          (reference "Q9") (unit 1)
        )
      )
    )
  )

  (symbol (lib_id "Device:R") (at 172.72 111.76 0) (unit 1)
    (in_bom yes) (on_board yes) (dnp no) (fields_autoplaced)
    (uuid 81973d38-bd0c-4ef4-bfdc-a12aa27df85f)
    (property "Reference" "R8" (at 175.26 110.49 0)
      (effects (font (size 1.27 1.27)) (justify left))
    )
    (property "Value" "20mOhm / 3W" (at 175.26 113.03 0)
      (effects (font (size 1.27 1.27)) (justify left))
    )
    (property "Footprint" "Resistor_SMD:R_2512_6332Metric_Pad1.40x3.35mm_HandSolder" (at 170.942 111.76 90)
      (effects (font (size 1.27 1.27)) hide)
    )
    (property "Datasheet" "https://www.seielect.com/catalog/sei-csm.pdf" (at 172.72 111.76 0)
      (effects (font (size 1.27 1.27)) hide)
    )
    (property "DigiKey" "CSM2512FT20L0-ND " (at 172.72 111.76 0)
      (effects (font (size 1.27 1.27)) hide)
    )
    (property "DigiKeyWeb" "https://www.digikey.de/de/products/detail/stackpole-electronics-inc/CSM2512FT20L0/6270239" (at 172.72 111.76 0)
      (effects (font (size 1.27 1.27)) hide)
    )
    (pin "1" (uuid 16893ace-d146-4e70-b300-a7165e1680df))
    (pin "2" (uuid 44ae7e07-6ff1-492b-90c1-9c922d6a203a))
    (instances
      (project "Coildriver"
        (path "/b9c6537b-9919-4452-86c5-0a2d0440a6ff/6d4c0bae-e04f-4783-ad85-d7ccd98fc9d3"
          (reference "R8") (unit 1)
        )
        (path "/b9c6537b-9919-4452-86c5-0a2d0440a6ff/8221bd1d-9d84-4cea-920e-e8cfcb450903"
          (reference "R15") (unit 1)
        )
        (path "/b9c6537b-9919-4452-86c5-0a2d0440a6ff/4f458e3a-84a4-41d0-87d7-550da6ef8c37"
          (reference "R19") (unit 1)
        )
        (path "/b9c6537b-9919-4452-86c5-0a2d0440a6ff/dcf4c223-77c6-4c59-aaa5-be70f8c8b85b"
          (reference "R23") (unit 1)
        )
      )
    )
  )

  (symbol (lib_id "Simulation_SPICE:PMOS") (at 147.32 92.71 0) (mirror x) (unit 1)
    (in_bom yes) (on_board yes) (dnp no)
    (uuid ac92a784-1bfd-474a-bbee-19b50c5a1cd2)
    (property "Reference" "Q3" (at 152.4 88.9 0)
      (effects (font (size 1.27 1.27)) (justify left))
    )
    (property "Value" "AO3423" (at 152.4 91.44 0)
      (effects (font (size 1.27 1.27)) (justify left))
    )
    (property "Footprint" "Package_TO_SOT_SMD:SOT-23-3" (at 152.4 95.25 0)
      (effects (font (size 1.27 1.27)) hide)
    )
    (property "Datasheet" "https://ngspice.sourceforge.io/docs/ngspice-manual.pdf" (at 147.32 80.01 0)
      (effects (font (size 1.27 1.27)) hide)
    )
    (property "Sim.Device" "PMOS" (at 147.32 75.565 0)
      (effects (font (size 1.27 1.27)) hide)
    )
    (property "Sim.Type" "VDMOS" (at 147.32 73.66 0)
      (effects (font (size 1.27 1.27)) hide)
    )
    (property "Sim.Pins" "1=D 2=G 3=S" (at 147.32 77.47 0)
      (effects (font (size 1.27 1.27)) hide)
    )
    (property "DigiKey" "785-1016-1-ND - Gurtabschnitt" (at 147.32 92.71 0)
      (effects (font (size 1.27 1.27)) hide)
    )
    (property "DigiKeyWeb" "https://www.digikey.de/de/products/detail/alpha-omega-semiconductor-inc/AO3423/1855788" (at 147.32 92.71 0)
      (effects (font (size 1.27 1.27)) hide)
    )
    (pin "1" (uuid d54b08ee-4ef2-4c8c-aca5-ef9589eff995))
    (pin "2" (uuid 343b14f0-d369-4f1f-b966-45f605776e35))
    (pin "3" (uuid 611bb9bd-d81a-443e-928d-160e0cc27279))
    (instances
      (project "Coildriver"
        (path "/b9c6537b-9919-4452-86c5-0a2d0440a6ff/6d4c0bae-e04f-4783-ad85-d7ccd98fc9d3"
          (reference "Q3") (unit 1)
        )
        (path "/b9c6537b-9919-4452-86c5-0a2d0440a6ff/8221bd1d-9d84-4cea-920e-e8cfcb450903"
          (reference "Q2") (unit 1)
        )
        (path "/b9c6537b-9919-4452-86c5-0a2d0440a6ff/4f458e3a-84a4-41d0-87d7-550da6ef8c37"
          (reference "Q6") (unit 1)
        )
        (path "/b9c6537b-9919-4452-86c5-0a2d0440a6ff/dcf4c223-77c6-4c59-aaa5-be70f8c8b85b"
          (reference "Q8") (unit 1)
        )
      )
    )
  )

  (symbol (lib_id "power:GND") (at 149.86 119.38 0) (unit 1)
    (in_bom yes) (on_board yes) (dnp no) (fields_autoplaced)
    (uuid c10481b1-36e2-4677-a4e8-d4dc836ac91d)
    (property "Reference" "#PWR01" (at 149.86 125.73 0)
      (effects (font (size 1.27 1.27)) hide)
    )
    (property "Value" "GND" (at 149.86 124.46 0)
      (effects (font (size 1.27 1.27)))
    )
    (property "Footprint" "" (at 149.86 119.38 0)
      (effects (font (size 1.27 1.27)) hide)
    )
    (property "Datasheet" "" (at 149.86 119.38 0)
      (effects (font (size 1.27 1.27)) hide)
    )
    (pin "1" (uuid 441b7ca7-78cd-456b-a5cf-e72ac6bf8cae))
    (instances
      (project "Coildriver"
        (path "/b9c6537b-9919-4452-86c5-0a2d0440a6ff/6d4c0bae-e04f-4783-ad85-d7ccd98fc9d3"
          (reference "#PWR01") (unit 1)
        )
        (path "/b9c6537b-9919-4452-86c5-0a2d0440a6ff/8221bd1d-9d84-4cea-920e-e8cfcb450903"
          (reference "#PWR03") (unit 1)
        )
        (path "/b9c6537b-9919-4452-86c5-0a2d0440a6ff/4f458e3a-84a4-41d0-87d7-550da6ef8c37"
          (reference "#PWR04") (unit 1)
        )
        (path "/b9c6537b-9919-4452-86c5-0a2d0440a6ff/dcf4c223-77c6-4c59-aaa5-be70f8c8b85b"
          (reference "#PWR05") (unit 1)
        )
      )
    )
  )

  (symbol (lib_id "Simulation_SPICE:NMOS") (at 147.32 109.22 0) (unit 1)
    (in_bom yes) (on_board yes) (dnp no) (fields_autoplaced)
    (uuid cba7d984-3d67-4791-b114-a9e4608db587)
    (property "Reference" "QFDN327N4" (at 153.67 107.95 0)
      (effects (font (size 1.27 1.27)) (justify left))
    )
    (property "Value" "NMOS" (at 153.67 110.49 0)
      (effects (font (size 1.27 1.27)) (justify left))
    )
    (property "Footprint" "Package_TO_SOT_SMD:SOT-23-3" (at 152.4 106.68 0)
      (effects (font (size 1.27 1.27)) hide)
    )
    (property "Datasheet" "https://ngspice.sourceforge.io/docs/ngspice-manual.pdf" (at 147.32 121.92 0)
      (effects (font (size 1.27 1.27)) hide)
    )
    (property "Sim.Device" "NMOS" (at 147.32 126.365 0)
      (effects (font (size 1.27 1.27)) hide)
    )
    (property "Sim.Type" "VDMOS" (at 147.32 128.27 0)
      (effects (font (size 1.27 1.27)) hide)
    )
    (property "Sim.Pins" "1=G 2=D 3=S" (at 147.32 124.46 0)
      (effects (font (size 1.27 1.27)) hide)
    )
    (property "DigiKey" "FDN327NCT-ND" (at 147.32 109.22 0)
      (effects (font (size 1.27 1.27)) hide)
    )
    (property "DigiKeyWeb" "https://www.digikey.de/de/products/detail/onsemi/FDN327N/976839" (at 147.32 109.22 0)
      (effects (font (size 1.27 1.27)) hide)
    )
    (pin "1" (uuid 7318c972-66ae-4768-8847-af79c711407c))
    (pin "2" (uuid 68070ad8-9983-42c0-a033-2f778c182ada))
    (pin "3" (uuid ff66ded0-252f-436a-8b06-f22e5a25e9fc))
    (instances
      (project "Coildriver"
        (path "/b9c6537b-9919-4452-86c5-0a2d0440a6ff/6d4c0bae-e04f-4783-ad85-d7ccd98fc9d3"
          (reference "QFDN327N4") (unit 1)
        )
        (path "/b9c6537b-9919-4452-86c5-0a2d0440a6ff/8221bd1d-9d84-4cea-920e-e8cfcb450903"
          (reference "QFDN327N1") (unit 1)
        )
        (path "/b9c6537b-9919-4452-86c5-0a2d0440a6ff/4f458e3a-84a4-41d0-87d7-550da6ef8c37"
          (reference "QFDN327N2") (unit 1)
        )
        (path "/b9c6537b-9919-4452-86c5-0a2d0440a6ff/dcf4c223-77c6-4c59-aaa5-be70f8c8b85b"
          (reference "QFDN327N3") (unit 1)
        )
      )
    )
  )

  (symbol (lib_id "Device:R") (at 133.35 100.33 90) (unit 1)
    (in_bom yes) (on_board yes) (dnp no) (fields_autoplaced)
    (uuid cf8fd171-fa80-4fb7-be29-a9e14c0104ad)
    (property "Reference" "R1" (at 133.35 93.98 90)
      (effects (font (size 1.27 1.27)))
    )
    (property "Value" "120R" (at 133.35 96.52 90)
      (effects (font (size 1.27 1.27)))
    )
    (property "Footprint" "Resistor_SMD:R_0603_1608Metric_Pad0.98x0.95mm_HandSolder" (at 133.35 102.108 90)
      (effects (font (size 1.27 1.27)) hide)
    )
    (property "Datasheet" "~" (at 133.35 100.33 0)
      (effects (font (size 1.27 1.27)) hide)
    )
    (pin "1" (uuid ec9447df-8386-4454-b4f1-ad2d3d9de361))
    (pin "2" (uuid 9434f8ea-423c-4c07-af13-f729b2204ada))
    (instances
      (project "Coildriver"
        (path "/b9c6537b-9919-4452-86c5-0a2d0440a6ff/6d4c0bae-e04f-4783-ad85-d7ccd98fc9d3"
          (reference "R1") (unit 1)
        )
        (path "/b9c6537b-9919-4452-86c5-0a2d0440a6ff/8221bd1d-9d84-4cea-920e-e8cfcb450903"
          (reference "R4") (unit 1)
        )
        (path "/b9c6537b-9919-4452-86c5-0a2d0440a6ff/4f458e3a-84a4-41d0-87d7-550da6ef8c37"
          (reference "R16") (unit 1)
        )
        (path "/b9c6537b-9919-4452-86c5-0a2d0440a6ff/dcf4c223-77c6-4c59-aaa5-be70f8c8b85b"
          (reference "R20") (unit 1)
        )
      )
    )
  )

  (symbol (lib_id "Device:R") (at 149.86 81.28 180) (unit 1)
    (in_bom yes) (on_board yes) (dnp no) (fields_autoplaced)
    (uuid d3e1e1f0-563d-4d36-b598-89930a82931e)
    (property "Reference" "R3" (at 152.4 80.01 0)
      (effects (font (size 1.27 1.27)) (justify right))
    )
    (property "Value" "3R" (at 152.4 82.55 0)
      (effects (font (size 1.27 1.27)) (justify right))
    )
    (property "Footprint" "Resistor_SMD:R_0603_1608Metric_Pad0.98x0.95mm_HandSolder" (at 151.638 81.28 90)
      (effects (font (size 1.27 1.27)) hide)
    )
    (property "Datasheet" "~" (at 149.86 81.28 0)
      (effects (font (size 1.27 1.27)) hide)
    )
    (pin "1" (uuid f7edf1dd-82f5-4e7d-b95f-116414898d69))
    (pin "2" (uuid b2ca3d75-f54a-4929-b1d5-41071799fbe0))
    (instances
      (project "Coildriver"
        (path "/b9c6537b-9919-4452-86c5-0a2d0440a6ff/6d4c0bae-e04f-4783-ad85-d7ccd98fc9d3"
          (reference "R3") (unit 1)
        )
        (path "/b9c6537b-9919-4452-86c5-0a2d0440a6ff/8221bd1d-9d84-4cea-920e-e8cfcb450903"
          (reference "R11") (unit 1)
        )
        (path "/b9c6537b-9919-4452-86c5-0a2d0440a6ff/4f458e3a-84a4-41d0-87d7-550da6ef8c37"
          (reference "R17") (unit 1)
        )
        (path "/b9c6537b-9919-4452-86c5-0a2d0440a6ff/dcf4c223-77c6-4c59-aaa5-be70f8c8b85b"
          (reference "R21") (unit 1)
        )
      )
    )
  )
)
