I
1100 Version - data cycle 1611, build 20161011, metadata NavXP1100. Copyright (c) 2016 Navigraph. License: GPL+2

 3   9.370122222    2.619111111        0    11280   130     -2.000   PA ENRT DB PARAKOU VOR
 3   8.015000000    0.561666667     1550    11590   130     -3.000  PAM ENRT DG PAMPA VOR/DME
12   8.015000000    0.561666667     1550    11590   130      0.000  PAM ENRT DG PAMPA VOR/DME
 3  20.914444444  -17.034966667       26    11350   130     -7.000   PE ENRT GQ NOUADHIBOU VOR/DME
12  20.914444444  -17.034966667       26    11350   130      0.000   PE ENRT GQ NOUADHIBOU VOR/DME
 3 -33.992502778   25.605750000      215    11290   130    -28.000  PEV ENRT FA PORT ELIZABETH VOR/DME
12 -33.992502778   25.605763889      215    11290   130      0.000  PEV ENRT FA PORT ELIZABETH VOR/DME
 3  -0.728777778    8.747472222        0    11230   130     -3.000   PG ENRT FO PORT GENTIL VOR
 3 -23.900758333   31.151969444        0    11530    40    -15.000  PHV ENRT FA PHALABORWA VOR
 3 -31.608877778   29.519858333        0    11590   130    -27.000  PJV ENRT FA PORT ST JOHNS VOR
 3 -25.381025000   31.111125000     2954    11250   130    -18.000  PKV ENRT FA KRUGER MPUMALANGA VOR/DME
12 -25.381025000   31.111125000     2954    11250   130      0.000  PKV ENRT FA KRUGER MPUMALANGA VOR/DME
 3 -20.420027778   57.662388889      183    11370   130    -19.000  PLS ENRT FI PLAISANCE (MAURITIUS) VOR/DME
12 -20.420027778   57.662388889      183    11370   130      0.000  PLS ENRT FI PLAISANCE (MAURITIUS) VOR/DME
 3 -29.647813889   30.400355556     2423    11790   130    -24.000  PMV ENRT FA PIETERMARITZBURG VOR/DME
12 -29.647813889   30.400355556     2423    11790   130      0.000  PMV ENRT FA PIETERMARITZBURG VOR/DME
 3 -25.395841667   27.122705556     3412    11260   130    -16.000  PNV ENRT FA PILANESBERG VOR/DME
12 -25.395841667   27.122705556     3412    11260   130      0.000  PNV ENRT FA PILANESBERG VOR/DME
 3  11.705027778   11.037658333     1500    11210    40     -1.000   PO ENRT DN POTISKUM VOR/DME
12  11.705027778   11.037658333     1500    11210    40      0.000   PO ENRT DN POTISKUM VOR/DME
 3   5.035350000    6.960183333      118    11350   130     -2.000  POT ENRT DN PORT HARCOURT VOR/DME
12   5.035350000    6.960183333      118    11350   130      0.000  POT ENRT DN PORT HARCOURT VOR/DME
 3 -23.839819444   29.460566667     4023    11450   130    -16.000  PPV ENRT FA POLOKWANE VOR/DME
12 -23.839819444   29.460566667     4023    11450   130      0.000  PPV ENRT FA POLOKWANE VOR/DME
 3  -4.307366667   55.707080556     1106    11570   130     -5.000  PRA ENRT FS PRASLIN VOR/DME
12  -4.307330556   55.707055556     1106    11570   130      0.000  PRA ENRT FS PRASLIN VOR/DME
 3 -21.319777778   55.420305556       89    11590   130    -20.000  PRF ENRT FM ST PIERRE (PIERREFONDS) VOR/DME
12 -21.319777778   55.420305556       89    11590   130      0.000  PRF ENRT FM ST PIERRE (PIERREFONDS) VOR/DME
 3  31.278727778   32.237794444       30    11320   130      4.000  PSD ENRT HE PORT SAID VOR/DME
12  31.278727778   32.237794444       30    11320   130      0.000  PSD ENRT HE PORT SAID VOR/DME
 3  19.401172222   37.241719444      160    11310    40      3.000  PSD ENRT HS PORT SUDAN VOR/DME
12  19.401172222   37.241719444      160    11310    40      0.000  PSD ENRT HS PORT SUDAN VOR/DME
 3 -30.366225000   24.695016667        0    11270   130    -23.000  PVV ENRT FA PETRUSVILLE VOR
 2   3.701250000    8.912194444        0      342    50      0.000   PA ENRT FG MALABO NDB
 2  -5.258044444   39.814475000        0      345    75      0.000   PA ENRT HT PEMBA NDB
 2 -12.960327778   40.513102778        0      280    50      0.000   PB ENRT FQ PEMBA NDB
 2   0.295775000   32.656036111        0      270    50      0.000   PB ENRT HU PORTBELL NDB
 2  32.665000000   13.247500000        0      390    15      0.000   PE ENRT HL GAZALA (TRIPOLI) NDB
 2  -0.693833333    8.761722222        0      367    25      0.000   PG ENRT FO PORT GENTIL NDB
 2 -25.383555556   31.108916667        0      405    50      0.000   PK ENRT FA KRUGER MPUMALANGA NDB
 2   4.324333333   18.539055556        0      305    50      0.000   PK ENRT FE BANGUI NDB
 2 -25.367816667   27.197441667        0      215    50      0.000  PLB ENRT FA PILANESBERG NDB
 2 -25.395594444   27.121830556        0      480    50      0.000  PLG ENRT FA PILANESBERG NDB
 2 -18.665083333   26.929055556        0      377    50      0.000   PO ENRT FV HWANGE NATIONAL PARK NDB
 2   4.995283333    6.938719444        0      385    25      0.000   PR ENRT DN PORT HARCOURT NDB
 2   1.665997222    7.412358333        0      311    15      0.000   PR ENRT FP PRINCIPE NDB
 2  14.925616667  -23.491150000        0      349    50      0.000  PRA ENRT GV PRAIA NDB
 2  28.212500000   18.116388889        0      245    50      0.000  PRB ENRT HL SABAH NDB
 2  28.575833333   17.326111111        0      395    50      0.000  PRC ENRT HL ZELLA 74 NDB
 2 -26.939883333   30.770122222        0      525    50      0.000  PRF ENRT FA PIET RETIEF NDB
 2  19.422480556   37.242086111        0      339    25      0.000  PSD ENRT HS PORT SUDAN NDB
 2 -29.661277778   30.409766667        0      407    50      0.000   PU ENRT FA PIETERMARITZBURG NDB
 2 -23.917377778   31.153947222        0      272    50      0.000   PW ENRT FA PHALABORWA NDB
 2 -34.090497222   23.325969444        0      277    50      0.000   PY ENRT FA PLETTENBERG BAY NDB
 2 -29.705633333   30.449461111        0      257    50      0.000   PZ ENRT FA PIETERMARITZBURG NDB
 2  32.763022222   13.153297222        0      344    15      0.000   PN HLLT HL QIZAN NDB
13  52.967022222 -113.411111111     2540    11270    40      0.000   P2 ENRT CY WETASKIWIN DME
13  51.443611111  -90.222777778     1261    11370    40      0.000   PL ENRT CY PICKLE LAKE DME
 2  52.966777778 -113.411444444        0      334    50      0.000   P2 ENRT CY WETASKIWIN NDB
 2  53.218055556 -105.795277778        0      347    25      0.000   PA ENRT CY PRINCE ALBERT NDB
 2  45.655405556  -61.269419444        0      229    25      0.000   PD ENRT CY PORT HAWKESBURY NDB
 2  56.954283333 -158.647566667        0      371    50      0.000  PDN ENRT PA PORT HEIDEN NDB
 2  56.200000000 -117.531944444        0      287    25      0.000   PE ENRT CY PEACE RIVER NDB
 2  62.331041667 -150.096411111        0      305    50      0.000  PEE ENRT PA PETERS CREEK (TALKEETNA) NDB
 2  49.841777778  -98.179638889        0      353    25      0.000   PG ENRT CY PORTAGE (PORTAGE LA PRAIRIE) NDB
 2  68.344630556 -166.798225000        0      221    50      0.000  PHO ENRT PA POINT HOPE NDB
 2  69.736477778 -162.996294444        0      362    50      0.000  PIZ ENRT PA POINT LAY NDB
 2  60.439444444 -134.861388889        0      329    25      0.000   PJ ENRT CY ROBINSON (WHITEHORSE) NDB
 2  49.837500000  -64.386388889        0      360    50      0.000   PN ENRT CY PORT MENIER NDB
 2  54.263333333 -130.423888889        0      218    50      0.000   PR ENRT CY PRINCE RUPERT NDB
 2  41.779169444  -82.670225000        0      283    50      0.000   PT ENRT CY PELEE ISLAND NDB
 2  70.248341667 -148.394138889        0      368    25      0.000  PUO ENRT PA PRUDHOE BAY NDB
 2  70.222655556 -148.416213889        0      376    50      0.000  PVQ ENRT PA PUT RIVER (DEADHORSE) NDB
 2  58.761569444 -111.108272222        0      207    50      0.000   PY ENRT CY FORT CHIPEWYAN NDB
 2  70.328038889 -149.635333333        0      290    25      0.000  PYC ENRT PA PITSAND (KUPARUK) NDB
 4  60.768491667 -161.846411111      106    11150    25    203.436 IBET PABE PA 19R ILS-cat-I
 6  60.785136111 -161.829194444      106    11150    25 300203.436 IBET PABE PA 19R GS
12  60.768552778 -161.847602778      135    11150    25      0.000 IBET PABE PA BETHEL DME-ILS
 4  63.989294444 -145.701030556     1254    11110    25    119.257 IBIG PABI PA 10 ILS-cat-I
 6  63.999136111 -145.729155556     1254    11110    25 300119.257 IBIG PABI PA 10 GS
12  63.988686111 -145.701816667     1265    11110    25      0.000 IBIG PABI PA ALLEN AAF DME-ILS
 4  71.284877778 -156.736363889       44    11050    25     84.482 IBRW PABR PA 07 ILS-cat-I
 6  71.283725000 -156.784330556       44    11050    25 300084.482 IBRW PABR PA 07 GS
12  71.284880556 -156.736297222       44    11050    25      0.000 IBRW PABR PA WILEY POST-WILL ROGERS ME DME-ILS
 4  55.194722222 -162.718705556       71    11030    25    158.405 ICDB PACD PA 15 ILS-cat-I
 6  55.220216667 -162.734355556       71    11030    25 310158.405 ICDB PACD PA 15 GS
 4  60.497372222 -145.499736111       47    11070    25    294.279 ICDV PACV PA 27 ILS-cat-I
 6  60.488766667 -145.464447222       47    11070    25 300294.279 ICDV PACV PA 27 GS
12  60.498083333 -145.499530556       60    11070    25      0.000 ICDV PACV PA CORDOVA-SMITH DME-ILS
 4  51.877258333 -176.660594444       11    10890    25    240.517 IBER PADK PA 23 ILS-cat-I
 6  51.888383333 -176.631658333       11    10890    25 275240.517 IBER PADK PA 23 GS
 5  59.035291667 -158.514219444        0    11190    25    206.461 IDLG PADL PA 19 LOC
12  59.036511111 -158.515666667       83    11190    25      0.000 IDLG PADL PA DILLINGHAM DME-ILS
 4  57.752225000 -152.520891667       25    11090    25    272.037 IADQ PADQ PA 26 ILS-cat-I
 6  57.750894444 -152.487755556       25    11090    25 205272.037 IADQ PADQ PA 26 GS
12  57.751686111 -152.521144444      134    11090    25      0.000 IADQ PADQ PA KODIAK DME-ILS
 4  61.253980556 -149.781191667      169    11030    25     80.021 IEDF PAED PA 06 ILS-cat-I
 6  61.250333333 -149.838055556      169    11030    25 300080.021 IEDF PAED PA 06 GS
 4  64.689477778 -147.122616667      541    10990    25    339.213 IEAF PAEI PA 32 ILS-cat-I
 6  64.649697222 -147.090352778      541    10990    25 270339.213 IEAF PAEI PA 32 GS
 4  64.642511111 -147.080908333      533    11050    25    159.213 IEIL PAEI PA 14 ILS-cat-I
 6  64.680994444 -147.118486111      533    11050    25 270159.213 IEIL PAEI PA 14 GS
 4  60.561163889 -151.260763889       97    10890    25    211.023 IENA PAEN PA 20R ILS-cat-I
 6  60.579758333 -151.240636111       97    10890    25 300211.023 IENA PAEN PA 20R GS
12  60.560980556 -151.260325000      107    10890    25      0.000 IENA PAEN PA KENAI MUN DME-ILS
 4  64.830511111 -147.834636111      431    10910    25     38.049 ICNA PAFA PA 02L ILS-cat-III
 6  64.805833333 -147.876750000      431    10910    25 300038.049 ICNA PAFA PA 02L GS
12  64.830761111 -147.837505556      435    10910    25      0.000 ICNA PAFA PA FAIRBANKS INTL DME-ILS
 4  64.800408333 -147.889966667      434    11030    25    218.049 IFAI PAFA PA 20R ILS-cat-II
 6  64.823450000 -147.844363889      434    11030    25 300218.049 IFAI PAFA PA 20R GS
12  64.800372222 -147.891155556      430    11030    25      0.000 IFAI PAFA PA FAIRBANKS INTL DME-ILS
 5  59.651897222 -151.458661111        0    10930    25     54.985 IHOM PAHO PA 04 LOC
12  59.651572222 -151.457725000       92    10930    25      0.000 IHOM PAHO PA HOMER DME-ILS
 5  58.358900000 -134.636219444        0    10990    25     89.516 IJDL PAJN PA 08 LDA
12  58.358616667 -134.636172222      180    10990    25      0.000 IJDL PAJN PA JUNEAU INTL DME-ILS
 4  58.665708333 -156.625658333       64    11030    25    131.920 IAKN PAKN PA 12 ILS-cat-I
 6  58.682594444 -156.658302778       64    11030    25 300131.920 IAKN PAKN PA 12 GS
12  58.666555556 -156.625472222       78    11030    25      0.000 IAKN PAKN PA KING SALMON DME-ILS
 4  55.344725000 -131.695147222       82    10930    25    135.669 IECH PAKT PA 11 ILS-cat-I
 6  55.359133333 -131.721625000       82    10930    25 300135.669 IECH PAKT PA 11 GS
12  55.345230556 -131.694325000       81    10930    25      0.000 IECH PAKT PA KETCHIKAN INTL DME-ILS
 4  70.328269444 -149.632827778       61    11070    25    252.491 IRGN PAKU PA 24 ILS-cat-I
 6  70.330758333 -149.580511111       61    11070    25 300252.491 IRGN PAKU PA 24 GS
12  70.328261111 -149.632925000       59    11070    25      0.000 IRGN PAKU PA UGNU-KUPARUK DME-ILS
 4  70.333130556 -149.562622222       59    11190    25     72.516 IRHF PAKU PA 06 ILS-cat-I
 6  70.330530556 -149.616508333       59    11190    25 300072.516 IRHF PAKU PA 06 GS
12  70.333136111 -149.562525000       56    11190    25      0.000 IRHF PAKU PA UGNU-KUPARUK DME-ILS
 5  62.946347222 -155.606669444        0    10850    25    178.918 IMCG PAMC PA 16 LOC
12  62.946372222 -155.607380556      359    10850    25      0.000 IMCG PAMC PA MCGRATH DME-ILS
 4  61.167886111 -149.965416667      125    11130    25     89.913 IANC PANC PA 07R ILS-cat-III
 6  61.168938889 -150.036794444      125    11130    25 300089.913 IANC PANC PA 07R GS
12  61.167227778 -149.966222222      112    11130    25      0.000 IANC PANC PA STEVENS ANCHORAGE INTL DME-ILS
 4  61.166644444 -149.996011111      142    11175    25    164.911 IBSC PANC PA 15 ILS-cat-I
 6  61.195894444 -150.014613889      142    11175    25 320164.911 IBSC PANC PA 15 GS
12  61.166669444 -149.994538889      135    11175    25      0.000 IBSC PANC PA STEVENS ANCHORAGE INTL DME-ILS
 4  61.169813889 -149.942402778      123    10990    25     89.933 ITGN PANC PA 07L ILS-cat-II
 6  61.170455556 -150.002827778      123    10990    25 300089.933 ITGN PANC PA 07L GS
12  61.170572222 -149.942508333      106    10990    25      0.000 ITGN PANC PA STEVENS ANCHORAGE INTL DME-ILS
 4  61.576580556 -159.525702778       92    10970    25    121.244 IANI PANI PA 11 ILS-cat-I
 6  61.583266667 -159.554347222       92    10970    25 300121.244 IANI PANI PA 11 GS
12  61.576950000 -159.524794444      109    10970    25      0.000 IANI PANI PA ANIAK DME-ILS
 4  64.515511111 -165.475833333       10    10870    25    289.793 IOME PAOM PA 28 ILS-cat-I
 6  64.508872222 -165.439483333       10    10870    25 300289.793 IOME PAOM PA 28 GS
12  64.514975000 -165.476352778       60    10870    25      0.000 IOME PAOM PA NOME DME-ILS
 4  66.886944444 -162.569511111        9    11070    25     95.776 IOTZ PAOT PA 09 ILS-cat-I
 6  66.888269444 -162.602936111        9    11070    25 300095.776 IOTZ PAOT PA 09 GS
12  66.886952778 -162.569313889       38    11070    25      0.000 IOTZ PAOT PA WIEN MEML DME-ILS
 4  56.573377778 -169.650355556      116    11010    25    118.339 IPBV PAPB PA 11 ILS-cat-I
 6  56.579880556 -169.669633333      116    11010    25 360118.339 IPBV PAPB PA 11 GS
 5  56.800680556 -132.926288889        0    11050    25    182.249 IPSG PAPG PA 23 LOC
12  56.800713889 -132.927475000      170    11050    25      0.000 IPSG PAPG PA JOHNSON PETERSBURG DME-ILS
 5  66.819069444 -150.633966667        0    11070    25     47.876 IECD PAPR PA 19 LOC
12  66.818991667 -150.633644444     1085    11070    25      0.000 IECD PAPR PA PROSPECT CREEK DME-ILS
 4  70.198486111 -148.424019444       60    10930    25     68.924 ISCC PASC PA 05 ILS-cat-I
 6  70.192025000 -148.481019444       60    10930    25 300068.924 ISCC PASC PA 05 GS
12  70.197958333 -148.423627778       47    10930    25      0.000 ISCC PASC PA DEADHORSE DME-ILS
 5  57.047947222 -135.365511111        0    10890    25    133.168 ISIT PASI PA 11 LDA
12  57.047194444 -135.366427778       40    10890    25      0.000 ISIT PASI PA SITKA ROCKY GUTIERREZ DME-ILS
 5  62.053536111 -163.301466667        0    10910    25    182.432 ISMA PASM PA 17 LOC
12  62.053763889 -163.299600000      308    10910    25      0.000 ISMA PASM PA ST MARY'S DME-ILS
 4  57.178022222 -170.218883333       37    10990    25      9.625 IPAU PASN PA 36 ILS-cat-I
 6  57.160252778 -170.226155556       37    10990    25 300009.625 IPAU PASN PA 36 GS
 4  52.716588889  174.091313889       85    11010    25    287.794 ISYA PASY PA 28 ILS-cat-I
 6  52.710025000  174.131052778       85    11010    25 250287.794 ISYA PASY PA 28 GS
 5  63.881050000 -160.795094444        0    11130    25    157.483 IUNK PAUN PA 15 LOC
12  63.880958333 -160.793375000       33    11130    25      0.000 IUNK PAUN PA UNALAKLEET DME-ILS
 5  61.135997222 -146.220716667        0    10950    25     73.695 IVDZ PAVD PA 06 LDA
12  61.135308333 -146.220397222      135    10950    25      0.000 IVDZ PAVD PA VALDEZ PIONEER DME-ILS
 5  56.484108333 -132.362536111        0    10850    25    111.201 IRGL PAWG PA 10 LDA
12  56.484483333 -132.362222222       63    10850    25      0.000 IRGL PAWG PA WRANGELL DME-ILS
 4  59.494527778 -139.631416667       36    11110    25    135.077 IYAK PAYA PA 11 ILS-cat-I
 6  59.509983333 -139.659716667       36    11110    25 300135.077 IYAK PAYA PA 11 GS
13  52.711666667   19.570000000      394    11765   130      0.000  PCK ENRT EP PLONSK DME
 3  47.367027778   17.501305556      502    11475   130      3.000  PCT ENRT LH PAPA VOR/DME
12  47.367055556   17.501444444      502    11475   130      0.000  PCT ENRT LH PAPA VOR/DME
 3  31.130000000  121.671666667      328    10940    40     -5.000  PDL ENRT ZS LIUZAO VOR/DME
12  31.130000000  121.671666667      328    10940    40      0.000  PDL ENRT ZS LIUZAO VOR/DME
 3  42.053416667   24.876305556      600    11490   130      4.000  PDV ENRT LB PLOVDIV VOR/DME
12  42.053416667   24.876305556      600    11490   130      0.000  PDV ENRT LB PLOVDIV VOR/DME
13  51.718333333   40.189166667      591    11720   130      0.000   PE ENRT UU PETROVSKOYE DME
 3  40.048333333  116.735000000      203    11470   130     -6.000  PEK ENRT ZB GUANZHUANG VOR/DME
12  40.048333333  116.735000000      203    11470   130      0.000  PEK ENRT ZB GUANZHUANG VOR/DME
 3  57.920694444   56.028333333      404    10820   130     15.000  PER ENRT US PERM VOR/DME
12  57.920694444   56.028333333      404    10820   130      0.000  PER ENRT US PERM VOR/DME
 3  53.194750000  158.434972222      197    11370   130     -7.000  PKK ENRT UH YELIZOVO VOR/DME
12  53.194750000  158.434972222      197    11370   130      0.000  PKK ENRT UH YELIZOVO VOR/DME
13  55.956527778   21.087055556      100    11480   130      0.000  PLG ENRT EY PALANGA DME
 3  66.408361111  112.027055556     1670    11290   130     -9.000  PLR ENRT UE POLIARNY VOR/DME
12  66.408361111  112.027055556     1670    11290   130      0.000  PLR ENRT UE POLIARNY VOR/DME
 3  25.808333333  114.875000000      350    11160   130     -3.000  PLT ENRT ZS PANLONG VOR/DME
12  25.808333333  114.875000000      350    11160   130      0.000  PLT ENRT ZS PANLONG VOR/DME
 3  52.153611111   26.130000000      492    11340   130      6.000  PNK ENRT UM PINSK VOR/DME
12  52.153611111   26.130000000      492    11340   130      0.000  PNK ENRT UM PINSK VOR/DME
 3  53.113833333   45.017638889      591    11380   130     10.000  PNZ ENRT UW PENZA VOR/DME
12  53.113833333   45.017638889      591    11380   130      0.000  PNZ ENRT UW PENZA VOR/DME
13  57.712777778   34.972222222      689    11270   130      0.000   PO ENRT UU POCHINOK DME
 3  23.021666667  113.190000000       89    11410    40     -2.000  POU ENRT ZG PINGZHOU VOR/DME
12  23.021666667  113.190000000       89    11410    40      0.000  POU ENRT ZG PINGZHOU VOR/DME
 3  49.064750000   20.350027778     2388    11210   130      5.000  PPD ENRT LZ TATRY VOR/DME
12  49.064750000   20.350027778     2388    11210   130      0.000  PPD ENRT LZ TATRY VOR/DME
13  49.784972222   14.034750000     2300    11760    40      0.000  PSK ENRT LK PISEK DME
 3  47.152222222   18.742305556      453    11710   130      4.000  PTB ENRT LH PUSZTASZABOLCS VOR/DME
12  47.152111111   18.742250000      453    11710   130      0.000  PTB ENRT LH PUSZTASZABOLCS VOR/DME
 3  61.598888889   90.013333333      197    11340   130      9.000  PTG ENRT UN PODKAMENNAYA TUNGUSKA VOR/DME
12  61.598888889   90.013333333      197    11340   130      0.000  PTG ENRT UN PODKAMENNAYA TUNGUSKA VOR/DME
13  42.161666667   41.697222222      100    11100   130      0.000  PTI ENRT UG POTI DME
 3  45.247555556  147.980666667      438    11060   130     -8.000  PTR ENRT UH ITURUP VOR/DME
12  45.247555556  147.980666667      438    11060   130      0.000  PTR ENRT UH ITURUP VOR/DME
 3  31.171666667  121.783333333      328    11690   130     -5.000  PUD ENRT ZS PUDONG VOR/DME
12  31.171666667  121.783333333      328    11690   130      0.000  PUD ENRT ZS PUDONG VOR/DME
 3  52.209611111   77.095027778      463    11400   130      9.000  PVL ENRT UA PAVLODAR VOR/DME
12  52.209611111   77.095027778      463    11400   130      0.000  PVL ENRT UA PAVLODAR VOR/DME
 2  42.054916667   24.873583333        0      537    15      0.000    P ENRT LB PLOVDIV NDB
 2  50.012472222   15.770505556        0      888    25      0.000    P ENRT LK PARDUBICE NDB
 2  25.405000000  110.060000000        0      286    50      0.000   PA ENRT ZG WUTONG NDB
 2  41.566666667   64.231666667        0      745    75      0.000   PC ENRT UT ZARAFSHAN NDB
 2  42.038583333   24.902500000        0      450    50      0.000  PDV ENRT LB PLOVDIV NDB
 2  49.062722222   20.442361111        0      438    25      0.000   PE ENRT LZ TATRY EAST NDB
 2  40.050000000   68.950000000        0      385    75      0.000   PF ENRT UT URA-TYUBE NDB
 2  46.936638889  142.718666667        0      505    15      0.000   PI ENRT UH YUZHNO-SAKHALINSK NDB
 2  49.873333333   31.125555556        0      425    75      0.000   PI ENRT UK PII NDB
 2  50.011091667   15.813019444        0      432    25      0.000   PK ENRT LK PARDUBICE NDB
 2  57.736666667   28.368333333        0      300    15      0.000   PK ENRT UL PSKOV NDB
 2  31.284550000  121.329619444        0      208    15      0.000   PK ENRT ZS NANXIANG NDB
 2  48.608138889   17.822250000        0      297    25      0.000  PNY ENRT LZ CENTR (PIESTANY) NDB
 2  59.780694444   30.347583333        0      277    15      0.000   PO ENRT UL ST PETERSBURG NDB
 2  46.005833333   18.232777778        0      412    50      0.000   PP ENRT LH POGANY (PECS) NDB
 2  49.068222222   20.353500000        0      317    25      0.000  PPD ENRT LZ TATRY NDB
 2  36.581666667  101.853333333        0      300    50      0.000   PQ ENRT ZL XINING NDB
 2  44.118055556   41.479166667        0     1210    50      0.000   PR ENRT UR PEREDOVAYA NDB
 2  38.533333333   68.401666667        0      310    75      0.000   PR ENRT UT OKTYABRSKIY NDB
 2  51.698888889   94.461111111        0      490    50      0.000   PS ENRT UN KYZYL NDB
 2  55.636138889   49.206194444        0      292    50      0.000   PS ENRT UW KAZAN NDB
 2  29.131000000  110.571700000        0      278    25      0.000   PS ENRT ZG HEHUA (ZHANGJIAJIE) NDB
 2  51.718333333   40.189444444        0      475    50      0.000   PT ENRT UU PETROVSKOYE NDB
 2  54.600583333   55.822916667        0      527    15      0.000   PT ENRT UW UFA NDB
 2  47.152500000   18.742777778        0      386    25      0.000  PTB ENRT LH PUSZTASZABOLCS NDB
 2  41.506666667  123.291666667        0      296    50      0.000   PU ENRT ZY DONGYANGJIAO NDB
 2  49.080111111   20.072527778        0      418    25      0.000   PW ENRT LZ TATRY WEST NDB
 2  55.956416667   21.087083333        0      407    15      0.000   PN EYPA EY PALANGA INTL NDB
 2  48.001527778   21.694055556        0      522    15      0.000    P LHNY LH NYIREGYHAZA NDB
 2  47.344805556   17.510638889        0      493    15      0.000    P LHPA LH PAPA NDB
 2  47.318638889   17.524333333        0      318    15      0.000   PC LHPA LH PAPA NDB
 2  69.803333333  170.580000000        0      560    25      0.000   PK UHMP UH PEVEK NDB
 2  46.910444444  142.718000000        0      645    15      0.000    P UHSS UH KHOMUTOVO (YUZHNO-SAKHALINSK) NDB
 2  48.357250000   35.069138889        0      687    15      0.000    P UKDD UK DNIPROPETROVS'K NDB
 2  47.886111111   35.326666667        0      608    15      0.000    P UKDE UK MOKRAYA (ZAPORIZHZHIA) NDB
 2  49.564166667   34.466944444        0     1180    15      0.000   PL UKHP UK POLTAVA NDB
 2  49.573888889   34.326388889        0     1180    15      0.000   PO UKHP UK POLTAVA NDB
 2  59.810277778   30.148333333        0      342    15      0.000   PK ULLI UL PULKOVO (ST PETERSBURG) NDB
 2  59.790972222   30.372055556        0      525    15      0.000   PL ULLI UL PULKOVO (ST PETERSBURG) NDB
 2  59.820666667   30.171416667        0      303    15      0.000   PU ULLI UL PULKOVO (ST PETERSBURG) NDB
 2  68.798888889   32.719444444        0     1290    15      0.000    P ULMM UL MURMANSK NDB
 2  68.823888889   32.673333333        0      635    25      0.000   PF ULMM UL MURMANSK NDB
 2  57.765000000   28.386666667        0      620    15      0.000    P ULOO UL PSKOV NDB
 2  51.682500000   94.427222222        0      996    25      0.000    P UNKY UN KYZYL NDB
 2  45.018750000   37.368611111        0      780    50      0.000    P URKA UR VITYAZEVO (ANAPA) NDB
 2  60.089750000   64.818083333        0      378    15      0.000    P USHU US URAY NDB
 2  60.063833333   64.807166667        0      780    15      0.000   PM USHU US URAY NDB
 2  65.439277778   72.741694444        0      485    15      0.000   PZ USMM US NADYM NDB
 2  57.949583333   56.089388889        0      705    25      0.000   PX USPP US BOLSHOE SAVINO (PERM) NDB
 2  56.742861111   60.764805556        0      413    15      0.000    P USSS US KOLTSOVO (YEKATERINBURG) NDB
 2  37.957222222   58.413055556        0      295    75      0.000   PQ UTAA UT ASHGABAT NDB
 2  55.508888889   37.531111111        0      305    15      0.000    P UUMO UU OSTAFYEVO (OSTAVYEVO) NDB
 2  55.511944444   37.583055556        0      625    15      0.000   PS UUMO UU OSTAFYEVO (OSTAVYEVO) NDB
 2  61.628444444   50.829611111        0      705    50      0.000    P UUYY UU SYKTYVKAR NDB
 2  61.603750000   50.809305556        0      345    50      0.000   PW UUYY UU SYKTYVKAR NDB
 2  54.582305556   55.840527778        0     1215    25      0.000    P UWUU UW UFA NDB
 2  29.108683333  110.469527778        0      384    25      0.000    P ZGDY ZG HEHUA (ZHANGJIAJIE) NDB
 2  25.243016667  110.041700000        0      330    25      0.000    P ZGKL ZG LIANGJIANG (GUILIN) NDB
 2  19.934822222  110.487038889        0      402    15      0.000    P ZJHK ZJ MEILAN (HAIKOU) NDB
 2  44.011850000  125.710130556        0      198    15      0.000    P ZYCC ZY LONGJIA (CHANGCHUN) NDB
 2  41.624555556  123.460283333        0      427    15      0.000    P ZYTX ZY TAOXIAN (SHENYANG) NDB
 3  38.033583333   13.177444444     3914    11230   130      2.000  PAL ENRT LI PALERMO VOR/DME
12  38.033694444   13.177472222     3914    11230   130      0.000  PAL ENRT LI PALERMO VOR/DME
 3  52.334761111    5.092161111        1    11780   130     -0.000  PAM ENRT EH PAMPUS VOR/DME
12  52.334761111    5.092161111        1    11780   130      0.000  PAM ENRT EH PAMPUS VOR/DME
 3  36.814444444   11.965750000      623    11610   130      2.000  PAN ENRT LI PANTELLERIA VOR/DME
12  36.814583333   11.965750000      623    11610   130      0.000  PAN ENRT LI PANTELLERIA VOR/DME
 3  42.688388889   -1.660777778     1870    11355    40     -1.000  PAP ENRT LE PAMPLONA SOUTH VOR/DME
12  42.688277778   -1.660888889     1870    11355    40      0.000  PAP ENRT LE PAMPLONA SOUTH VOR/DME
 3  36.399511111   28.064841667       41    10860    40      5.000  PAR ENRT LG RODOS VOR/DME
12  36.399511111   28.064841667       41    10860    40      0.000  PAR ENRT LG RODOS VOR/DME
 3  46.163694444    5.999916667     1415    11660   130      1.000  PAS ENRT LS PASSEIRY VOR/DME
12  46.163694444    5.999916667     1415    11660   130      0.000  PAS ENRT LS PASSEIRY VOR/DME
13  47.208572222   11.460258333     7368    11200   130      0.000  PAT ENRT LO PATSCHERKOFEL DME
 3  40.252916667   -3.348027778     2559    11695    40     -1.000  PDT ENRT LE PERALES VOR/DME
12  40.252888889   -3.347861111     2559    11695    40      0.000  PDT ENRT LE PERALES VOR/DME
 3  39.669166667    9.443333333     2064    10900   130      1.000  PED ENRT LI PERDASDEFOGU TACAN
12  39.669166667    9.443333333     2064    10900   130      0.000  PED ENRT LI PERDASDEFOGU TACAN DME
13  41.337777778   21.448611111     2080    11375   130      0.000  PEP ENRT LW PRILEP DME
 3  42.435833333   14.184166667       56    11590   130      2.000  PES ENRT LI PESCARA VOR/DME
12  42.436111111   14.184444444       56    11590   130      0.000  PES ENRT LI PESCARA VOR/DME
 3  48.999472222    2.623805556      348    11705    25     -1.000  PGS ENRT LF CHARLES-DE-GAULLE (PARIS) VOR/DME
12  48.999472222    2.623805556      348    11705    25      0.000  PGS ENRT LF CHARLES-DE-GAULLE (PARIS) VOR/DME
 3  44.917333333    9.720472222      486    11740    40      2.000  PIA ENRT LI PIACENZA TACAN
12  44.917333333    9.720472222      486    11740    40      0.000  PIA ENRT LI PIACENZA TACAN DME
 3  43.720277778   10.432333333       75    10830    25      2.000  PIN ENRT LI PISA TACAN
12  43.720277778   10.432333333       75    10830    25      0.000  PIN ENRT LI PISA TACAN DME
 3  61.409911111   23.577661111      450    11620   130      8.000  PIR ENRT EF PIRKKA (TAMPERE) VOR/DME
12  61.409911111   23.577661111      450    11620   130      0.000  PIR ENRT EF PIRKKA (TAMPERE) VOR/DME
 3  43.676583333   10.391555556       33    11210   130      2.000  PIS ENRT LI PISA VOR/DME
12  43.676638889   10.391444444       33    11210   130      0.000  PIS ENRT LI PISA VOR/DME
13  67.248861111   23.062277778      602    11535   130      0.000  PJL ENRT ES PAJALA DME
 3  35.227636111   23.680844444      120    11460   130      3.000  PLH ENRT LG PALEOCHORA VOR/DME
12  35.227636111   23.680844444      120    11460   130      0.000  PLH ENRT LG PALEOCHORA VOR/DME
13  53.425047222   11.784961111      170    11750    40      0.000  PMD ENRT ED SCHWERIN-PARCHIM DME
 3  40.911944444   12.957500000      682    11460   130      2.000  PNZ ENRT LI PONZA VORTAC
12  40.911944444   12.957500000      682    11460   130      0.000  PNZ ENRT LI PONZA VORTAC DME
 3  42.386194444   19.254611111      161    11300   130      4.000  POD ENRT LY PODGORICA VOR/DME
12  42.386194444   19.254611111      161    11300   130      0.000  POD ENRT LY PODGORICA VOR/DME
 3  46.581000000    0.298194444        0    11330   130     -0.000  POI ENRT LF POITIERS BIARDS VOR
 3  53.743766667   -2.103327778     1400    11210   130     -2.000  POL ENRT EG POLE HILL VOR/DME
12  53.743766667   -2.103327778     1400    11210   130      0.000  POL ENRT EG POLE HILL VOR/DME
 3  40.928250000   14.383361111      135    11785    25      2.000  POM ENRT LI POMIGLIANO VOR/DME
12  40.928222222   14.383388889      135    11785    25      0.000  POM ENRT LI POMIGLIANO VOR/DME
 3  49.096083333    2.035888889        0    11160   130     -1.000  PON ENRT LF PONTOISE CORMEILLES EN VE VOR
 3  45.474777778   13.612083333       35    11515   130      2.000  POR ENRT LJ PORTOROZ VOR/DME
12  45.474777778   13.612083333       35    11515   130      0.000  POR ENRT LJ PORTOROZ VOR/DME
 3  39.927444444    3.114583333     1181    11640    40      1.000  POS ENRT LE POLLENSA VOR/DME
12  39.927666667    3.114861111     1181    11640    40      0.000  POS ENRT LE POLLENSA VOR/DME
13  48.730138889    2.389777778      327    11215    25      0.000  POY ENRT LF ORLY (PARIS) DME
 3  42.750472222    2.867138889      151    11625   130      1.000  PPG ENRT LF PERPIGNAN RIVESALTES VOR/DME
12  42.750472222    2.867138889      151    11625   130      0.000  PPG ENRT LF PERPIGNAN RIVESALTES VOR/DME
 3  42.733750000   -1.702000000     3445    11230   130     -1.000  PPN ENRT LE PAMPLONA VOR/DME
12  42.733805556   -1.701833333     3445    11230   130      0.000  PPN ENRT LE PAMPLONA VOR/DME
 3  41.283111111    2.081861111        1    11430   130     -0.000  PRA ENRT LE EL PRAT VOR/DME
12  41.283000000    2.081750000        1    11430   130      0.000  PRA ENRT LE EL PRAT VOR/DME
 3  61.464594444   21.795858333       62    11320   130      8.000  PRI ENRT EF PREVIK (PORI) VOR/DME
12  61.464594444   21.795858333       62    11320   130      0.000  PRI ENRT EF PREVIK (PORI) VOR/DME
 3  38.172055556   13.079888889       39    11300    25      2.000  PRS ENRT LI RAISI (PALERMO) VOR/DME
12  38.172055556   13.079805556       39    11300    25      0.000  PRS ENRT LI RAISI (PALERMO) VOR/DME
 3  43.809833333   11.200500000      157    11250    40      2.000  PRT ENRT LI PERETOLA (FLORENCE) VOR/DME
12  43.809750000   11.200583333      157    11250    40      0.000  PRT ENRT LI PERETOLA (FLORENCE) VOR/DME
 3  41.273000000   -8.687833333      200    11410   130     -3.000  PRT ENRT LP PORTO VOR/DME
12  41.273000000   -8.687833333      200    11410   130      0.000  PRT ENRT LP PORTO VOR/DME
 3  42.572500000   21.031388889     1794    11330   130      3.000  PRT ENRT LY PRISTINA VOR/DME
12  42.572500000   21.031388889     1794    11330   130      0.000  PRT ENRT LY PRISTINA VOR/DME
 3  43.101694444   12.511888889      709    10940    40      2.000  PRU ENRT LI PERUGIA VOR/DME
12  43.101750000   12.511750000      709    10940    40      0.000  PRU ENRT LI PERUGIA VOR/DME
 3  38.919722222   20.757777778      328    10920    40      4.000  PRV ENRT LG PREVEZA TACAN
12  38.919722222   20.757777778      328    10920    40      0.000  PRV ENRT LG PREVEZA TACAN DME
 3  40.620000000   14.908361111      135    11045   130      2.000  PTC ENRT LI PONTECAGNANO (SALERNO) VOR/DME
12  40.620138889   14.908361111      135    11045   130      0.000  PTC ENRT LI PONTECAGNANO (SALERNO) VOR/DME
 3  56.442397222   -3.368600000        0    11040   130     -3.000  PTH ENRT EG PERTH VOR
 3  48.155583333    2.264777778        0    11650   130     -1.000  PTV ENRT LF PITHIVIERS VOR
 3  44.892366667   13.918119444      215    11125   130      3.000  PUL ENRT LD PULA VOR/DME
12  44.892366667   13.918119444      215    11125   130      0.000  PUL ENRT LD PULA VOR/DME
13  60.294377778   25.588477778      121    11280   130      0.000  PVO ENRT EF PORVOO DME
13  57.732611111   12.194361111      451    11335    40      0.000  PGG ESGG ES LANDVETTER (GOTEBORG) DME
 2  44.891722222   20.641111111        0      495    25      0.000   PA ENRT LY PANCEVO (BELGRADE) NDB
 2  51.623475000    8.639375000        0      354    15      0.000  PAD ENRT ED PADERBORN-LIPPSTADT NDB
 2  53.394225000   11.665900000        0      315    50      0.000  PAH ENRT ED SCHWERIN-PARCHIM NDB
 2  38.916583333   20.757277778        0      353    25      0.000  PAK ENRT LG PREVEZA NDB
 2  38.034277778   13.177388889        0      355    75      0.000  PAL ENRT LI PALERMO NDB
 2  42.714194444   -1.639055556        0      422    50      0.000  PAM ENRT LE PAMPLONA NDB
 2  36.811361111   11.961027778        0      335    75      0.000  PAN ENRT LI PANTELLERIA NDB
 2  41.337777778   21.448611111        0      297    75      0.000  PEP ENRT LW PRILEP NDB
 2  42.436305556   14.183472222        0      342    25      0.000  PES ENRT LI PESCARA NDB
 2  41.078083333   -8.636555556        0      367    15      0.000   PG ENRT LP PORTO NDB
 2  50.129247222   -5.516863889        0      333    25      0.000   PH ENRT EG PENZANCE HELIPORT NDB
 2  48.767166667    7.199388889        0      424    25      0.000  PHG ENRT LF PHALSBOURG NDB
 2  53.461311111   11.907172222        0      333    25      0.000   PI ENRT ED SCHWERIN-PARCHIM NDB
 2  46.703944444    0.406972222        0      363    50      0.000   PI ENRT LF POITIERS NDB
 2  38.558194444  -28.403222222        0      420    15      0.000   PI ENRT LP PICO NDB
 2  44.871666667    9.826666667        0      440    50      0.000  PIA ENRT LI PIACENZA NDB
 2  55.506088889   -4.577252778        0      355    25      0.000  PIK ENRT EG PRESTWICK NDB
 2  45.605027778   15.843997222        0      424    25      0.000  PIS ENRT LD PISAROVINA NDB
 2  43.589222222   10.297083333        0      379    25      0.000  PIS ENRT LI PISA NDB
 2  44.889208333   13.753516667        0      351    15      0.000  PLA ENRT LD PULA NDB
 2  43.092916667    1.596166667        0      384    15      0.000  PMR ENRT LF PAMIERS NDB
 2  39.437416667   -0.346472222        0      340    50      0.000  PND ENRT LE PINEDO (VALENCIA) NDB
 2  48.051111111   -2.794444444        0      377    15      0.000  PNT ENRT LF PONTIVY NDB
 2  43.314111111   -0.166222222        0      397    25      0.000   PO ENRT LF PAU/PYRENEES NDB
 2  42.388583333   19.254861111        0      335    25      0.000  POD ENRT LY PODGORICA NDB
 2  40.928750000   14.382972222        0      351    50      0.000  POM ENRT LI POMIGLIANO NDB
 2  41.348138889   -8.708138889        0      327    75      0.000  POR ENRT LP PORTO NDB
 2  48.730138889    2.389777778        0      334    25      0.000  POY ENRT LF ORLY (PARIS) NDB
 2  44.620750000   21.147722222        0      416    25      0.000  POZ ENRT LY POZAREVAC NDB
 2  42.866638889   -1.716944444        0      354    25      0.000   PP ENRT LE PAMPLONA NDB
 2  38.189722222   13.109888889        0      329    25      0.000  PRS ENRT LI RAISI (PALERMO) NDB
 2  43.101972222   12.510722222        0      398    50      0.000  PRU ENRT LI PERUGIA NDB
 2  51.864300000    4.210488889        0      369    25      0.000   PS ENRT EH ROTTERDAM NDB
 2  49.862241667    9.348325000        0      370    50      0.000  PSA ENRT ED SPESSART NDB
 2  62.642122222   22.936136111        0      352    15      0.000  PSJ ENRT EF SEINAJOKI NDB
 2  33.068500000  -16.358250000        0      338    75      0.000  PST ENRT LP PORTO SANTO NDB
 2  39.427333333    3.256722222        0      401    15      0.000  PTC ENRT LE PORTO COLOM NDB
 2  40.620638889   14.907555556        0      324    50      0.000  PTC ENRT LI PONTECAGNANO (SALERNO) NDB
 2  43.320527778   -0.305111111        0      364    25      0.000   PU ENRT LF PAU/PYRENEES NDB
 2  45.266305556   19.799500000        0      300    25      0.000   PV ENRT LY PETROVARADIN NDB
 2  45.166305556    0.912777778        0      389    15      0.000   PX ENRT LF PERIGUEUX NDB
 2  45.018166667    3.814944444        0      372    15      0.000   PY ENRT LF LE PUY NDB
 2  45.477472222   13.614916667        0      388    50      0.000   PZ ENRT LJ PORTOROZ NDB
 2  69.895841667   25.008077778        0      275    25      0.000   PG ENNA EN PORSANG (LAKSELV) NDB
 2  58.263222222   12.414472222        0      325    15      0.000   PG ESGT ES TROLLHATTAN-VANERSBORG NDB
 2  58.796083333   17.044277778        0      398    15      0.000  PEO ESKN ES SKAVSTA (STOCKHOLM) NDB
 2  67.267750000   22.942722222        0      390    15      0.000  PAJ ESUP ES PAJALA NDB
 2  39.599361111    2.821166667        0      307    15      0.000   PA LEPA LE PALMA DE MALLORCA NDB
 2  42.679055556    2.924416667        0      351    15      0.000   PL LFMP LF RIVESALTES (PERPIGNAN) NDB
 2  37.011547222   25.129077778        0      386    15      0.000  PAO LGPA LG PAROS NDB
 2  37.735027778  -25.675055556        0      351    25      0.000   PD LPPD LP PONTA DELGADA NDB
 2  41.914166667   21.638055556        0      295    15      0.000   PT LWSK LW ALEXANDER THE GREAT (SKOPJE) NDB
 2  44.953111111   20.226694444        0      320    15      0.000   PZ LYBT LY BATAJNICA (BELGRADE) NDB
 3  18.576388889  -72.304166667      125    11530    40    -10.000  PAP ENRT MT PORT AU PRINCE VOR/DME
12  18.576388889  -72.304166667      125    11530    40      0.000  PAP ENRT MT PORT AU PRINCE VOR/DME
 3  20.600563889  -97.455077778      487    11550    40      5.000  PAZ ENRT MM POZA RICA VOR/DME
12  20.600563889  -97.455077778      487    11550    40      0.000  PAZ ENRT MM POZA RICA VOR/DME
 3  19.160919444  -98.370175000     7378    11520    40      6.000  PBC ENRT MM PUEBLA VOR/DME
12  19.160919444  -98.370175000     7378    11520    40      0.000  PBC ENRT MM PUEBLA VOR/DME
 3  20.131841667  -98.684394444     9665    11270    40      6.000  PCA ENRT MM PACHUCA VOR/DME
12  20.131841667  -98.684394444     9665    11270    40      0.000  PCA ENRT MM PACHUCA VOR/DME
 3  12.131666667  -68.249444444       20    11500   130    -11.000  PJB ENRT TN BONAIRE VOR/DME
12  12.131666667  -68.249444444       20    11500   130      0.000  PJB ENRT TN BONAIRE VOR/DME
 3  12.197069444  -69.011894444       98    11670    40    -11.000  PJG ENRT TN CURACAO VOR/DME
12  12.197069444  -69.011894444       98    11670    40      0.000  PJG ENRT TN CURACAO VOR/DME
 3  18.038116667  -63.118277778       15    11300    40    -14.000  PJM ENRT TN SAINT MAARTEN VOR/DME
12  18.038116667  -63.118277778       15    11300    40      0.000  PJM ENRT TN SAINT MAARTEN VOR/DME
 3   8.406219444  -78.138577778        0    11310    40     -3.000  PML ENRT MP LA PALMA VOR
 3  18.567258333  -68.383313889       49    11270    25    -13.000  PNA ENRT MD PUNTA CANA (HIGUEY) VOR/DME
12  18.567258333  -68.383313889       49    11270    25      0.000  PNA ENRT MD PUNTA CANA (HIGUEY) VOR/DME
 3  28.631844444 -100.538386111      919    11360    40      7.000  PNG ENRT MM PIEDRAS VOR/DME
12  28.631844444 -100.538386111      919    11360    40      0.000  PNG ENRT MM PIEDRAS VOR/DME
 3  10.466388889  -61.392361111       88    11690    40    -15.000  POS ENRT TT PIARCO (PORT OF SPAIN) VOR/DME
12  10.466388889  -61.392361111       88    11690    40      0.000  POS ENRT TT PIARCO (PORT OF SPAIN) VOR/DME
 3  31.367272222 -113.301377778       36    11490    40     12.000  PPE ENRT MM PENASCO (PUNTA PENASCO) VOR/DME
12  31.367272222 -113.301377778       36    11490    40      0.000  PPE ENRT MM PENASCO (PUNTA PENASCO) VOR/DME
 3  16.265194444  -61.540138889       44    11290    40    -15.000  PPR ENRT TF POINTE A PITRE VOR/DME
12  16.265194444  -61.540138889       44    11290    40      0.000  PPR ENRT TF POINTE A PITRE VOR/DME
 3  17.537136111  -92.031561111      206    11500   130      4.000  PQE ENRT MM PALENQUE VOR/DME
12  17.537136111  -92.031561111      206    11500   130      0.000  PQE ENRT MM PALENQUE VOR/DME
 3  17.992447222  -66.519177778        0    10900    40    -10.000  PSE ENRT TJ PONCE VOR
 3  19.759283333  -70.570416667       38    11510    40    -11.000  PTA ENRT MD PUERTO PLATA VOR/DME
12  19.759283333  -70.570416667       38    11510    40      0.000  PTA ENRT MD PUERTO PLATA VOR/DME
 3  19.645697222  -99.798027778     8379    11450    40      7.000  PTJ ENRT MM PASTEJE VOR/DME
12  19.645697222  -99.798027778     8379    11450    40      0.000  PTJ ENRT MM PASTEJE VOR/DME
 3  21.772241667  -72.266019444       37    11560    40    -10.000  PVN ENRT MB PROVIDENCIALES VOR/DME
12  21.772241667  -72.266019444       37    11560    40      0.000  PVN ENRT MB PROVIDENCIALES VOR/DME
 3  20.691950000 -105.239316667       39    11650    40      8.000  PVR ENRT MM VALLARTA (PUERTO VALLARTA VOR/DME
12  20.691950000 -105.239316667       39    11650    40      0.000  PVR ENRT MM VALLARTA (PUERTO VALLARTA VOR/DME
 3  15.875105556  -97.081713889      312    11250    40      6.000  PXM ENRT MM ESCONDIDO (PUERTO ESCONDI VOR/DME
12  15.875105556  -97.081713889      312    11250    40      0.000  PXM ENRT MM ESCONDIDO (PUERTO ESCONDI VOR/DME
 3  14.045208333  -83.388280556       18    11290    40     -0.000  PZA ENRT MN PUERTO CABEZAS VOR/DME
12  14.045208333  -83.388280556       18    11290    40      0.000  PZA ENRT MN PUERTO CABEZAS VOR/DME
 2  18.435833333  -93.189166667        0      392    50      0.000  PB1 ENRT MM DOS BOCAS NDB
 2  12.132572222  -68.280725000        0      321    50      0.000  PJB ENRT TN BONAIRE NDB
 2  18.037794444  -63.117869444        0      284    25      0.000  PJD ENRT TN SAINT MAARTEN NDB
 2  17.487441667  -62.990838889        0      235    15      0.000  PJE ENRT TN ST. EUSTATIOUS NDB
 2  16.325000000  -89.421666667        0      363    50      0.000  POP ENRT MG POPTUN NDB
 2  17.950000000  -92.320833333        0      381    50      0.000  PPI ENRT MM CIUDAD PEMEX NDB
 2  19.933333333  -72.850000000        0      332    50      0.000  PPX ENRT MT PORT DE PAIX NDB
 2  16.283611111  -61.630944444        0      385    50      0.000  PTP ENRT TF POINTE A PITRE NDB
 2  21.777716667  -72.260561111        0      387    50      0.000   PV ENRT MB PROVIDENCIALES NDB
 3  39.603111111   47.889972222      220    11220   130      5.000  PAD ENRT OI PARSABADE MOGHAN VOR/DME
12  39.603111111   47.889972222      220    11220   130      0.000  PAD ENRT OI PARSABADE MOGHAN VOR/DME
 3  21.651375000   69.655747222       23    11240   130     -0.000  PBN ENRT VA PORBANDAR VOR/DME
12  21.651375000   69.655747222       23    11240   130      0.000  PBN ENRT VA PORBANDAR VOR/DME
 3  26.955613889   64.125213889     3307    11430   130      1.000   PG ENRT OP PANJGUR VOR/DME
12  26.955613889   64.125213889     3307    11430   130      0.000   PG ENRT OP PANJGUR VOR/DME
 3  34.711777778   32.505833333       98    11790   130      4.000  PHA ENRT LC PAFOS VOR/DME
12  34.711777778   32.505833333       98    11790   130      0.000  PHA ENRT LC PAFOS VOR/DME
13  28.200833333   83.984722222     2720    11280   130      0.000  PHR ENRT VN POKHARA DME
 3  35.762027778   50.851555556     4125    11750   130      4.000  PIM ENRT OI PAYAM VOR/DME
12  35.762027778   50.851555556     4125    11750   130      0.000  PIM ENRT OI PAYAM VOR/DME
 3  24.547583333   39.705250000     2200    11410   130      4.000  PMA ENRT OE MADINAH VOR/DME
12  24.547472222   39.705250000     2200    11410   130      0.000  PMA ENRT OE MADINAH VOR/DME
 3  11.649722222   92.745833333      502    11570    40     -1.000  PPB ENRT VO PORT BLAIR VOR/DME
12  11.649722222   92.745833333      502    11570    40      0.000  PPB ENRT VO PORT BLAIR VOR/DME
 3  18.584555556   73.912430556     1942    11460   130     -1.000  PPN ENRT VA PUNE VOR/DME
12  18.584555556   73.912430556     1942    11460   130      0.000  PPN ENRT VA PUNE VOR/DME
 3  25.590416667   85.089916667      194    11210    40     -0.500  PPT ENRT VE PATNA VOR/DME
12  25.590416667   85.089916667      194    11210    40      0.000  PPT ENRT VE PATNA VOR/DME
 3  24.037222222   74.743888889     1750    11490    40     -1.000  PRA ENRT VA PRATAPGARH VOR/DME
12  24.037222222   74.743888889     1750    11490    40      0.000  PRA ENRT VA PRATAPGARH VOR/DME
 3  27.360333333   52.764444444       21    11210   130      2.000  PRG ENRT OI PERSIAN GULF VOR/DME
12  27.360333333   52.764444444       21    11210   130      0.000  PRG ENRT OI PERSIAN GULF VOR/DME
 3  27.300833333   89.505555556    11483    10840   130     -0.000  PRO ENRT VQ PARO VOR/DME
12  27.300833333   89.505555556    11483    10840   130      0.000  PRO ENRT VQ PARO VOR/DME
 3  33.978205556   71.516919444     1207    11430   130      2.000   PS ENRT OP PESHAWAR VOR/DME
12  33.978205556   71.516919444     1207    11430   130      0.000   PS ENRT OP PESHAWAR VOR/DME
 3  24.073916667   47.583277778     1600    11540    40      2.000  PSA ENRT OE PRINCE SULTAN VORTAC
12  24.073916667   47.583277778     1600    11540    40      0.000  PSA ENRT OE PRINCE SULTAN VORTAC DME
 3  18.580000000   73.914166667     1942    11390   130     -1.000  PUN ENRT VA PUNE VOR/DME
12  18.580000000   73.914166667     1942    11390   130      0.000  PUN ENRT VA PUNE VOR/DME
 2  39.578527778   47.967444444        0      450    25      0.000  PAD ENRT OI PARSABADE MOGHAN NDB
 2  33.905400000   70.072450000        0      273    25      0.000   PC ENRT OP PARACHINAR NDB
 2  26.956175000   64.138311111        0      388    50      0.000   PG ENRT OP PANJGUR NDB
 2  34.718472222   32.476222222        0      328    50      0.000  PHA ENRT LC PAFOS NDB
 2  25.287936111   63.348697222        0      400    25      0.000   PI ENRT OP PASNI NDB
 2  35.761777778   50.849444444        0      306    50      0.000  PIM ENRT OI PAYAM NDB
 2  32.240555556   75.633055556        0      393    50      0.000   PK ENRT VI PATHANKOT NDB
 2  21.641194444   69.662583333        0      344    50      0.000   PR ENRT VA PORBANDAR NDB
 2  27.399444444   89.424722222        0      410    50      0.000   PR ENRT VQ PARO NDB
 2  27.392527778   52.726027778        0      457    50      0.000  PRG ENRT OI PERSIAN GULF NDB
 2  33.995833333   71.504444444        0      308    50      0.000   PS ENRT OP PESHAWAR NDB
 2  24.107144444   41.034947222        0      382    50      0.000 PS10 ENRT OE PUMP STATION 10 NDB
 2  25.172955556   47.491711111        0      315    25      0.000  PS3 ENRT OE PUMP STATION 3 NDB
 2  24.708572222   44.966225000        0      370    25      0.000  PS6 ENRT OE PUMP STATION 6 NDB
 2  24.275875000   42.142800000        0      607    50      0.000  PS9 ENRT OE PUMP STATION 9 NDB
 2  28.540888889   77.199055556        0      303    50      0.000   PL VIDP VI INDIRA GANDHI INTL (DELHI) NDB
 3  18.134105556  100.166208333      535    11180    40     -0.500  PAE ENRT VT PHRAE VOR/DME
12  18.134105556  100.166208333      535    11180    40      0.000  PAE ENRT VT PHRAE VOR/DME
 3  15.196750000  105.738055556      362    11500    40     -1.000  PAK ENRT VL PAKSE VOR/DME
12  15.196750000  105.738055556      362    11500    40      0.000  PAK ENRT VL PAKSE VOR/DME
 3  13.957222222  109.042500000      110    11630    40     -1.000  PCA ENRT VV PHU CAT VOR/DME
12  13.957222222  109.042500000      110    11630    40      0.000  PCA ENRT VV PHU CAT VOR/DME
 3  16.676000000  101.196700000      449    11540    40     -0.000  PCB ENRT VT PHETCHABUN VOR/DME
12  16.676000000  101.196700000      449    11540    40      0.000  PCB ENRT VT PHETCHABUN VOR/DME
 3  11.786775000   99.791727778       33    11370   130     -0.400  PCK ENRT VT PRACHUAP KHIRI KHAN TACAN
12  11.786775000   99.791727778       33    11370   130      0.000  PCK ENRT VT PRACHUAP KHIRI KHAN TACAN DME
 3  22.670727778  120.460319444      103    10960   130     -3.000  PIT ENRT RC PINGTUNG TACAN
12  22.670727778  120.460319444      103    10960   130      0.000  PIT ENRT RC PINGTUNG TACAN DME
 3  14.006038889  108.024405556     2395    11340   130      1.000  PLK ENRT VV PLEIKU VOR/DME
12  14.006038889  108.024405556     2395    11340   130      0.000  PLK ENRT VV PLEIKU VOR/DME
 3  11.543972222  104.843916667       56    11430    40     -1.000  PNH ENRT VD PHNOM PENH VOR/DME
12  11.543972222  104.843916667       56    11430    40      0.000  PNH ENRT VD PHNOM PENH VOR/DME
13   6.983480556  158.202116667       10    11100   130      0.000  PNI ENRT PT POHNPEI DME
13  34.946394444  139.895527778      621    11250   130      0.000  PQD ENRT RJ TATEYAMA DME
 3  10.165297222  104.038944444       23    11300   130     -0.000  PQU ENRT VV PHU QUOC VOR/DME
12  10.165297222  104.038944444       23    11300   130      0.000  PQU ENRT VV PHU QUOC VOR/DME
 3   9.741327778  118.752941667       85    11590    40     -0.000   PR ENRT RP PUERTO PRINCESA VOR/DME
12   9.741327778  118.752941667       85    11590    40      0.000   PR ENRT RP PUERTO PRINCESA VOR/DME
 3  18.400000000  120.633333333      400    11410   130     -0.000  PRD ENRT RP LAOAG TACAN
12  18.400000000  120.633333333      400    11410   130      0.000  PRD ENRT RP LAOAG TACAN DME
 3  16.770372222  100.291305556      159    11410    40     -0.000  PSL ENRT VT PHITSANULOK VOR/DME
12  16.770372222  100.291305556      159    11410    40      0.000  PSL ENRT VT PHITSANULOK VOR/DME
 3  35.122500000  128.999444444     1900    11400    40     -7.000  PSN ENRT RK BUSAN VORTAC
12  35.122500000  128.999444444     1900    11400    40      0.000  PSN ENRT RK BUSAN VORTAC DME
 3  10.928044444  108.072041667      200    11410    40     -0.000  PTH ENRT VV PHANTHIET VOR/DME
12  10.928044444  108.072041667      200    11410    40      0.000  PTH ENRT VV PHANTHIET VOR/DME
 3  36.967847222  127.020816667       50    10820    25     -7.000  PTK ENRT RK PYONGTAEK VOR/DME
12  36.967847222  127.020816667       50    10820    25      0.000  PTK ENRT RK PYONGTAEK VOR/DME
 3  16.813550000   94.772219444       37    11560   130     -1.000  PTN ENRT VY PATHEIN VOR/DME
12  16.813550000   94.772219444       37    11560   130      0.000  PTN ENRT VY PATHEIN VOR/DME
 3   8.115230556   98.306302778       55    11690    40     -1.000  PUT ENRT VT PHUKET VOR/DME
12   8.115230556   98.306302778       55    11690    40      0.000  PUT ENRT VT PHUKET VOR/DME
 2  16.398644444  107.725588889        0      348    50      0.000    P ENRT VV PHU BAI (HUE) NDB
 2  16.892116667   97.675133333        0      365    50      0.000   PA ENRT VY HPA-AN NDB
 2  14.118333333  101.371666667        0      201    50      0.000   PB ENRT VT PRACHIN BURI NDB
 2  16.395863889  107.771977778        0      440    50      0.000   PB ENRT VV PHU BAI (HUE) NDB
 2  16.659166667  101.189722222        0      283    50      0.000   PC ENRT VT PHETCHABUN NDB
 2  13.865555556  109.105833333        0      250    50      0.000   PC ENRT VV PHU CAT NDB
 2  11.791636111   99.800008333        0      320    50      0.000  PCK ENRT VT PRACHUAP KHIRI KHAN NDB
 2  16.660869444  101.190361111        0      283    50      0.000   PH ENRT VT PHETCHABUN NDB
 2  19.441944444  103.135555556        0      230    50      0.000  PHO ENRT VL PHONESAVANH NDB
 2  11.356388889  120.723055556        0      373    50      0.000  PIN ENRT RP PAMALICAN (QUINALUBAN I.) NDB
 2  26.224416667  119.999916667        0      275    15      0.000   PK ENRT RC MATSU NDB
 2  14.006666667  108.008888889        0      282    50      0.000   PK ENRT VV PLEIKU NDB
 2  16.795955556  100.275727778        0      263    50      0.000   PL ENRT VT PHITSANULOK NDB
 2   6.982327778  158.202063889        0      366    50      0.000  PNI ENRT PT POHNPEI NDB
 2  19.541138889 -154.972227778        0      332    50      0.000  POA ENRT PH PAHOA NDB
 2  10.223611111  103.961944444        0      278    50      0.000   PQ ENRT VV PHUQUOC NDB
 2  18.129483333  100.161363889        0      340    50      0.000   PR ENRT VT PHRAE NDB
 2  15.130611111  105.783888889        0      220    50      0.000   PS ENRT VL PAKSE NDB
 2   6.788458333  101.147919444        0      201    50      0.000   PT ENRT VT PATTANI NDB
 2  27.326050000   97.424155556        0      340    50      0.000   PT ENRT VY PUTAO NDB
 2  16.813100000   94.779694444        0      415    50      0.000  PTN ENRT VY PATHEIN NDB
 4  15.124575000  145.743413889      208    10990    25     67.681 IGSN PGSN PG 07 ILS-cat-I
 6  15.116302778  145.720291667      208    10990    25 300067.681 IGSN PGSN PG 07 GS
12  15.125136111  145.742808333      220    10990    25      0.000 IGSN PGSN PG SAIPAN INTL DME-ILS
 4  13.593455556  144.945563889      529    10930    25     65.756 IAND PGUA PG 06L ILS-cat-I
 6  13.582686111  144.917872222      529    10930    25 300065.756 IAND PGUA PG 06L GS
 4  13.573805556  144.913027778      596    11010    25    245.735 IPMY PGUA PG 24L ILS-cat-I
 6  13.587652778  144.941438889      596    11010    25 300245.735 IPMY PGUA PG 24L GS
 4  13.589352778  144.948511111      545    11010    25     65.735 IUAM PGUA PG 06R ILS-cat-I
 6  13.577788889  144.918669444      545    11010    25 300065.735 IUAM PGUA PG 06R GS
 4  13.578675000  144.911805556      594    10930    25    245.756 IYIG PGUA PG 24R ILS-cat-I
 6  13.591738889  144.938202778      594    10930    25 300245.756 IYIG PGUA PG 24R GS
 4  13.490063889  144.813036111      237    11090    25     64.809 IAWD PGUM PG 06R ILS-cat-I
 6  13.477222222  144.787611111      237    11090    25 300064.809 IAWD PGUM PG 06R GS
12  13.489372222  144.813366667      316    11090    25      0.000 IAWD PGUM PG GUAM INTL DME-ILS
 4  13.491830556  144.812241667      246    11030    25     64.821 IGUM PGUM PG 06L ILS-cat-I
 6  13.481061111  144.785533333      246    11030    25 300064.821 IGUM PGUM PG 06L GS
12  13.492805556  144.811927778      317    11030    25      0.000 IGUM PGUM PG GUAM INTL DME-ILS
 4  19.720894444 -156.047222222       41    10970    25    184.789 IKOA PHKO PH 17 ILS-cat-I
 6  19.750772222 -156.045452778       41    10970    25 300184.789 IKOA PHKO PH 17 GS
12  19.720775000 -156.047847222       36    10970    25      0.000 IKOA PHKO PH KONA INTL AT KEAHOLE DME-ILS
 4  21.986519444 -159.335877778       88    11090    25      0.016 ILIH PHLI PH 35 ILS-cat-I
 6  21.966680556 -159.335069444       88    11090    25 300000.016 ILIH PHLI PH 35 GS
12  21.983083333 -159.335050000       94    11090    25      0.000 ILIH PHLI PH LIHUE DME-ILS
 5  21.326408333 -157.907858333        0    10910    25    313.442 IEPC PHNL PH 26L LDA
12  21.326933333 -157.907194444       21    10910    25      0.000 IEPC PHNL PH HONOLULU INTL DME-ILS
 4  21.325244444 -157.904127778        7    11170    25     90.007 IHNL PHNL PH 08L ILS-cat-I
 6  21.324077778 -157.939608333        7    11170    25 300090.007 IHNL PHNL PH 08L GS
 4  21.330505556 -157.903625000        6    11050    25     52.864 IIUM PHNL PH 04R ILS-cat-I
 6  21.314997222 -157.924138889        6    11050    25 300052.864 IIUM PHNL PH 04R GS
12  21.329961111 -157.903077778       20    11050    25      0.000 IIUM PHNL PH HONOLULU INTL DME-ILS
 4  20.792536111 -156.944294444     1302    11110    25     43.875 ILNY PHNY PH 03 ILS-cat-I
 6  20.781986111 -156.954019444     1302    11110    25 300043.875 ILNY PHNY PH 03 GS
12  20.793016667 -156.944822222     1320    11110    25      0.000 ILNY PHNY PH LANAI CITY DME-ILS
 4  20.906161111 -156.423652778       48    11010    25     34.812 IOGG PHOG PH 02 ILS-cat-I
 6  20.891541667 -156.433119444       48    11010    25 300034.812 IOGG PHOG PH 02 GS
12  20.905205556 -156.423325000        9    11010    25      0.000 IOGG PHOG PH KAHULUI DME-ILS
 4  19.721369444 -155.060772222       33    11070    25    270.011 IITO PHTO PH 26 ILS-cat-I
 6  19.722469444 -155.032805556       33    11070    25 260270.011 IITO PHTO PH 26 GS
12  19.720483333 -155.060975000       39    11070    25      0.000 IITO PHTO PH HILO INTL DME-ILS
 3  -9.401961111  -38.252819444        0    11330    40    -23.000  PAF ENRT SB PAULO AFONSO VOR
 3 -22.454030556  -43.840566667     1200    11500    40    -21.000  PAI ENRT SB PIRAI VOR/DME
12 -22.454030556  -43.840566667     1200    11500    40      0.000  PAI ENRT SB PIRAI VOR/DME
 3 -34.611666667  -58.613888889       59    11520    40     -7.000  PAL ENRT SA EL PALOMAR (BUENOS AIRES) VOR/DME
12 -34.611666667  -58.613888889       59    11520    40      0.000  PAL ENRT SA EL PALOMAR (BUENOS AIRES) VOR/DME
 3 -31.808361111  -60.484461111      250    11680    40     -6.000  PAR ENRT SA PARANA VOR/DME
12 -31.808361111  -60.484461111      250    11680    40      0.000  PAR ENRT SA PARANA VOR/DME
 3 -45.159166667  -73.522500000      289    11490    40     11.000  PAR ENRT SC PUERTO  AGUIRRE VOR/DME
12 -45.159166667  -73.522500000      289    11490    40      0.000  PAR ENRT SC PUERTO  AGUIRRE VOR/DME
 3  -1.515972222  -78.043361111     3255    11310   130     -3.000  PAV ENRT SE PASTAZA (SHELL) VOR/DME
12  -1.515972222  -78.043361111     3255    11310   130      0.000  PAV ENRT SE PASTAZA (SHELL) VOR/DME
 3   5.616138889  -67.610388889      259    11640    40    -10.000  PAY ENRT SV PUERTO AYACUCHO VOR/DME
12   5.616138889  -67.610388889      259    11640    40      0.000  PAY ENRT SV PUERTO AYACUCHO VOR/DME
 3 -16.512027778  -68.233472222    13320    11570    40     -6.000  PAZ ENRT SL LA PAZ VOR/DME
12 -16.512027778  -68.233472222    13320    11570    40      0.000  PAZ ENRT SL LA PAZ VOR/DME
 3  10.484194444  -68.077805556       33    11770    40    -11.000  PBL ENRT SV PUERTO CABELLO VOR/DME
12  10.484194444  -68.077805556       33    11770    40      0.000  PBL ENRT SV PUERTO CABELLO VOR/DME
 3 -22.715394444  -42.857422222      127    11460    40    -22.000  PCX ENRT SB PORTO (RIO DE JANEIRO TMA VOR/DME
12 -22.715394444  -42.857422222      127    11460    40      0.000  PCX ENRT SB PORTO (RIO DE JANEIRO TMA VOR/DME
 3   3.852663889  -67.903925000      332    11490   130    -11.000  PDA ENRT SK PUERTO INIRIDA VOR/DME
12   3.852663889  -67.903925000      332    11490   130      0.000  PDA ENRT SK PUERTO INIRIDA VOR/DME
 3 -33.414722222  -70.801388889     1552    11720    40      2.000  PDH ENRT SC PUDAHUEL (SANTIAGO) VOR/DME
12 -33.414722222  -70.801388889     1552    11720    40      0.000  PDH ENRT SC PUDAHUEL (SANTIAGO) VOR/DME
 3 -35.345277778  -57.275555556       56    11410    40     -3.000  PDI ENRT SA PUNTA INDIO VOR/DME
12 -35.345277778  -57.275555556       56    11410    40      0.000  PDI ENRT SA PUNTA INDIO VOR/DME
 3 -12.608333333  -69.227222222      850    11610    40     -5.000  PDO ENRT SP PUERTO MALDONADO VOR/DME
12 -12.608333333  -69.227222222      850    11610    40      0.000  PDO ENRT SP PUERTO MALDONADO VOR/DME
 3   4.781666667  -75.836111111     3854    11600   130     -6.000  PEI ENRT SK PEREIRA VOR/DME
12   4.781666667  -75.836111111     3854    11600   130      0.000  PEI ENRT SK PEREIRA VOR/DME
 3 -28.244925000  -52.333713889        0    11270    40    -15.000  PFD ENRT SB PASSO FUNDO VOR
 3   6.883888889  -73.091944444     5364    11680   130     -8.000  PIE ENRT SK PIEDECUESTA VOR/DME
12   6.883888889  -73.091944444     5364    11680   130      0.000  PIE ENRT SK PIEDECUESTA VOR/DME
 3 -21.984561111  -47.344502778     1968    11580   130    -20.000  PIR ENRT SB PIRASSUNUNGA VOR/DME
12 -21.984561111  -47.344502778     1968    11580   130      0.000  PIR ENRT SB PIRASSUNUNGA VOR/DME
 3  -0.178611111  -74.775555556      653    11280   130     -4.000  PLG ENRT SK PUERTO LEGUIZAMO VOR/DME
12  -0.178611111  -74.775555556      653    11280   130      0.000  PLG ENRT SK PUERTO LEGUIZAMO VOR/DME
 3 -10.288019444  -48.358530556      770    11220    40    -21.000  PMS ENRT SB PALMAS VOR/DME
12 -10.288019444  -48.358530556      770    11220    40      0.000  PMS ENRT SB PALMAS VOR/DME
 3 -10.719041667  -48.401477778      951    11300    40    -21.000  PNC ENRT SB PORTO NACIONAL VOR/DME
12 -10.719041667  -48.401477778      951    11300    40      0.000  PNC ENRT SB PORTO NACIONAL VOR/DME
 3 -51.735000000  -72.448055556      423    11590    40     15.000  PNT ENRT SC PUERTO NATALES VOR/DME
12 -51.735000000  -72.448055556      423    11590    40      0.000  PNT ENRT SC PUERTO NATALES VOR/DME
 3 -29.995925000  -51.165163889        9    11400    40    -16.000  POR ENRT SB PORTO ALEGRE VOR/DME
12 -29.995925000  -51.165163889        9    11400    40      0.000  POR ENRT SB PORTO ALEGRE VOR/DME
 3 -27.385583333  -55.969055556      436    11490    40    -12.000  POS ENRT SA POSADAS VOR/DME
12 -27.385583333  -55.969055556      436    11490    40      0.000  POS ENRT SA POSADAS VOR/DME
 3  -6.200277778  -77.860000000     8333    11510    40     -2.000  POY ENRT SP CHACHAPOYAS VOR/DME
12  -6.200277778  -77.860000000     8333    11510    40      0.000  POY ENRT SP CHACHAPOYAS VOR/DME
 3   2.448888889  -76.614166667     5739    11450   130     -5.000  PPN ENRT SK POPAYAN VOR/DME
12   2.448888889  -76.614166667     5739    11450   130      0.000  PPN ENRT SK POPAYAN VOR/DME
 3  11.781472222  -70.135000000       98    11360    40     -9.000  PRG ENRT SV PARAGUANA (PUNTO FIJO) VOR/DME
12  11.781472222  -70.135000000       98    11360    40      0.000  PRG ENRT SV PARAGUANA (PUNTO FIJO) VOR/DME
 3  -2.667280556  -56.773111111       87    11410    40    -16.000  PRI ENRT SB PARINTINS VOR/DME
12  -2.667280556  -56.773111111       87    11410    40      0.000  PRI ENRT SB PARINTINS VOR/DME
 3 -22.172688889  -51.425680556     1477    11350    40    -15.000  PRR ENRT SB PRUDENTE (PRESIDENTE-) VOR/DME
12 -22.172688889  -51.425680556     1477    11350    40      0.000  PRR ENRT SB PRUDENTE (PRESIDENTE-) VOR/DME
 3   1.398055556  -77.289722222     5894    11340   130     -3.000  PSO ENRT SK PASTO VOR/DME
12   1.398055556  -77.289722222     5894    11340   130      0.000  PSO ENRT SK PASTO VOR/DME
 3 -34.975833333  -57.898333333        0    11370    40     -5.000  PTA ENRT SA LA PLATA VOR
 3   6.181388889  -67.495555556      180    11290   130    -11.000  PTC ENRT SK PUERTO CARRENO VOR/DME
12   6.181388889  -67.495555556      180    11290   130      0.000  PTC ENRT SK PUERTO CARRENO VOR/DME
 3  -9.363261111  -40.561575000     1240    11210    40    -23.000  PTL ENRT SB PETROLINA VOR/DME
12  -9.363261111  -40.561575000     1240    11210    40      0.000  PTL ENRT SB PETROLINA VOR/DME
 3 -31.718883333  -52.327447222       59    11330   130    -14.000  PTS ENRT SB PELOTAS VOR/DME
12 -31.719169444  -52.327372222       59    11330   130      0.000  PTS ENRT SB PELOTAS VOR/DME
 3 -19.523888889  -65.692222222    12779    11490   130     -9.000  PTS ENRT SL POTOSI VOR/DME
12 -19.523888889  -65.692222222    12779    11490   130      0.000  PTS ENRT SL POTOSI VOR/DME
 3  -8.375961111  -74.572319444      537    11670    40     -4.000  PUL ENRT SP PUCALLPA VOR/DME
12  -8.375961111  -74.572319444      537    11670    40      0.000  PUL ENRT SP PUCALLPA VOR/DME
 3   7.499694444  -71.825472222     1083    11420    25     -8.000  PVA ENRT SV PUERTO VIVAS VOR/DME
12   7.499694444  -71.825472222     1083    11420    25      0.000  PVA ENRT SV PUERTO VIVAS VOR/DME
 3  -8.714025000  -63.903472222      297    11270   130    -10.000  PVH ENRT SB PORTO VELHO VOR/DME
12  -8.714025000  -63.903472222      297    11270   130      0.000  PVH ENRT SB PORTO VELHO VOR/DME
 3 -54.929611111  -67.621166667       88    11490   130     12.000  PWL ENRT SC PUERTO WILLIAMS VOR/DME
12 -54.929611111  -67.621166667       88    11490   130      0.000  PWL ENRT SC PUERTO WILLIAMS VOR/DME
 3  -9.769166667  -70.705000000        0    11390    40     -3.100  PZA ENRT SP PUERTO ESPERANZA VOR
 2  -9.399000000  -38.245500000        0      325    50      0.000  PAF ENRT SB PAULO AFONSO NDB
 2 -29.999722222  -51.178611111        0      330    50      0.000  PAG ENRT SB PORTO ALEGRE NDB
 2  -2.026472222  -79.808888889        0      365    50      0.000  PAL ENRT SE PALMA (GUAYAQUIL) NDB
 2   5.614138889  -67.611722222        0      375    50      0.000  PAY ENRT SV PUERTO AYACUCHO NDB
 2  12.218611111  -72.007222222        0      230    50      0.000  PBL ENRT SK PUERTO BOLIVAR (URIBIA) NDB
 2 -21.835775000  -46.565644444        0      415    50      0.000  PCL ENRT SB POCOS (POCOS DE CALDAS) NDB
 2  -8.966666667  -48.183333333        0      365    50      0.000  PDA ENRT SB PEDRO-AFONSO NDB
 2 -35.352777778  -57.307222222        0      325    50      0.000  PDI ENRT SA PUNTA INDIO NDB
 2 -35.841111111  -61.860833333        0      265    50      0.000  PEH ENRT SA PEHUAJO NDB
 2  -3.142822222  -59.993747222        0      410    75      0.000  PEL ENRT SB PELADA (MANAUS) NDB
 2 -23.420586111  -46.755922222        0      220    50      0.000  PER ENRT SB PERUS (SAO PAULO) NDB
 2 -28.240833333  -52.329833333        0      370    75      0.000  PFD ENRT SB PASSO FUNDO NDB
 2 -25.182919444  -50.146802778        0      275    50      0.000  PGR ENRT SB GROSSA NDB
 2   6.568888889  -66.802500000        0      310    25      0.000  PIJ ENRT SV LOS PIJIGUAOS NDB
 2 -22.641388889  -55.833611111        0      353    50      0.000  PJC ENRT SG PEDRO JUAN CABALLERO NDB
 2 -17.217111111  -46.933819444        0      300    50      0.000  PKT ENRT SB PARACATU NDB
 2   3.594722222  -76.373055556        0      274    50      0.000   PL ENRT SK PALMA (CALI) NDB
 2  -2.897500000  -41.729000000        0      365    50      0.000  PNB ENRT SB PARNAIBA NDB
 2 -22.881947222  -45.356827778        0      205    50      0.000  PND ENRT SB VIBASA (PINDAMONHANGABA) NDB
 2 -25.534666667  -48.530833333        0      340    50      0.000  PNG ENRT SB PARANAGUA NDB
 2 -22.677500000  -40.606000000        0      335    50      0.000  PNQ ENRT SB QUINZE NDB
 2 -19.546666667  -65.730277778        0      400    50      0.000  POI ENRT SL POTOSI NDB
 2 -22.870108333  -43.165119444        0      415    15      0.000   PP ENRT SB PAIOL (RIO DE JANEIRO) NDB
 2   7.803055556  -72.199777778        0      310    50      0.000  PRM ENRT SV PARAMILLO (SAN CRISTOBAL) NDB
 2 -22.182797222  -51.373866667        0      225    50      0.000  PRR ENRT SB PRUDENTE (PRESIDENTE-) NDB
 2 -21.986061111  -47.337497222        0      310    50      0.000  PSN ENRT SB PIRASSUNUNGA NDB
 2 -26.747222222  -60.486111111        0      205    50      0.000  PSP ENRT SA PRESIDENCIA ROQUE S. PENA NDB
 2 -18.978138889  -57.818333333        0      290    50      0.000  PSZ ENRT SL PUERTO SUAREZ NDB
 2 -34.966666667  -57.897777778        0      250    50      0.000  PTA ENRT SA LA PLATA NDB
 2  12.223333333  -71.971111111        0      420    50      0.000  PTE ENRT SK PORTETE (URIBIA) NDB
 2 -46.536388889  -70.986111111        0      335    50      0.000  PTM ENRT SA PERITO MORENO NDB
 2  -1.040000000  -80.472222222        0      390    50      0.000  PTN ENRT SE PORTOVIEJO NDB
 2 -22.550075000  -55.707161111        0      340    50      0.000  PTP ENRT SB PONTA PORA NDB
 2  -1.486397222  -56.397802778        0      205    50      0.000  PTT ENRT SB TROMBETAS (ORIXIMINA) NDB
 2  -1.503277778  -78.068361111        0      340    50      0.000  PTZ ENRT SE PASTAZA (SHELL) NDB
 2  -8.707788889  -63.898394444        0      385    50      0.000  PVH ENRT SB PORTO VELHO NDB
 2 -20.750000000  -63.200000000        0      430    50      0.000  PVR ENRT SL EL PORVENIR NDB
 2   4.075622222  -73.545452778        0      250    50      0.000   PY ENRT SK APIAY NDB
 2 -31.776602778  -60.477030556        0      250    25      0.000    P SAAP SA GEN URQUIZA (PARANA) NDB
 2 -34.546416667  -58.439500000        0      280    25      0.000    P SABE SA JORGE NEWBERY AEROPARQUE(BUENO NDB
 2 -27.406250000  -55.970194444        0      307    15      0.000    P SARP SA LIBERADOR GRAL D JOSE DE SAN M NDB
 2 -53.776833333  -67.720416667        0      265    25      0.000    P SAWE SA RIO GRANDE NDB
 2 -23.327833333  -51.149500000        0      305    25      0.000   PP SBLO SB GUARUJA NDB
 2 -23.643705556  -46.644269444        0      330    25      0.000   PP SBSP SB METRO (SAO PAULO) NDB
 2 -25.216111111  -57.513333333        0      320    25      0.000   PS SGAS SG SILVIO PETTIROSSI INTL(ASUNCIO NDB
 3  -0.885011111  119.894722222      300    11620    40      1.000  PAL ENRT WA PALU VOR/DME
12  -0.885011111  119.894722222      300    11620    40      0.000  PAL ENRT WA PALU VOR/DME
 3 -23.172611111  117.737038889     1416    11690    40      1.000  PBO ENRT YM PARABURDOO VOR/DME
12 -23.172611111  117.737038889     1416    11690    40      0.000  PBO ENRT YM PARABURDOO VOR/DME
 3 -20.378333333  118.623333333       47    11410    40      2.000   PD ENRT YM PORT HEDLAND VOR/DME
12 -20.378333333  118.623333333       47    11410    40      0.000   PD ENRT YM PORT HEDLAND VOR/DME
 3  -0.871105556  100.353288889        9    11640    40     -0.000  PDG ENRT WI PADANG VOR/DME
12  -0.871105556  100.353288889        9    11640    40      0.000  PDG ENRT WI PADANG VOR/DME
 3 -31.673944444  116.017388889      149    11280   130     -1.000  PEA ENRT YM PEARCE TACAN
12 -31.673944444  116.017388889      149    11280   130      0.000  PEA ENRT YM PEARCE TACAN DME
 3 -31.945000000  115.959166667       87    11370    40     -2.000   PH ENRT YM PERTH VOR/DME
12 -31.945000000  115.959444444       87    11370    40      0.000   PH ENRT YM PERTH VOR/DME
 3  -2.718472222  111.687708333       75    11740    40      1.000  PKN ENRT WA PANGKALAN BUN VOR/DME
12  -2.718472222  111.687708333       75    11740    40      0.000  PKN ENRT WA PANGKALAN BUN VOR/DME
 3  -2.166969444  106.141950000      151    11420    40      1.000  PKP ENRT WI PANGKAL PINANG VOR/DME
12  -2.166969444  106.141950000      151    11420    40      0.000  PKP ENRT WI PANGKAL PINANG VOR/DME
 3 -33.131086111  148.237280556     1073    11200    40     11.000  PKS ENRT YM PARKES VOR/DME
12 -33.131086111  148.237280556     1073    11200    40      0.000  PKS ENRT YM PARKES VOR/DME
 3   0.425588889  101.441611111      102    11210    40     -0.000  PKU ENRT WI PEKANBARU VOR/DME
12   0.425588889  101.441611111      102    11210    40      0.000  PKU ENRT WI PEKANBARU VOR/DME
 3  -2.243483333  113.949066667      100    11430    40      1.000  PKY ENRT WA PALANGKARAYA VOR/DME
12  -2.243483333  113.949066667      100    11430    40      0.000  PKY ENRT WA PALANGKARAYA VOR/DME
 3   1.373333333  103.914166667       65    11630   130     -0.000  PLA ENRT WS PAYA LEBAR (SINGAPORE) TACAN
12   1.373333333  103.914166667       65    11630   130      0.000  PLA ENRT WS PAYA LEBAR (SINGAPORE) TACAN DME
 3  -2.878588889  104.653163889       37    11550    40     -0.000  PLB ENRT WI PALEMBANG VOR/DME
12  -2.878588889  104.653163889       37    11550    40      0.000  PLB ENRT WI PALEMBANG VOR/DME
 3 -40.320247222  175.637847222      198    11340    40     22.000   PM ENRT NZ PALMERSTON NORTH VOR/DME
12 -40.320247222  175.637847222      198    11340    40      0.000   PM ENRT NZ PALMERSTON NORTH VOR/DME
 3  -3.715097222  128.087536111       33    11360    40      1.000  PMA ENRT WA AMBON VOR/DME
12  -3.715097222  128.087536111       33    11360    40      0.000  PMA ENRT WA AMBON VOR/DME
 3 -20.496802778  148.552777778       98    11370    40      8.000   PN ENRT YB PROSERPINE VOR/DME
12 -20.496802778  148.552777778       98    11370    40      0.000   PN ENRT YB PROSERPINE VOR/DME
 3  -0.079152778  109.375102778       10    11320    40      1.000  PNK ENRT WI PONTIANAK VOR/DME
12  -0.079152778  109.375102778       10    11320    40      0.000  PNK ENRT WI PONTIANAK VOR/DME
13 -40.902777778  174.981944444       38    11730    40      0.000   PP ENRT NZ PARAPARAUMU DME
 3   1.423330556  103.933261111      190    11510    40     -0.000   PU ENRT WS PAPA UNIFORM (SINGAPORE) VOR/DME
12   1.423330556  103.933261111      190    11510    40      0.000   PU ENRT WS PAPA UNIFORM (SINGAPORE) VOR/DME
 3  -9.452966667  147.215100000      525    11700    40      6.700   PY ENRT AY PORT MORESBY VOR/DME
12  -9.452966667  147.215100000      525    11700    40      0.000   PY ENRT AY PORT MORESBY VOR/DME
 2  -3.859927778  102.340691667        0      210    50      0.000   PB ENRT WI BENGKULU NDB
 2 -23.178763889  117.742538889        0      278    25      0.000  PBO ENRT YM PARABURDOO NDB
 2 -20.389183333  118.642469444        0      260    50      0.000   PD ENRT YM PORT HEDLAND NDB
 2 -31.654444444  116.018888889        0      340    50      0.000  PEA ENRT YM PEARCE NDB
 2 -34.796666667  138.631666667        0      416    25      0.000   PF ENRT YM PARAFIELD (ADELAIDE) NDB
 2  -6.755327778  108.538727778        0      276    15      0.000   PG ENRT WI CIREBON NDB
 2 -33.145255556  148.252616667        0      242    50      0.000  PKS ENRT YM PARKES NDB
 2 -34.604422222  135.873252778        0      389    50      0.000  PLC ENRT YM PORT LINCOLN NDB
 2 -31.435672222  152.866741667        0      395    50      0.000  PMQ ENRT YB PORT MACQUARIE NDB
 2   1.493619444  124.909483333        0      290    50      0.000   PN ENRT WA MANADO NDB
 2   0.495861111  101.921266667        0      262    50      0.000   PN ENRT WI PELALAWAN NDB
 2  -8.540727778  118.691650000        0      223    50      0.000   PO ENRT WA BIMA NDB
 2 -40.903000000  174.983347222        0      242    50      0.000   PP ENRT NZ PARAPARAUMU NDB
 2  -6.566666667  107.450000000        0      250    50      0.000   PW ENRT WI PURWAKARTA NDB
 2  -9.461050000  147.232550000        0      368    15      0.000   PY ENRT AY PORT MORESBY NDB
 2  -8.994163889 -158.043841667        0      400    50      0.000   PY ENRT NC PENRHYN NDB
 2  -2.706233333  111.667313889        0      238    50      0.000   PN WAGI WA PANGKALAN BUN NDB
 2 -10.766666667  123.073333333        0      410    15      0.000   PO WATR WA DAVID CONSTANTIJN SAUDALE NDB
 2   0.839025000  112.936247222        0      360    50      0.000   PB WIOP WI PANGSUMA (PUTU SIBAU) NDB
 3  47.919833333 -122.277800000      679    11060    40     20.000  PAE ENRT K1 PAINE (EVERETT) VOR/DME
12  47.920008333 -122.278283333      679    11060    40      0.000  PAE ENRT K1 PAINE (EVERETT) VOR/DME
 3  30.074008333  -85.572408333        9    13370   130     -4.000  PAM ENRT K7 TYNDALL (PANAMA CITY) TACAN
12  30.074008333  -85.572408333        9    13370   130      0.000  PAM ENRT K7 TYNDALL (PANAMA CITY) TACAN DME
 3  34.246758333  -91.926175000      210    11600    40      4.000  PBF ENRT K4 PINE BLUFF VOR/DME
12  34.246758333  -91.926175000      210    11600    40      0.000  PBF ENRT K4 PINE BLUFF VOR/DME
 3  26.680052778  -80.086505556       16    11570   130     -3.000  PBI ENRT K7 PALM BEACH VORTAC
12  26.680052778  -80.086505556       16    11570   130      0.000  PBI ENRT K7 PALM BEACH VORTAC DME
 3  30.561166667  -89.730488889       70    11220    40      5.000  PCU ENRT K7 PICAYUNE VOR/DME
12  30.561166667  -89.730488889       70    11220    40      0.000  PCU ENRT K7 PICAYUNE VOR/DME
 3  33.875630556  -84.298813889      970    11660    40     -5.000  PDK ENRT K7 PEACHTREE (ATLANTA) VOR/DME
12  33.875630556  -84.298813889      970    11660    40      0.000  PDK ENRT K7 PEACHTREE (ATLANTA) VOR/DME
 3  45.698419444 -118.938702778     1559    11470   130     20.000  PDT ENRT K1 PENDLETON VORTAC
12  45.698419444 -118.938702778     1559    11470   130      0.000  PDT ENRT K1 PENDLETON VORTAC DME
 3  33.918336111 -117.529997222     1432    11220   130     15.000  PDZ ENRT K2 PARADISE (ONTARIO) VORTAC
12  33.918336111 -117.529997222     1432    11220   130      0.000  PDZ ENRT K2 PARADISE (ONTARIO) VORTAC DME
 3  31.469313889 -103.574755556     2620    11180    40     11.000  PEQ ENRT K4 PECOS (PECOS CITY) VOR/DME
12  31.469313889 -103.574755556     2620    11180    40      0.000  PEQ ENRT K4 PECOS (PECOS CITY) VOR/DME
 3  36.746530556  -97.160155556     1054    11320   130      6.000  PER ENRT K4 PIONEER (PONCA CITY) VORTAC
12  36.746530556  -97.160155556     1054    11320   130      0.000  PER ENRT K4 PIONEER (PONCA CITY) VORTAC DME
 3  36.931044444 -111.447441667     4277    11760    40     13.000  PGA ENRT K2 PAGE VOR/DME
12  36.931044444 -111.447441667     4277    11760    40      0.000  PGA ENRT K2 PAGE VOR/DME
 3  26.916833333  -81.991333333        0    11020    25     -6.000  PGD ENRT K7 PUNTA GORDA VOR
 3  34.680455556  -94.609002778     2700    11350    40      4.000  PGO ENRT K4 RICH MOUNTAIN (PAGE) VORTAC
12  34.680455556  -94.609002778     2700    11350    40      0.000  PGO ENRT K4 RICH MOUNTAIN (PAGE) VORTAC DME
 3  35.624711111 -113.544466667     4760    11200   130     15.000  PGS ENRT K2 PEACH SPRINGS VOR/DME
12  35.624711111 -113.544466667     4760    11200   130      0.000  PGS ENRT K2 PEACH SPRINGS VOR/DME
 3  32.610338889 -116.979080556      580    10980    40     14.000  PGY ENRT K2 POGGI (SAN DIEGO) VORTAC
12  32.610338889 -116.979080556      580    10980    40      0.000  PGY ENRT K2 POGGI (SAN DIEGO) VORTAC DME
 3  26.782741667  -80.691433333       16    11540   130     -0.000  PHK ENRT K7 PAHOKEE VOR/DME
12  26.782741667  -80.691433333       16    11540   130      0.000  PHK ENRT K7 PAHOKEE VOR/DME
 3  44.058238889 -101.664194444     2340    10840    40     12.000  PHP ENRT K3 PHILIP VOR/DME
12  44.058238889 -101.664194444     2340    10840    40      0.000  PHP ENRT K3 PHILIP VOR/DME
 3  40.680072222  -89.792752778      731    11520    40      4.000  PIA ENRT K5 PEORIA VORTAC
12  40.680072222  -89.792752778      731    11520    40      0.000  PIA ENRT K5 PEORIA VORTAC DME
 3  27.907763889  -82.684308333        7    11640   130     -5.000  PIE ENRT K7 SAINT PETERSBURG VORTAC
12  27.907763889  -82.684308333        7    11640   130      0.000  PIE ENRT K7 SAINT PETERSBURG VORTAC DME
 3  42.870383333 -112.652236111     4433    11260   130     17.000  PIH ENRT K1 POCATELLO VOR/DME
12  42.870383333 -112.652236111     4433    11260   130      0.000  PIH ENRT K1 POCATELLO VOR/DME
 3  32.529202778 -105.305241667     6580    11040    40     12.000  PIO ENRT K2 PINON VOR/DME
12  32.529202778 -105.305241667     6580    11040    40      0.000  PIO ENRT K2 PINON VOR/DME
 3  44.394508333 -100.162872222     1789    11250    40     11.000  PIR ENRT K3 PIERRE VORTAC
12  44.394508333 -100.162872222     1789    11250    40      0.000  PIR ENRT K3 PIERRE VORTAC DME
 3  46.898150000  -95.070891667     1441    11060    40      4.000  PKD ENRT K3 PARK RAPIDS VOR/DME
12  46.898086111  -95.071011111     1441    11060    40      0.000  PKD ENRT K3 PARK RAPIDS VOR/DME
 3  34.101972222 -114.682066667     1000    11790   130     15.000  PKE ENRT K2 PARKER VORTAC
12  34.101972222 -114.682066667     1000    11790   130      0.000  PKE ENRT K2 PARKER VORTAC DME
 3  41.965641667  -89.524219444      840    11120    40      3.000  PLL ENRT K5 POLO VORTAC
12  41.965641667  -89.524219444      840    11120    40      0.000  PLL ENRT K5 POLO VORTAC DME
 3  45.630647222  -84.664108333      835    11180    40     -6.000  PLN ENRT K5 PELLSTON VORTAC
12  45.630647222  -84.664108333      835    11180    40      0.000  PLN ENRT K5 PELLSTON VORTAC DME
 3  34.631397222 -118.063822222     2498    11450   130     15.000  PMD ENRT K2 PALMDALE VORTAC
12  34.631397222 -118.063822222     2498    11450   130      0.000  PMD ENRT K2 PALMDALE VORTAC DME
 3  42.466036111  -86.104811111      640    11210   130     -0.000  PMM ENRT K5 PULLMAN VOR/DME
12  42.466036111  -86.104811111      640    11210   130      0.000  PMM ENRT K5 PULLMAN VOR/DME
 3  40.082069444  -75.009550000        0    11200    25    -10.000  PNE ENRT K6 NORTH PHILADELPHIA VOR
 3  35.235063889 -101.699033333     3595    11660   130      8.000  PNH ENRT K4 PANHANDLE VORTAC
12  35.235063889 -101.699033333     3595    11660   130      0.000  PNH ENRT K4 PANHANDLE VORTAC DME
13  45.329200000  -67.704191667      398    11430    40      0.000  PNN ENRT K6 PRINCETON DME
 3  40.821200000  -88.733508333      679    10960    40      3.000  PNT ENRT K5 PONTIAC VOR/DME
12  40.821200000  -88.733508333      679    10960    40      0.000  PNT ENRT K5 PONTIAC VOR/DME
 3  35.168422222  -79.019572222      205    11380    40     -7.000  POB ENRT K7 POPE (FAYETTEVILLE) TACAN
12  35.168422222  -79.019572222      205    11380    40      0.000  POB ENRT K7 POPE (FAYETTEVILLE) TACAN DME
 3  34.078386111 -117.787072222     1266    11040    40     15.000  POM ENRT K2 POMONA VORTAC
12  34.078386111 -117.787072222     1266    11040    40      0.000  POM ENRT K2 POMONA VORTAC DME
 3  39.466672222  -76.170941667       67    10840    25     -9.000  PPM ENRT K6 PHILLIPS (ABERDEEN) VOR/DME
12  39.466672222  -76.170941667       67    10840    25      0.000  PPM ENRT K6 PHILLIPS (ABERDEEN) VOR/DME
 3  46.774186111  -68.094547222      592    11640   130    -21.000  PQI ENRT K6 PRESQUE ISLE VOR/DME
12  46.774186111  -68.094547222      592    11640   130      0.000  PQI ENRT K6 PRESQUE ISLE VOR/DME
 3  35.672463889 -120.627108333      817    11430    40     16.000  PRB ENRT K2 PASO ROBLES VORTAC
12  35.672463889 -120.627108333      817    11430    40      0.000  PRB ENRT K2 PASO ROBLES VORTAC DME
 3  33.542377778  -95.448291667      510    11360    40      7.000  PRX ENRT K4 PARIS VOR/DME
12  33.542377778  -95.448291667      510    11360    40      0.000  PRX ENRT K4 PARIS VOR/DME
 3  40.916258333  -77.992716667     2443    11550   130    -10.000  PSB ENRT K6 PHILIPSBURG VORTAC
12  40.916258333  -77.992716667     2443    11550   130      0.000  PSB ENRT K6 PHILIPSBURG VORTAC DME
 3  46.270266667 -119.117297222      406    10980    40     15.000  PSC ENRT K1 PASCO VOR/DME
12  46.270266667 -119.117297222      406    10980    40      0.000  PSC ENRT K1 PASCO VOR/DME
 3  42.700858333  -83.532772222     1149    11100    40     -3.000  PSI ENRT K5 PONTIAC VORTAC
12  42.700858333  -83.532772222     1149    11100    40      0.000  PSI ENRT K5 PONTIAC VORTAC DME
 3  37.087705556  -80.712900000     2120    11680   130     -6.000  PSK ENRT K6 PULASKI (DUBLIN) VORTAC
12  37.087705556  -80.712900000     2120    11680   130      0.000  PSK ENRT K6 PULASKI (DUBLIN) VORTAC DME
 3  43.084461111  -70.831986111       99    11650    40    -16.000  PSM ENRT K6 PEASE (PORTSMOUTH) VOR/DME
12  43.084461111  -70.831986111       99    11650    40      0.000  PSM ENRT K6 PEASE (PORTSMOUTH) VOR/DME
 3  33.870013889 -116.429783333     1600    11550    40     13.000  PSP ENRT K2 PALM SPRINGS VORTAC
12  33.870013889 -116.429783333     1600    11550    40      0.000  PSP ENRT K2 PALM SPRINGS VORTAC DME
 3  28.764425000  -96.306180556        6    11730   130      8.000  PSX ENRT K4 PALACIOS VORTAC
12  28.764825000  -96.305600000        6    11730   130      0.000  PSX ENRT K4 PALACIOS VORTAC DME
 3  40.222236111  -75.560258333      285    11650    40     -9.000  PTW ENRT K6 POTTSTOWN VORTAC
12  40.222236111  -75.560258333      285    11650    40      0.000  PTW ENRT K6 POTTSTOWN VORTAC DME
 3  38.294255556 -104.429447222     4759    11670   130      8.000  PUB ENRT K2 PUEBLO VORTAC
12  38.294255556 -104.429447222     4759    11670   130      0.000  PUB ENRT K2 PUEBLO VORTAC DME
 3  39.603191667 -110.753527778     5830    11550   130     14.000  PUC ENRT K2 CARBON (PRICE) VOR/DME
12  39.603191667 -110.753527778     5830    11550   130      0.000  PUC ENRT K2 CARBON (PRICE) VOR/DME
 3  41.955461111  -71.844094444      652    11740   130    -14.000  PUT ENRT K6 PUTNAM VOR/DME
12  41.955461111  -71.844094444      652    11740   130      0.000  PUT ENRT K6 PUTNAM VOR/DME
 3  46.674238889 -117.223502778     2772    10900    40     20.000  PUW ENRT K1 PULLMAN (PULLMAN/MOSCOW) VOR/DME
12  46.674238889 -117.223502778     2772    10900    40      0.000  PUW ENRT K1 PULLMAN (PULLMAN/MOSCOW) VOR/DME
 3  41.724344444  -71.429638889       49    11560   130    -14.000  PVD ENRT K6 PROVIDENCE VOR/DME
12  41.724344444  -71.429638889       49    11560   130      0.000  PVD ENRT K6 PROVIDENCE VOR/DME
 3  40.214936111 -111.721319444     4493    10840    25     15.000  PVU ENRT K2 PROVO VOR/DME
12  40.214936111 -111.721319444     4493    10840    25      0.000  PVU ENRT K2 PROVO VOR/DME
 3  34.086191667 -101.790186111     3400    11290    40     11.000  PVW ENRT K4 PLAINVIEW VOR/DME
12  34.086191667 -101.790186111     3400    11290    40      0.000  PVW ENRT K4 PLAINVIEW VOR/DME
 3  35.532944444  -97.647177778     1271    11340    25      8.000  PWA ENRT K4 WILEY POST (OKLAHOMA CITY VOR/DME
12  35.532944444  -97.647177778     1271    11340    25      0.000  PWA ENRT K4 WILEY POST (OKLAHOMA CITY VOR/DME
 3  40.200352778  -96.206280556     1360    11240   130      5.000  PWE ENRT K3 PAWNEE CITY VORTAC
12  40.200352778  -96.206280556     1360    11240   130      0.000  PWE ENRT K3 PAWNEE CITY VORTAC DME
 3  41.769772222  -73.600552778     1250    11430    40    -12.000  PWL ENRT K6 PAWLING (POUGHKEEPSIE) VOR/DME
12  41.769772222  -73.600552778     1250    11430    40      0.000  PWL ENRT K6 PAWLING (POUGHKEEPSIE) VOR/DME
 3  36.715458333 -120.778683333     2060    11260    40     16.000  PXN ENRT K2 PANOCHE VORTAC
12  36.715458333 -120.778683333     2060    11260    40      0.000  PXN ENRT K2 PANOCHE VORTAC DME
 3  33.433019444 -111.970200000     1182    11560   130     12.000  PXR ENRT K2 PHOENIX VORTAC
12  33.433019444 -111.970200000     1182    11560   130      0.000  PXR ENRT K2 PHOENIX VORTAC DME
 3  38.287855556  -76.400230556       18    11760    40    -10.000  PXT ENRT K6 PATUXENT (PATUXENT RIVER) VORTAC
12  38.287855556  -76.400230556       18    11760    40      0.000  PXT ENRT K6 PATUXENT (PATUXENT RIVER) VORTAC DME
 3  37.928319444  -87.762377778      384    11330   130      3.000  PXV ENRT K5 POCKET CITY (EVANSVILLE) VORTAC
12  37.928319444  -87.762377778      384    11330   130      0.000  PXV ENRT K5 POCKET CITY (EVANSVILLE) VORTAC DME
 3  38.079755556 -122.867827778     1340    11370   130     17.000  PYE ENRT K2 POINT REYES VOR/DME
12  38.079755556 -122.867827778     1340    11370   130      0.000  PYE ENRT K2 POINT REYES VOR/DME
 3  31.655205556  -84.293100000      283    11610   130     -2.000  PZD ENRT K7 PECAN (ALBANY) VOR/DME
12  31.655300000  -84.292472222      283    11610   130      0.000  PZD ENRT K7 PECAN (ALBANY) VOR/DME
 2  48.052777778 -122.288750000        0      396    25      0.000   PA ENRT K1 RITTS (EVERETT) NDB
 2  34.259725000 -118.413416667        0      370    25      0.000  PAI ENRT K2 PACOIMA NDB
 2  35.608208333  -87.091408333        0      365    25      0.000  PBC ENRT K7 MAURY CO. (COLUMBIA) NDB
 2  41.518577778  -82.868716667        0      423    25      0.000  PCW ENRT K5 PORT CLINTON NDB
 2  44.334347222  -89.019683333        0      382    25      0.000  PCZ ENRT K5 WAUPACA NDB
 2  41.404530556  -92.944644444        0      257    25      0.000  PEA ENRT K3 PELLA NDB
 2  42.253108333  -73.723413889        0      272    25      0.000  PFH ENRT K6 PHILMONT (HUDSON) NDB
 2  34.608858333  -98.403788889        0      425    25      0.000  PFL ENRT K4 POST (FT SILL) NDB
 2  30.326644444  -85.782288889        0      278    25      0.000  PFN ENRT K7 LYNNE (PANAMA CITY) NDB
 2  29.145238889 -100.427577778        0      356    25      0.000  PFO ENRT K4 SPOFFORD NDB
 2  48.994358333  -95.980902778        0      342    25      0.000  PFT ENRT K3 PINEY PINECREEK NDB
 2  39.705588889  -99.287955556        0      368    25      0.000  PHG ENRT K3 PHILLIPSBURG NDB
 2  32.842869444  -84.872675000        0      272    25      0.000  PIM ENRT K7 PINE MOUNTAIN NDB
 2  41.277072222  -76.710125000        0      344    25      0.000  PIX ENRT K6 PICTURE ROCKS NDB
 2  37.132813889  -76.493205556        0      375    25      0.000  PJS ENRT K6 HENRY (NEWPORT NEWS) NDB
 2  45.953194444  -90.426366667        0      371    75      0.000  PKF ENRT K5 PARK FALLS NDB
 2  30.437066667  -87.178375000        0      326    50      0.000  PKZ ENRT K7 PICKENS (PENSACOLA) NDB
 2  41.496563889  -97.381780556        0      407    50      0.000  PLT ENRT K3 PLATTE CENTER (COLUMBUS) NDB
 2  39.014113889  -87.641608333        0      391    25      0.000  PLX ENRT K5 PALESTINE (ROBINSON) NDB
 2  40.943788889  -95.912469444        0      329    25      0.000  PMV ENRT K3 PLATTSMOUTH NDB
 2  42.792752778 -109.806038889        0      392    25      0.000  PNA ENRT K1 WENZ (PINEDALE) NDB
 2  45.630266667 -123.045813889        0      356    50      0.000  PND ENRT K1 BANKS (PORTLAND) NDB
 2  45.564655556  -93.607597222        0      368    25      0.000  PNM ENRT K3 PRINCETON NDB
 2  35.226830556  -78.954358333        0      338    50      0.000  POB ENRT K7 POPE (FAYETTEVILLE) NDB
 2  42.746386111  -94.649236111        0      428    25      0.000  POH ENRT K3 POCAHONTAS NDB
 2  44.866822222 -108.786313889        0      344    25      0.000  POY ENRT K1 POWELL NDB
 2  35.612730556 -100.991930556        0      368    25      0.000  PPA ENRT K4 PAMPA NDB
 2  44.873352778  -92.942005556        0      400    25      0.000  PPI ENRT K3 HOPEY (ST PAUL) NDB
 2  32.809366667  -96.529119444        0      248    25      0.000  PQF ENRT K4 MESQUITE NDB
 2  31.780658333  -95.700752778        0      375    25      0.000  PSN ENRT K4 PALESTINE NDB
 2  37.130277778  -77.574480556        0      284    25      0.000  PTB ENRT K6 PETERSBURG NDB
 2  44.723388889  -74.882694444        0      400    25      0.000  PTD ENRT K6 POTSDAM NDB
 2  37.726291667  -98.747075000        0      356    50      0.000  PTT ENRT K3 PRATT NDB
 2  43.351527778  -94.737783333        0      345    25      0.000  PUF ENRT K3 PUFF (ESTHERVILLE) NDB
 2  39.041955556  -93.195830556        0      371    25      0.000  PUR ENRT K3 MARSHALL NDB
 2  42.068816667  -70.223444444        0      389    25      0.000  PVC ENRT K6 PROVINCETOWN NDB
 2  46.727025000  -94.385000000        0      330    25      0.000  PWC ENRT K3 PINE RIVER NDB
 2  48.788633333 -104.530625000        0      251    25      0.000  PWD ENRT K1 PLENTYWOOD NDB
 2  39.076697222  -84.215402778        0      245    25      0.000  PWF ENRT K5 SPORTYS (BATAVIA) NDB
 2  42.643950000  -77.056180556        0      260    25      0.000  PYA ENRT K6 PENN YAN NDB
 2  34.745052778  -80.338791667        0      270    25      0.000  PYG ENRT K7 PAGELAND NDB
 2  36.412344444 -100.747744444        0      266    25      0.000  PYX ENRT K4 PERRYTON NDB
 2  44.676533333  -89.647938889        0      351    25      0.000   PH KCWA K5 BAYYE (MOSINEE) NDB
 2  38.753152778  -94.736850000        0      420    25      0.000   PK KOJC K3 HERBB (OLATHE) NDB
 2  33.451458333  -79.527238889        0      255    25      0.000  PHH KPHH K7 ANDREWS NDB
 2  42.842919444  -82.596694444        0      332    25      0.000   PH KPHN K5 PHURN (PORT HURON) NDB
 2  40.605677778  -89.593127778        0      356    25      0.000   PI KPIA K5 TUNGG (PEORIA) NDB
 2  27.995111111  -82.703861111        0      360    25      0.000   PI KPIE K7 CAPOK(ST PETERSBURG-CLEARWATER NDB
 2  42.963741667 -112.516380556        0      383    25      0.000   PI KPIH K1 TYHEE (POCATELLO) NDB
 2  39.254222222  -81.484777778        0      388    25      0.000   PK KPKB K6 VERSI (PARKERSBURG) NDB
 2  46.834038889  -94.975563889        0      269    25      0.000   PK KPKD K3 SPIDA (PARK RAPIDS) NDB
 2  36.825027778  -97.100527778        0      515    25      0.000   PN KPNC K4 PONCA (PONCA CITY) NDB
 2  46.610436111  -68.018880556        0      278    25      0.000   PQ KPQI K6 EXCAL (PRESQUE ISLE) NDB
 9  61.248019444 -149.850219444      192        0     0     80.021 IEDF PAED PA 06 IM
 8  61.246950000 -149.863872222        0        0     0     80.021 IEDF PAED PA 06 MM
 8  64.636247222 -147.075727778        0        0     0    339.213 IEAF PAEI PA 32 MM
 9  64.802127778 -147.886813889      430        0     0     38.049 ICNA PAFA PA 02L IM
 9  61.167966667 -150.047686111      127        0     0     89.913 IANC PANC PA 07R IM
 8  15.111555556  145.710583333       86        0     0     67.680 IGSN PGSN PG 07 MM
 7  13.444916667  144.708138889      305        0     0     64.821 IGUM PGUM PG 06L OM
 7  21.324916667 -158.048861111        0        0     0     90.007 IHNL PHNL PH 08L OM
13  56.954283333 -158.647566667       56    10950    25      0.000  PDN ENRT PA PORT HEIDEN DME-ILS
13  51.610177778    8.618652778      803    10850    25      0.000  PAD ENRT ED PADERBORN/LIPPSTADT DME-ILS
13  62.011944444  -49.671794444      238    10895    25      0.000   PA BGPT BG PAAMIUT DME-ILS
13  26.224277778  119.999888889       70    10970    25      0.000  PKN ENRT RC MATSU DME-ILS
99
