{
    "pluginid": "a01c132a-c2d4-48ad-8b65-44c1e7c8fe14",
    "name": "Add User to Project",
    "icon": "fa fa-plus",
    "component": "views/components/plugins/add-user-to-project-workflow",
    "componentname": "add-user-to-project-workflow",
    "config": {
        "show": true
    },
    "slug": "add-user-to-project-workflow",
    "sortorder": 0
}
