{
"type": "FeatureCollection",
"name": "10",
"crs": { "type": "name", "properties": { "name": "urn:ogc:def:crs:OGC:1.3:CRS84" } },
"features": [
{ "type": "Feature", "properties": { "Name": "AH587005", "Shape_Area": 283.56939308467003, "Bage": 5.0, "FTArea": 1000.0, "Storey": 14.0, "DayOccp": 15.0, "NtOccp": 150.0, "Slope": "Flat", "Const_Type": "RCFrame", "POccp": "Residential", "New_BAge": 15, "elevation": 1387.7597937501432, "centroid_x": 85.313186506485508, "centroid_y": 27.640840187637075 }, "geometry": { "type": "Polygon", "coordinates": [ [ [ 85.313096390642372, 27.640797093182847, 0.0 ], [ 85.313102295073776, 27.640916362697386, 0.0 ], [ 85.313318112892517, 27.640903633051561, 0.0 ], [ 85.313319343176516, 27.640786756070732, 0.0 ], [ 85.313096390642372, 27.640797093182847, 0.0 ] ] ] } },
{ "type": "Feature", "properties": { "Name": "AH587010", "Shape_Area": 450.17796547479003, "Bage": 5.0, "FTArea": 800.0, "Storey": 14.0, "DayOccp": 24.0, "NtOccp": 225.0, "Slope": "Flat", "Const_Type": "RCFrame", "POccp": "Residential", "New_BAge": 15, "elevation": 1393.0482623939763, "centroid_x": 85.313144867834382, "centroid_y": 27.641505139128384 }, "geometry": { "type": "Polygon", "coordinates": [ [ [ 85.313234960096352, 27.64143292281317, 0.0 ], [ 85.31301176024779, 27.641433440754014, 0.0 ], [ 85.31300421844459, 27.641616534567305, 0.0 ], [ 85.313238440286867, 27.641609874694264, 0.0 ], [ 85.313234960096352, 27.64143292281317, 0.0 ] ] ] } },
{ "type": "Feature", "properties": { "Name": "AH587010", "Shape_Area": 450.17964445911002, "Bage": 5.0, "FTArea": 800.0, "Storey": 14.0, "DayOccp": 24.0, "NtOccp": 225.0, "Slope": "Flat", "Const_Type": "RCFrame", "POccp": "Residential", "New_BAge": 15, "elevation": 1387.071280605157, "centroid_x": 85.313231468034346, "centroid_y": 27.641023592094264 }, "geometry": { "type": "Polygon", "coordinates": [ [ [ 85.313323546329016, 27.640953925750175, 0.0 ], [ 85.313100419431947, 27.640948196137419, 0.0 ], [ 85.313087755798492, 27.641131007120812, 0.0 ], [ 85.313322072283242, 27.641130905712707, 0.0 ], [ 85.313323546329016, 27.640953925750175, 0.0 ] ] ] } },
{ "type": "Feature", "properties": { "Name": "AH587010", "Shape_Area": 450.18087444151001, "Bage": 5.0, "FTArea": 800.0, "Storey": 14.0, "DayOccp": 24.0, "NtOccp": 225.0, "Slope": "Flat", "Const_Type": "RCFrame", "POccp": "Residential", "New_BAge": 15, "elevation": 1389.0200323394624, "centroid_x": 85.313167737831606, "centroid_y": 27.64066312012551 }, "geometry": { "type": "Polygon", "coordinates": [ [ [ 85.313087040536942, 27.640745701954526, 0.0 ], [ 85.313308539474207, 27.640718194474669, 0.0 ], [ 85.313293882923617, 27.640535532467709, 0.0 ], [ 85.313062185686263, 27.640570469776122, 0.0 ], [ 85.313087040536942, 27.640745701954526, 0.0 ] ] ] } },
{ "type": "Feature", "properties": { "Name": "AH587010", "Shape_Area": 450.19054362209999, "Bage": 5.0, "FTArea": 800.0, "Storey": 14.0, "DayOccp": 24.0, "NtOccp": 225.0, "Slope": "Flat", "Const_Type": "RCFrame", "POccp": "Residential", "New_BAge": 15, "elevation": 1391.7095922455107, "centroid_x": 85.313092186814188, "centroid_y": 27.640304854717236 }, "geometry": { "type": "Polygon", "coordinates": [ [ [ 85.313132741805646, 27.640196747804811, 0.0 ], [ 85.312941131289662, 27.640311219857377, 0.0 ], [ 85.313028185638743, 27.640472470480834, 0.0 ], [ 85.313226133531188, 27.640347087638357, 0.0 ], [ 85.313132741805646, 27.640196747804811, 0.0 ] ] ] } },
{ "type": "Feature", "properties": { "Name": "AH587010", "Shape_Area": 450.18067084872001, "Bage": 5.0, "FTArea": 800.0, "Storey": 14.0, "DayOccp": 24.0, "NtOccp": 225.0, "Slope": "Flat", "Const_Type": "RCFrame", "POccp": "Residential", "New_BAge": 15, "elevation": 1391.8266320557066, "centroid_x": 85.312956311443926, "centroid_y": 27.640086019576454 }, "geometry": { "type": "Polygon", "coordinates": [ [ [ 85.312996866435398, 27.639977912664026, 0.0 ], [ 85.312805255919415, 27.640092384716592, 0.0 ], [ 85.312892310268495, 27.640253635340049, 0.0 ], [ 85.31309025816094, 27.640128252497572, 0.0 ], [ 85.312996866435398, 27.639977912664026, 0.0 ] ] ] } },
{ "type": "Feature", "properties": { "Name": "AH587010", "Shape_Area": 450.18882655664999, "Bage": 5.0, "FTArea": 800.0, "Storey": 14.0, "DayOccp": 24.0, "NtOccp": 225.0, "Slope": "Flat", "Const_Type": "RCFrame", "POccp": "Residential", "New_BAge": 15, "elevation": 1386.9207837270583, "centroid_x": 85.312798835090817, "centroid_y": 27.639879331862993 }, "geometry": { "type": "Polygon", "coordinates": [ [ [ 85.312839390082289, 27.639771224950564, 0.0 ], [ 85.312647779566305, 27.63988569700313, 0.0 ], [ 85.312734833915385, 27.640046947626587, 0.0 ], [ 85.312932781807831, 27.63992156478411, 0.0 ], [ 85.312839390082289, 27.639771224950564, 0.0 ] ] ] } },
{ "type": "Feature", "properties": { "Name": "AH587010", "Shape_Area": 450.19408255229001, "Bage": 5.0, "FTArea": 800.0, "Storey": 14.0, "DayOccp": 24.0, "NtOccp": 225.0, "Slope": "Flat", "Const_Type": "RCFrame", "POccp": "Residential", "New_BAge": 15, "elevation": 1379.589582001196, "centroid_x": 85.312552778289074, "centroid_y": 27.639712013237805 }, "geometry": { "type": "Polygon", "coordinates": [ [ [ 85.312593333280546, 27.63960390632538, 0.0 ], [ 85.312401722764562, 27.639718378377946, 0.0 ], [ 85.312488777113643, 27.639879629001403, 0.0 ], [ 85.312686725006088, 27.639754246158926, 0.0 ], [ 85.312593333280546, 27.63960390632538, 0.0 ] ] ] } },
{ "type": "Feature", "properties": { "Name": "AH587010", "Shape_Area": 450.20854984290003, "Bage": 5.0, "FTArea": 800.0, "Storey": 14.0, "DayOccp": 24.0, "NtOccp": 225.0, "Slope": "Flat", "Const_Type": "RCFrame", "POccp": "Residential", "New_BAge": 15, "elevation": 1376.14502319091, "centroid_x": 85.312287457427388, "centroid_y": 27.639559563289453 }, "geometry": { "type": "Polygon", "coordinates": [ [ [ 85.312328012418845, 27.639451456377028, 0.0 ], [ 85.312136401902862, 27.639565928429594, 0.0 ], [ 85.312223456251942, 27.63972717905305, 0.0 ], [ 85.312421404144388, 27.639601796210574, 0.0 ], [ 85.312328012418845, 27.639451456377028, 0.0 ] ] ] } },
{ "type": "Feature", "properties": { "Name": "AH587010", "Shape_Area": 450.18653450482998, "Bage": 5.0, "FTArea": 800.0, "Storey": 14.0, "DayOccp": 24.0, "NtOccp": 225.0, "Slope": "Flat", "Const_Type": "RCFrame", "POccp": "Residential", "New_BAge": 15, "elevation": 1373.2048805408699, "centroid_x": 85.311977005372995, "centroid_y": 27.639421666211746 }, "geometry": { "type": "Polygon", "coordinates": [ [ [ 85.312017560364467, 27.639313559299321, 0.0 ], [ 85.311825949848483, 27.639428031351887, 0.0 ], [ 85.311913004197564, 27.639589281975343, 0.0 ], [ 85.312110952090009, 27.639463899132867, 0.0 ], [ 85.312017560364467, 27.639313559299321, 0.0 ] ] ] } },
{ "type": "Feature", "properties": { "Name": "AH587010", "Shape_Area": 450.18940564599001, "Bage": 5.0, "FTArea": 800.0, "Storey": 14.0, "DayOccp": 24.0, "NtOccp": 225.0, "Slope": "Flat", "Const_Type": "RCFrame", "POccp": "Residential", "New_BAge": 15, "elevation": 1368.7772584134186, "centroid_x": 85.311617762442452, "centroid_y": 27.639342928035195 }, "geometry": { "type": "Polygon", "coordinates": [ [ [ 85.311658317433924, 27.639234821122766, 0.0 ], [ 85.31146670691794, 27.639349293175332, 0.0 ], [ 85.311553761267021, 27.639510543798789, 0.0 ], [ 85.311751709159466, 27.639385160956312, 0.0 ], [ 85.311658317433924, 27.639234821122766, 0.0 ] ] ] } },
{ "type": "Feature", "properties": { "Name": "AH587010", "Shape_Area": 450.18557436022002, "Bage": 5.0, "FTArea": 800.0, "Storey": 14.0, "DayOccp": 24.0, "NtOccp": 225.0, "Slope": "Flat", "Const_Type": "RCFrame", "POccp": "Residential", "New_BAge": 15, "elevation": 1376.2831537176176, "centroid_x": 85.311893346060415, "centroid_y": 27.639205136226213 }, "geometry": { "type": "Polygon", "coordinates": [ [ [ 85.311933901051873, 27.639097029313788, 0.0 ], [ 85.311742290535889, 27.639211501366354, 0.0 ], [ 85.31182934488497, 27.639372751989811, 0.0 ], [ 85.312027292777415, 27.639247369147334, 0.0 ], [ 85.311933901051873, 27.639097029313788, 0.0 ] ] ] } },
{ "type": "Feature", "properties": { "Name": "AH587010", "Shape_Area": 450.18216290482002, "Bage": 5.0, "FTArea": 800.0, "Storey": 14.0, "DayOccp": 24.0, "NtOccp": 225.0, "Slope": "Flat", "Const_Type": "RCFrame", "POccp": "Residential", "New_BAge": 15, "elevation": 1381.8545088630706, "centroid_x": 85.312216769457322, "centroid_y": 27.639251268048866 }, "geometry": { "type": "Polygon", "coordinates": [ [ [ 85.312257324448794, 27.639143161136442, 0.0 ], [ 85.31206571393281, 27.639257633189008, 0.0 ], [ 85.312152768281891, 27.639418883812464, 0.0 ], [ 85.312350716174336, 27.639293500969988, 0.0 ], [ 85.312257324448794, 27.639143161136442, 0.0 ] ] ] } },
{ "type": "Feature", "properties": { "Name": "AH587010", "Shape_Area": 450.19998550546001, "Bage": 5.0, "FTArea": 800.0, "Storey": 14.0, "DayOccp": 24.0, "NtOccp": 225.0, "Slope": "Flat", "Const_Type": "RCFrame", "POccp": "Residential", "New_BAge": 15, "elevation": 1382.5016439697897, "centroid_x": 85.312526599611843, "centroid_y": 27.639429739981694 }, "geometry": { "type": "Polygon", "coordinates": [ [ [ 85.312567154603315, 27.639321633069269, 0.0 ], [ 85.312375544087331, 27.639436105121835, 0.0 ], [ 85.312462598436412, 27.639597355745291, 0.0 ], [ 85.312660546328857, 27.639471972902815, 0.0 ], [ 85.312567154603315, 27.639321633069269, 0.0 ] ] ] } },
{ "type": "Feature", "properties": { "Name": "AH587010", "Shape_Area": 450.16823392188002, "Bage": 5.0, "FTArea": 800.0, "Storey": 14.0, "DayOccp": 24.0, "NtOccp": 225.0, "Slope": "Flat", "Const_Type": "RCFrame", "POccp": "Residential", "New_BAge": 15, "elevation": 1385.7323450286949, "centroid_x": 85.312801203956369, "centroid_y": 27.639571945086523 }, "geometry": { "type": "Polygon", "coordinates": [ [ [ 85.31284175894784, 27.639463838174095, 0.0 ], [ 85.312650148431857, 27.639578310226661, 0.0 ], [ 85.312737202780937, 27.639739560850117, 0.0 ], [ 85.312935150673383, 27.639614178007641, 0.0 ], [ 85.31284175894784, 27.639463838174095, 0.0 ] ] ] } },
{ "type": "Feature", "properties": { "Name": "AH587010", "Shape_Area": 450.18544104115, "Bage": 5.0, "FTArea": 800.0, "Storey": 14.0, "DayOccp": 24.0, "NtOccp": 225.0, "Slope": "Flat", "Const_Type": "RCFrame", "POccp": "Residential", "New_BAge": 15, "elevation": 1390.1312392114462, "centroid_x": 85.313054734164623, "centroid_y": 27.639761224598157 }, "geometry": { "type": "Polygon", "coordinates": [ [ [ 85.313095289156095, 27.639653117685729, 0.0 ], [ 85.312903678640112, 27.639767589738295, 0.0 ], [ 85.312990732989192, 27.639928840361751, 0.0 ], [ 85.313188680881638, 27.639803457519275, 0.0 ], [ 85.313095289156095, 27.639653117685729, 0.0 ] ] ] } },
{ "type": "Feature", "properties": { "Name": "AH587010", "Shape_Area": 450.18349451681001, "Bage": 5.0, "FTArea": 800.0, "Storey": 14.0, "DayOccp": 24.0, "NtOccp": 225.0, "Slope": "Flat", "Const_Type": "RCFrame", "POccp": "Residential", "New_BAge": 15, "elevation": 1394.2791436777538, "centroid_x": 85.313207289381708, "centroid_y": 27.639987596855757 }, "geometry": { "type": "Polygon", "coordinates": [ [ [ 85.31324784437318, 27.639879489943333, 0.0 ], [ 85.313056233857196, 27.639993961995899, 0.0 ], [ 85.313143288206277, 27.640155212619355, 0.0 ], [ 85.313341236098722, 27.640029829776879, 0.0 ], [ 85.31324784437318, 27.639879489943333, 0.0 ] ] ] } },
{ "type": "Feature", "properties": { "Name": "AH587010", "Shape_Area": 450.18650043168998, "Bage": 5.0, "FTArea": 800.0, "Storey": 14.0, "DayOccp": 24.0, "NtOccp": 225.0, "Slope": "Flat", "Const_Type": "RCFrame", "POccp": "Residential", "New_BAge": 15, "elevation": 1398.4149070377907, "centroid_x": 85.31334508119069, "centroid_y": 27.640218890249393 }, "geometry": { "type": "Polygon", "coordinates": [ [ [ 85.313385636182147, 27.640110783336969, 0.0 ], [ 85.313194025666164, 27.640225255389534, 0.0 ], [ 85.313281080015244, 27.640386506012991, 0.0 ], [ 85.31347902790769, 27.640261123170514, 0.0 ], [ 85.313385636182147, 27.640110783336969, 0.0 ] ] ] } },
{ "type": "Feature", "properties": { "Name": "AH587010", "Shape_Area": 450.17867888255, "Bage": 5.0, "FTArea": 800.0, "Storey": 14.0, "DayOccp": 24.0, "NtOccp": 225.0, "Slope": "Flat", "Const_Type": "RCFrame", "POccp": "Residential", "New_BAge": 15, "elevation": 1396.470558843446, "centroid_x": 85.313133888163549, "centroid_y": 27.641328098113661 }, "geometry": { "type": "Polygon", "coordinates": [ [ [ 85.313042493241042, 27.641398658584109, 0.0 ], [ 85.313265665383426, 27.64140221323234, 0.0 ], [ 85.313276546659537, 27.641219287506729, 0.0 ], [ 85.313042242292653, 27.641221672661015, 0.0 ], [ 85.313042493241042, 27.641398658584109, 0.0 ] ] ] } },
{ "type": "Feature", "properties": { "Name": "AH587010", "Shape_Area": 450.17847339263, "Bage": 5.0, "FTArea": 800.0, "Storey": 14.0, "DayOccp": 24.0, "NtOccp": 225.0, "Slope": "Flat", "Const_Type": "RCFrame", "POccp": "Residential", "New_BAge": 15, "elevation": 1398.3386957319062, "centroid_x": 85.313488700336961, "centroid_y": 27.641287034015637 }, "geometry": { "type": "Polygon", "coordinates": [ [ [ 85.313581205960901, 27.641217936104027, 0.0 ], [ 85.313358118584588, 27.641210832359192, 0.0 ], [ 85.31334432925668, 27.641393561879788, 0.0 ], [ 85.313578641921765, 27.641394903631138, 0.0 ], [ 85.313581205960901, 27.641217936104027, 0.0 ] ] ] } },
{ "type": "Feature", "properties": { "Name": "AH587005", "Shape_Area": 283.57010429086, "Bage": 5.0, "FTArea": 1000.0, "Storey": 14.0, "DayOccp": 15.0, "NtOccp": 150.0, "Slope": "Flat", "Const_Type": "RCFrame", "POccp": "Residential", "New_BAge": 15, "elevation": 1393.9694875078981, "centroid_x": 85.31348915635165, "centroid_y": 27.64083280593302 }, "geometry": { "type": "Polygon", "coordinates": [ [ [ 85.313399040508514, 27.640789711478792, 0.0 ], [ 85.313404944939919, 27.640908980993331, 0.0 ], [ 85.31362076275866, 27.640896251347506, 0.0 ], [ 85.313621993042659, 27.640779374366677, 0.0 ], [ 85.313399040508514, 27.640789711478792, 0.0 ] ] ] } },
{ "type": "Feature", "properties": { "Name": "AH587010", "Shape_Area": 450.17817606702999, "Bage": 5.0, "FTArea": 800.0, "Storey": 14.0, "DayOccp": 24.0, "NtOccp": 225.0, "Slope": "Flat", "Const_Type": "RCFrame", "POccp": "Residential", "New_BAge": 15, "elevation": 1395.9899303989414, "centroid_x": 85.313447424751459, "centroid_y": 27.641497622201815 }, "geometry": { "type": "Polygon", "coordinates": [ [ [ 85.313537134083532, 27.641424930747107, 0.0 ], [ 85.313313940089643, 27.641426628317902, 0.0 ], [ 85.313307366063881, 27.641609759433351, 0.0 ], [ 85.313541549436735, 27.641601861763622, 0.0 ], [ 85.313537134083532, 27.641424930747107, 0.0 ] ] ] } },
{ "type": "Feature", "properties": { "Name": "AH587010", "Shape_Area": 450.17900655533998, "Bage": 5.0, "FTArea": 800.0, "Storey": 14.0, "DayOccp": 24.0, "NtOccp": 225.0, "Slope": "Flat", "Const_Type": "RCFrame", "POccp": "Residential", "New_BAge": 15, "elevation": 1394.0392562471568, "centroid_x": 85.313534117900488, "centroid_y": 27.641016210390198 }, "geometry": { "type": "Polygon", "coordinates": [ [ [ 85.313626196195159, 27.64094654404612, 0.0 ], [ 85.31340306929809, 27.640940814433364, 0.0 ], [ 85.313390405664634, 27.641123625416757, 0.0 ], [ 85.313624722149385, 27.641123524008652, 0.0 ], [ 85.313626196195159, 27.64094654404612, 0.0 ] ] ] } },
{ "type": "Feature", "properties": { "Name": "AH587010", "Shape_Area": 450.18191388403, "Bage": 5.0, "FTArea": 800.0, "Storey": 14.0, "DayOccp": 24.0, "NtOccp": 225.0, "Slope": "Flat", "Const_Type": "RCFrame", "POccp": "Residential", "New_BAge": 15, "elevation": 1394.5716944457456, "centroid_x": 85.313470387697734, "centroid_y": 27.640655738421458 }, "geometry": { "type": "Polygon", "coordinates": [ [ [ 85.313389690403085, 27.64073832025047, 0.0 ], [ 85.313611189340349, 27.640710812770614, 0.0 ], [ 85.313596532789759, 27.640528150763654, 0.0 ], [ 85.313364835552406, 27.640563088072067, 0.0 ], [ 85.313389690403085, 27.64073832025047, 0.0 ] ] ] } },
{ "type": "Feature", "properties": { "Name": "AH587005", "Shape_Area": 283.57349411898002, "Bage": 5.0, "FTArea": 1000.0, "Storey": 14.0, "DayOccp": 15.0, "NtOccp": 150.0, "Slope": "Flat", "Const_Type": "RCFrame", "POccp": "Residential", "New_BAge": 15, "elevation": 1372.9253631098841, "centroid_x": 85.310994032282622, "centroid_y": 27.640617621361475 }, "geometry": { "type": "Polygon", "coordinates": [ [ [ 85.310913214878042, 27.640676328637742, 0.0 ], [ 85.311020896145592, 27.640727950571321, 0.0 ], [ 85.311112507268305, 27.640532127240323, 0.0 ], [ 85.311010328243128, 27.640475371720239, 0.0 ], [ 85.310913214878042, 27.640676328637742, 0.0 ] ] ] } },
{ "type": "Feature", "properties": { "Name": "AH587010", "Shape_Area": 450.18022833858998, "Bage": 5.0, "FTArea": 800.0, "Storey": 14.0, "DayOccp": 24.0, "NtOccp": 225.0, "Slope": "Flat", "Const_Type": "RCFrame", "POccp": "Residential", "New_BAge": 15, "elevation": 1386.6906093634743, "centroid_x": 85.311558862085249, "centroid_y": 27.640970978910037 }, "geometry": { "type": "Polygon", "coordinates": [ [ [ 85.311538280296546, 27.640857364642354, 0.0 ], [ 85.311432415535805, 27.641053861698541, 0.0 ], [ 85.311589809804389, 27.641147708741546, 0.0 ], [ 85.311695524492976, 27.640938594825403, 0.0 ], [ 85.311538280296546, 27.640857364642354, 0.0 ] ] ] } },
{ "type": "Feature", "properties": { "Name": "AH587010", "Shape_Area": 450.17181596118002, "Bage": 5.0, "FTArea": 800.0, "Storey": 14.0, "DayOccp": 24.0, "NtOccp": 225.0, "Slope": "Flat", "Const_Type": "RCFrame", "POccp": "Residential", "New_BAge": 15, "elevation": 1376.7709439310736, "centroid_x": 85.311176709404364, "centroid_y": 27.640665452365852 }, "geometry": { "type": "Polygon", "coordinates": [ [ [ 85.311159315736191, 27.640551306528632, 0.0 ], [ 85.311047992511675, 27.640744763449778, 0.0 ], [ 85.311202698340722, 27.640842979180309, 0.0 ], [ 85.311314224697057, 27.640636906141918, 0.0 ], [ 85.311159315736191, 27.640551306528632, 0.0 ] ] ] } },
{ "type": "Feature", "properties": { "Name": "AH587010", "Shape_Area": 450.17774591102, "Bage": 5.0, "FTArea": 800.0, "Storey": 14.0, "DayOccp": 24.0, "NtOccp": 225.0, "Slope": "Flat", "Const_Type": "RCFrame", "POccp": "Residential", "New_BAge": 15, "elevation": 1373.9033294814776, "centroid_x": 85.310829403831789, "centroid_y": 27.640549778607994 }, "geometry": { "type": "Polygon", "coordinates": [ [ [ 85.310863574832467, 27.640660069834123, 0.0 ], [ 85.310944898593988, 27.640452211982524, 0.0 ], [ 85.310777309916645, 27.640378088717004, 0.0 ], [ 85.310697660983422, 27.640598452672197, 0.0 ], [ 85.310863574832467, 27.640660069834123, 0.0 ] ] ] } },
{ "type": "Feature", "properties": { "Name": "AH587010", "Shape_Area": 450.19452603361998, "Bage": 5.0, "FTArea": 800.0, "Storey": 14.0, "DayOccp": 24.0, "NtOccp": 225.0, "Slope": "Flat", "Const_Type": "RCFrame", "POccp": "Residential", "New_BAge": 15, "elevation": 1351.2368264380202, "centroid_x": 85.310581092069157, "centroid_y": 27.640484732215732 }, "geometry": { "type": "Polygon", "coordinates": [ [ [ 85.310624392200239, 27.640591769174275, 0.0 ], [ 85.310687997595792, 27.640377823400048, 0.0 ], [ 85.310514782999931, 27.64031801598377, 0.0 ], [ 85.310453895349553, 27.640544283346291, 0.0 ], [ 85.310624392200239, 27.640591769174275, 0.0 ] ] ] } },
{ "type": "Feature", "properties": { "Name": "AH587010", "Shape_Area": 450.22270185001997, "Bage": 5.0, "FTArea": 800.0, "Storey": 14.0, "DayOccp": 24.0, "NtOccp": 225.0, "Slope": "Flat", "Const_Type": "RCFrame", "POccp": "Residential", "New_BAge": 15, "elevation": 1365.8303920339181, "centroid_x": 85.310680563612351, "centroid_y": 27.64015091098517 }, "geometry": { "type": "Polygon", "coordinates": [ [ [ 85.310647000242511, 27.64004043333108, 0.0 ], [ 85.310564533531164, 27.64024784037575, 0.0 ], [ 85.310731711647776, 27.640322885033029, 0.0 ], [ 85.310812572397765, 27.640102962854918, 0.0 ], [ 85.310647000242511, 27.64004043333108, 0.0 ] ] ] } },
{ "type": "Feature", "properties": { "Name": "AH587010", "Shape_Area": 450.19526201170999, "Bage": 5.0, "FTArea": 800.0, "Storey": 14.0, "DayOccp": 24.0, "NtOccp": 225.0, "Slope": "Flat", "Const_Type": "RCFrame", "POccp": "Residential", "New_BAge": 15, "elevation": 1385.2175929074133, "centroid_x": 85.311397967176276, "centroid_y": 27.640896300249558 }, "geometry": { "type": "Polygon", "coordinates": [ [ [ 85.311416472533566, 27.641010271138828, 0.0 ], [ 85.311525904954678, 27.640815738401546, 0.0 ], [ 85.311370249220317, 27.640719035166757, 0.0 ], [ 85.311260736639241, 27.640926185401828, 0.0 ], [ 85.311416472533566, 27.641010271138828, 0.0 ] ] ] } },
{ "type": "Feature", "properties": { "Name": "AH587010", "Shape_Area": 450.20573307587, "Bage": 5.0, "FTArea": 800.0, "Storey": 14.0, "DayOccp": 24.0, "NtOccp": 225.0, "Slope": "Flat", "Const_Type": "RCFrame", "POccp": "Residential", "New_BAge": 15, "elevation": 1383.9761222457296, "centroid_x": 85.311530874280649, "centroid_y": 27.640564767988433 }, "geometry": { "type": "Polygon", "coordinates": [ [ [ 85.311514183967716, 27.640450517188423, 0.0 ], [ 85.311401671351561, 27.64064328479947, 0.0 ], [ 85.311555769334674, 27.640742451501875, 0.0 ], [ 85.311668562781577, 27.640537069263967, 0.0 ], [ 85.311514183967716, 27.640450517188423, 0.0 ] ] ] } },
{ "type": "Feature", "properties": { "Name": "AH587005", "Shape_Area": 283.56929097648998, "Bage": 5.0, "FTArea": 1000.0, "Storey": 14.0, "DayOccp": 15.0, "NtOccp": 150.0, "Slope": "Flat", "Const_Type": "RCFrame", "POccp": "Residential", "New_BAge": 15, "elevation": 1374.8114189477685, "centroid_x": 85.311131707652308, "centroid_y": 27.640347997691116 }, "geometry": { "type": "Polygon", "coordinates": [ [ [ 85.311050890247728, 27.640406704967386, 0.0 ], [ 85.311158571515278, 27.640458326900966, 0.0 ], [ 85.311250182637991, 27.640262503569968, 0.0 ], [ 85.3111480036128, 27.640205748049897, 0.0 ], [ 85.311050890247728, 27.640406704967386, 0.0 ] ] ] } },
{ "type": "Feature", "properties": { "Name": "AH587010", "Shape_Area": 450.15852497254002, "Bage": 5.0, "FTArea": 800.0, "Storey": 14.0, "DayOccp": 24.0, "NtOccp": 225.0, "Slope": "Flat", "Const_Type": "RCFrame", "POccp": "Residential", "New_BAge": 15, "elevation": 1385.5970356631699, "centroid_x": 85.311696374283571, "centroid_y": 27.640701372553345 }, "geometry": { "type": "Polygon", "coordinates": [ [ [ 85.311675192317679, 27.640587868649586, 0.0 ], [ 85.311570367545301, 27.640784922469006, 0.0 ], [ 85.311728255608202, 27.64087793635429, 0.0 ], [ 85.311832863628965, 27.640668266644258, 0.0 ], [ 85.311675192317679, 27.640587868649586, 0.0 ] ] ] } },
{ "type": "Feature", "properties": { "Name": "AH587010", "Shape_Area": 450.19056833838999, "Bage": 5.0, "FTArea": 800.0, "Storey": 14.0, "DayOccp": 24.0, "NtOccp": 225.0, "Slope": "Flat", "Const_Type": "RCFrame", "POccp": "Residential", "New_BAge": 15, "elevation": 1380.3855794006288, "centroid_x": 85.311314384774036, "centroid_y": 27.640395828695496 }, "geometry": { "type": "Polygon", "coordinates": [ [ [ 85.311296991105863, 27.640281682858276, 0.0 ], [ 85.311185667881347, 27.640475139779422, 0.0 ], [ 85.311340373710394, 27.640573355509947, 0.0 ], [ 85.311451900066729, 27.640367282471562, 0.0 ], [ 85.311296991105863, 27.640281682858276, 0.0 ] ] ] } },
{ "type": "Feature", "properties": { "Name": "AH587010", "Shape_Area": 450.17901377920998, "Bage": 5.0, "FTArea": 800.0, "Storey": 14.0, "DayOccp": 24.0, "NtOccp": 225.0, "Slope": "Flat", "Const_Type": "RCFrame", "POccp": "Residential", "New_BAge": 15, "elevation": 1373.1244179582441, "centroid_x": 85.310967079201475, "centroid_y": 27.640280154937649 }, "geometry": { "type": "Polygon", "coordinates": [ [ [ 85.311001250202153, 27.640390446163767, 0.0 ], [ 85.31108257396366, 27.640182588312175, 0.0 ], [ 85.310914985286331, 27.640108465046655, 0.0 ], [ 85.310835336353094, 27.640328829001856, 0.0 ], [ 85.311001250202153, 27.640390446163767, 0.0 ] ] ] } },
{ "type": "Feature", "properties": { "Name": "AH587010", "Shape_Area": 450.17908730771001, "Bage": 5.0, "FTArea": 800.0, "Storey": 14.0, "DayOccp": 24.0, "NtOccp": 225.0, "Slope": "Flat", "Const_Type": "RCFrame", "POccp": "Residential", "New_BAge": 15, "elevation": 1359.8661767602296, "centroid_x": 85.311312224118936, "centroid_y": 27.639146458507668 }, "geometry": { "type": "Polygon", "coordinates": [ [ [ 85.311352779110393, 27.639038351595239, 0.0 ], [ 85.31116116859441, 27.639152823647805, 0.0 ], [ 85.31124822294349, 27.639314074271262, 0.0 ], [ 85.311446170835936, 27.639188691428785, 0.0 ], [ 85.311352779110393, 27.639038351595239, 0.0 ] ] ] } },
{ "type": "Feature", "properties": { "Name": "AH587010", "Shape_Area": 450.19650795311998, "Bage": 5.0, "FTArea": 800.0, "Storey": 14.0, "DayOccp": 24.0, "NtOccp": 225.0, "Slope": "Flat", "Const_Type": "RCFrame", "POccp": "Residential", "New_BAge": 15, "elevation": 1358.91737055974, "centroid_x": 85.311154747765812, "centroid_y": 27.638939770794206 }, "geometry": { "type": "Polygon", "coordinates": [ [ [ 85.311195302757284, 27.638831663881778, 0.0 ], [ 85.3110036922413, 27.638946135934344, 0.0 ], [ 85.311090746590381, 27.6391073865578, 0.0 ], [ 85.311288694482826, 27.638982003715324, 0.0 ], [ 85.311195302757284, 27.638831663881778, 0.0 ] ] ] } },
{ "type": "Feature", "properties": { "Name": "AH587010", "Shape_Area": 450.19375462612999, "Bage": 5.0, "FTArea": 800.0, "Storey": 14.0, "DayOccp": 24.0, "NtOccp": 225.0, "Slope": "Flat", "Const_Type": "RCFrame", "POccp": "Residential", "New_BAge": 15, "elevation": 1357.3294028328564, "centroid_x": 85.310908690964069, "centroid_y": 27.638772452169018 }, "geometry": { "type": "Polygon", "coordinates": [ [ [ 85.310949245955541, 27.638664345256593, 0.0 ], [ 85.310757635439558, 27.638778817309159, 0.0 ], [ 85.310844689788638, 27.638940067932616, 0.0 ], [ 85.311042637681084, 27.638814685090139, 0.0 ], [ 85.310949245955541, 27.638664345256593, 0.0 ] ] ] } },
{ "type": "Feature", "properties": { "Name": "AH587010", "Shape_Area": 450.18588993037002, "Bage": 5.0, "FTArea": 800.0, "Storey": 14.0, "DayOccp": 24.0, "NtOccp": 225.0, "Slope": "Flat", "Const_Type": "RCFrame", "POccp": "Residential", "New_BAge": 15, "elevation": 1350.3883585040562, "centroid_x": 85.310643370102369, "centroid_y": 27.638620002220669 }, "geometry": { "type": "Polygon", "coordinates": [ [ [ 85.310683925093841, 27.638511895308241, 0.0 ], [ 85.310492314577857, 27.638626367360807, 0.0 ], [ 85.310579368926938, 27.638787617984264, 0.0 ], [ 85.310777316819383, 27.638662235141787, 0.0 ], [ 85.310683925093841, 27.638511895308241, 0.0 ] ] ] } },
{ "type": "Feature", "properties": { "Name": "AH587010", "Shape_Area": 450.20409816844, "Bage": 5.0, "FTArea": 800.0, "Storey": 14.0, "DayOccp": 24.0, "NtOccp": 225.0, "Slope": "Flat", "Const_Type": "RCFrame", "POccp": "Residential", "New_BAge": 15, "elevation": 1348.641491552303, "centroid_x": 85.31033291804799, "centroid_y": 27.638482105142963 }, "geometry": { "type": "Polygon", "coordinates": [ [ [ 85.310373473039462, 27.638373998230534, 0.0 ], [ 85.310181862523478, 27.6384884702831, 0.0 ], [ 85.310268916872559, 27.638649720906557, 0.0 ], [ 85.310466864765004, 27.63852433806408, 0.0 ], [ 85.310373473039462, 27.638373998230534, 0.0 ] ] ] } },
{ "type": "Feature", "properties": { "Name": "AH587010", "Shape_Area": 450.18425980191, "Bage": 5.0, "FTArea": 800.0, "Storey": 14.0, "DayOccp": 24.0, "NtOccp": 225.0, "Slope": "Flat", "Const_Type": "RCFrame", "POccp": "Residential", "New_BAge": 15, "elevation": 1346.5117857754706, "centroid_x": 85.310174265556554, "centroid_y": 27.640041041964093 }, "geometry": { "type": "Polygon", "coordinates": [ [ [ 85.310114841238644, 27.639942044174788, 0.0 ], [ 85.310085292968438, 27.640163280113057, 0.0 ], [ 85.310265702774458, 27.640195413042491, 0.0 ], [ 85.310290649562575, 27.639962428315364, 0.0 ], [ 85.310114841238644, 27.639942044174788, 0.0 ] ] ] } },
{ "type": "Feature", "properties": { "Name": "AH587010", "Shape_Area": 450.18406417657002, "Bage": 5.0, "FTArea": 800.0, "Storey": 14.0, "DayOccp": 24.0, "NtOccp": 225.0, "Slope": "Flat", "Const_Type": "RCFrame", "POccp": "Residential", "New_BAge": 15, "elevation": 1347.9573408147294, "centroid_x": 85.3102377853684, "centroid_y": 27.639739548769136 }, "geometry": { "type": "Polygon", "coordinates": [ [ [ 85.31017836105049, 27.639640550979834, 0.0 ], [ 85.310148812780284, 27.639861786918104, 0.0 ], [ 85.31032922258629, 27.63989391984753, 0.0 ], [ 85.310354169374406, 27.639660935120403, 0.0 ], [ 85.31017836105049, 27.639640550979834, 0.0 ] ] ] } },
{ "type": "Feature", "properties": { "Name": "AH587010", "Shape_Area": 450.18223291647001, "Bage": 5.0, "FTArea": 800.0, "Storey": 14.0, "DayOccp": 24.0, "NtOccp": 225.0, "Slope": "Flat", "Const_Type": "RCFrame", "POccp": "Residential", "New_BAge": 15, "elevation": 1346.4869652640123, "centroid_x": 85.310572682132332, "centroid_y": 27.638311706980083 }, "geometry": { "type": "Polygon", "coordinates": [ [ [ 85.310613237123789, 27.638203600067655, 0.0 ], [ 85.310421626607805, 27.638318072120221, 0.0 ], [ 85.310508680956886, 27.638479322743677, 0.0 ], [ 85.310706628849331, 27.638353939901201, 0.0 ], [ 85.310613237123789, 27.638203600067655, 0.0 ] ] ] } },
{ "type": "Feature", "properties": { "Name": "AH587010", "Shape_Area": 450.19965757929998, "Bage": 5.0, "FTArea": 800.0, "Storey": 14.0, "DayOccp": 24.0, "NtOccp": 225.0, "Slope": "Flat", "Const_Type": "RCFrame", "POccp": "Residential", "New_BAge": 15, "elevation": 1348.326469154053, "centroid_x": 85.310882512286838, "centroid_y": 27.63849017891291 }, "geometry": { "type": "Polygon", "coordinates": [ [ [ 85.31092306727831, 27.638382072000482, 0.0 ], [ 85.310731456762326, 27.638496544053048, 0.0 ], [ 85.310818511111407, 27.638657794676504, 0.0 ], [ 85.311016459003852, 27.638532411834028, 0.0 ], [ 85.31092306727831, 27.638382072000482, 0.0 ] ] ] } },
{ "type": "Feature", "properties": { "Name": "AH587010", "Shape_Area": 450.16790599573, "Bage": 5.0, "FTArea": 800.0, "Storey": 14.0, "DayOccp": 24.0, "NtOccp": 225.0, "Slope": "Flat", "Const_Type": "RCFrame", "POccp": "Residential", "New_BAge": 15, "elevation": 1357.3728717230981, "centroid_x": 85.311157116631378, "centroid_y": 27.638632384017733 }, "geometry": { "type": "Polygon", "coordinates": [ [ [ 85.311197671622836, 27.638524277105308, 0.0 ], [ 85.311006061106852, 27.638638749157874, 0.0 ], [ 85.311093115455932, 27.63879999978133, 0.0 ], [ 85.311291063348378, 27.638674616938854, 0.0 ], [ 85.311197671622836, 27.638524277105308, 0.0 ] ] ] } },
{ "type": "Feature", "properties": { "Name": "AH587010", "Shape_Area": 450.18697781931002, "Bage": 5.0, "FTArea": 800.0, "Storey": 14.0, "DayOccp": 24.0, "NtOccp": 225.0, "Slope": "Flat", "Const_Type": "RCFrame", "POccp": "Residential", "New_BAge": 15, "elevation": 1367.3433265174751, "centroid_x": 85.311410646839619, "centroid_y": 27.63882166352937 }, "geometry": { "type": "Polygon", "coordinates": [ [ [ 85.31145120183109, 27.638713556616942, 0.0 ], [ 85.311259591315107, 27.638828028669508, 0.0 ], [ 85.311346645664187, 27.638989279292964, 0.0 ], [ 85.311544593556633, 27.638863896450488, 0.0 ], [ 85.31145120183109, 27.638713556616942, 0.0 ] ] ] } },
{ "type": "Feature", "properties": { "Name": "AH587010", "Shape_Area": 450.18155452129997, "Bage": 5.0, "FTArea": 800.0, "Storey": 14.0, "DayOccp": 24.0, "NtOccp": 225.0, "Slope": "Flat", "Const_Type": "RCFrame", "POccp": "Residential", "New_BAge": 15, "elevation": 1366.661856062588, "centroid_x": 85.311563202056703, "centroid_y": 27.639048035786971 }, "geometry": { "type": "Polygon", "coordinates": [ [ [ 85.311603757048175, 27.638939928874546, 0.0 ], [ 85.311412146532192, 27.639054400927112, 0.0 ], [ 85.311499200881272, 27.639215651550568, 0.0 ], [ 85.311697148773717, 27.639090268708092, 0.0 ], [ 85.311603757048175, 27.638939928874546, 0.0 ] ] ] } },
{ "type": "Feature", "properties": { "Name": "AH587010", "Shape_Area": 450.18428612259999, "Bage": 5.0, "FTArea": 800.0, "Storey": 14.0, "DayOccp": 24.0, "NtOccp": 225.0, "Slope": "Flat", "Const_Type": "RCFrame", "POccp": "Residential", "New_BAge": 15, "elevation": 1360.5612069609545, "centroid_x": 85.309309928641454, "centroid_y": 27.64005608887215 }, "geometry": { "type": "Polygon", "coordinates": [ [ [ 85.309373538161324, 27.640152450902178, 0.0 ], [ 85.309393584575844, 27.639930152494792, 0.0 ], [ 85.309211964152141, 27.639905775354819, 0.0 ], [ 85.309197018156681, 27.64013961470679, 0.0 ], [ 85.309373538161324, 27.640152450902178, 0.0 ] ] ] } },
{ "type": "Feature", "properties": { "Name": "AH587010", "Shape_Area": 450.18420253987, "Bage": 5.0, "FTArea": 800.0, "Storey": 14.0, "DayOccp": 24.0, "NtOccp": 225.0, "Slope": "Flat", "Const_Type": "RCFrame", "POccp": "Residential", "New_BAge": 15, "elevation": 1354.3485877142734, "centroid_x": 85.309603992131116, "centroid_y": 27.639886021984857 }, "geometry": { "type": "Polygon", "coordinates": [ [ [ 85.309667601650986, 27.639982384014885, 0.0 ], [ 85.309687648065491, 27.63976008560752, 0.0 ], [ 85.309506027641802, 27.639735708467519, 0.0 ], [ 85.309491081646357, 27.63996954781949, 0.0 ], [ 85.309667601650986, 27.639982384014885, 0.0 ] ] ] } },
{ "type": "Feature", "properties": { "Name": "AH587010", "Shape_Area": 450.18416375193999, "Bage": 5.0, "FTArea": 800.0, "Storey": 14.0, "DayOccp": 24.0, "NtOccp": 225.0, "Slope": "Flat", "Const_Type": "RCFrame", "POccp": "Residential", "New_BAge": 15, "elevation": 1346.3381369458771, "centroid_x": 85.309918983905135, "centroid_y": 27.639885270621193 }, "geometry": { "type": "Polygon", "coordinates": [ [ [ 85.309982593424991, 27.639981632651214, 0.0 ], [ 85.31000263983951, 27.639759334243848, 0.0 ], [ 85.309821019415807, 27.639734957103855, 0.0 ], [ 85.309806073420347, 27.639968796455832, 0.0 ], [ 85.309982593424991, 27.639981632651214, 0.0 ] ] ] } },
{ "type": "Feature", "properties": { "Name": "AH587010", "Shape_Area": 450.18289649129002, "Bage": 5.0, "FTArea": 800.0, "Storey": 14.0, "DayOccp": 24.0, "NtOccp": 225.0, "Slope": "Flat", "Const_Type": "RCFrame", "POccp": "Residential", "New_BAge": 15, "elevation": 1349.2287408222717, "centroid_x": 85.309868434248898, "centroid_y": 27.640189207531357 }, "geometry": { "type": "Polygon", "coordinates": [ [ [ 85.309932043768768, 27.640285569561392, 0.0 ], [ 85.309952090183288, 27.64006327115402, 0.0 ], [ 85.309770469759584, 27.640038894014012, 0.0 ], [ 85.309755523764125, 27.640272733365983, 0.0 ], [ 85.309932043768768, 27.640285569561392, 0.0 ] ] ] } },
{ "type": "Feature", "properties": { "Name": "AH587010", "Shape_Area": 450.18308613543002, "Bage": 5.0, "FTArea": 800.0, "Storey": 14.0, "DayOccp": 24.0, "NtOccp": 225.0, "Slope": "Flat", "Const_Type": "RCFrame", "POccp": "Residential", "New_BAge": 15, "elevation": 1356.9987465599636, "centroid_x": 85.309600877105112, "centroid_y": 27.640180152307426 }, "geometry": { "type": "Polygon", "coordinates": [ [ [ 85.309664486624982, 27.640276514337451, 0.0 ], [ 85.309684533039501, 27.640054215930078, 0.0 ], [ 85.309502912615798, 27.640029838790092, 0.0 ], [ 85.309487966620338, 27.640263678142063, 0.0 ], [ 85.309664486624982, 27.640276514337451, 0.0 ] ] ] } },
{ "type": "Feature", "properties": { "Name": "AH587010", "Shape_Area": 450.18295353085, "Bage": 5.0, "FTArea": 800.0, "Storey": 14.0, "DayOccp": 24.0, "NtOccp": 225.0, "Slope": "Flat", "Const_Type": "RCFrame", "POccp": "Residential", "New_BAge": 15, "elevation": 1365.232899557519, "centroid_x": 85.309274356743884, "centroid_y": 27.640325862324751 }, "geometry": { "type": "Polygon", "coordinates": [ [ [ 85.30933796626374, 27.640422224354772, 0.0 ], [ 85.30935801267826, 27.640199925947414, 0.0 ], [ 85.309176392254543, 27.640175548807406, 0.0 ], [ 85.309161446259097, 27.640409388159398, 0.0 ], [ 85.30933796626374, 27.640422224354772, 0.0 ] ] ] } }
]
}
