{
"type": "FeatureCollection",
"name": "Road paths 3",
"crs": { "type": "name", "properties": { "name": "urn:ogc:def:crs:OGC:1.3:CRS84" } },
"features": [
{ "type": "Feature", "properties": { "id": null, "type": "Concrete", "quality": "4" }, "geometry": { "type": "MultiLineString", "coordinates": [ [ [ 85.321279284844721, 27.622302843400973 ], [ 85.321378439938329, 27.622403930474384 ], [ 85.32142406979726, 27.622507966552739 ], [ 85.321471524850537, 27.622622953797237 ], [ 85.321486126405404, 27.62275254259659 ], [ 85.321504378348976, 27.622852928286232 ], [ 85.321529931069975, 27.623017195778374 ], [ 85.321537231847401, 27.623093853941374 ], [ 85.321548183013547, 27.623188764047942 ], [ 85.3215627845684, 27.623274548182728 ], [ 85.321571910540186, 27.623351206345728 ], [ 85.321588337289398, 27.623469843978938 ], [ 85.32163579234269, 27.623520949420939 ], [ 85.321685072590327, 27.623575705251653 ], [ 85.321759905558963, 27.623630461082367 ], [ 85.32184568969376, 27.623643237442867 ], [ 85.321949725772114, 27.623659664192079 ], [ 85.322037335101257, 27.623661489386439 ], [ 85.322110342875533, 27.623666964969509 ], [ 85.322252708035393, 27.623663314580796 ], [ 85.322364044891174, 27.623661489386439 ], [ 85.32244617863725, 27.623624985499294 ], [ 85.322553408805717, 27.623586656417796 ], [ 85.32264101813486, 27.62356475408551 ], [ 85.322735928241428, 27.623522774615296 ], [ 85.322790684072146, 27.623497221894297 ], [ 85.322861866652076, 27.623453417229726 ], [ 85.322931224037646, 27.623416913342584 ], [ 85.323038910504721, 27.623347555957015 ], [ 85.323126519833863, 27.623301926098083 ], [ 85.323219604746072, 27.623239869489943 ], [ 85.323297631804863, 27.623183288464872 ], [ 85.323317708942795, 27.623128532634158 ], [ 85.32334873724686, 27.623040923305016 ], [ 85.323299456999223, 27.622949663587161 ], [ 85.323217323253147, 27.622880306201591 ], [ 85.323158917033723, 27.622840151925732 ], [ 85.323073589197506, 27.622785396095018 ], [ 85.322989630257069, 27.62275254259659 ], [ 85.322936699620712, 27.622736115847378 ], [ 85.322827187959291, 27.62269778676588 ], [ 85.32271585110351, 27.622648506518235 ], [ 85.322655619689726, 27.62262112860288 ], [ 85.322611815025155, 27.622584624715735 ], [ 85.322533787966393, 27.622520742913238 ], [ 85.322468080969529, 27.62248058863738 ], [ 85.322431577082384, 27.622445909944595 ], [ 85.322325715809669, 27.62241123125181 ], [ 85.322272785173325, 27.622376552559025 ], [ 85.322226242717264, 27.622312670756539 ], [ 85.322215291551117, 27.622192207928968 ], [ 85.322181525455463, 27.622141102486957 ], [ 85.322134070402171, 27.622108248988528 ], [ 85.322062887822256, 27.622060793935244 ], [ 85.321980754076179, 27.622058968740888 ], [ 85.321916872273675, 27.622053493157814 ], [ 85.321827437750187, 27.622080871073173 ], [ 85.321734352837964, 27.622119200154671 ], [ 85.321657694674968, 27.622142927681313 ], [ 85.32156643495712, 27.622190382734598 ], [ 85.321456923295685, 27.622225061427383 ], [ 85.321360187994756, 27.622259740120171 ], [ 85.321296306192266, 27.622287118035526 ], [ 85.321279284844721, 27.622302843400973 ] ] ] } },
{ "type": "Feature", "properties": { "id": null, "type": "Concrete", "quality": "4" }, "geometry": { "type": "MultiLineString", "coordinates": [ [ [ 85.322142888703254, 27.621311216727744 ], [ 85.322113080667123, 27.621367220079541 ], [ 85.32209300352919, 27.621436577465111 ], [ 85.322067450808191, 27.621515060822468 ], [ 85.322029121726686, 27.621593544179824 ], [ 85.321970715507263, 27.62167932831461 ], [ 85.321905008510413, 27.621761462060679 ], [ 85.321814205091144, 27.621861847750321 ], [ 85.321752148483, 27.621982310577891 ], [ 85.321728420956362, 27.622060793935248 ], [ 85.321734352837964, 27.622119200154671 ] ] ] } },
{ "type": "Feature", "properties": { "id": null, "type": "Gravel", "quality": "2" }, "geometry": { "type": "MultiLineString", "coordinates": [ [ [ 85.320708805406539, 27.622520020310652 ], [ 85.320590412274598, 27.622557246800429 ], [ 85.320462648669604, 27.622553596411716 ], [ 85.320316633121024, 27.62248058863743 ], [ 85.32025457651288, 27.622440434361575 ], [ 85.320141414462739, 27.622371076976005 ], [ 85.320020951635172, 27.622305369979149 ], [ 85.319915090362457, 27.622236012593579 ], [ 85.319853033754313, 27.622188557540291 ], [ 85.319721619760614, 27.622130151320864 ], [ 85.319637660820177, 27.622068094712724 ], [ 85.319528149158756, 27.62199873732715 ], [ 85.31932342682552, 27.621865903045595 ] ] ] } },
{ "type": "Feature", "properties": { "id": null, "type": "Gravel", "quality": "2" }, "geometry": { "type": "MultiLineString", "coordinates": [ [ [ 85.319969508251972, 27.621165177916453 ], [ 85.319940643083498, 27.621235806085874 ], [ 85.319893188030207, 27.621301513082731 ], [ 85.319867635309208, 27.621359919302158 ], [ 85.319838432199489, 27.621432927076441 ], [ 85.319823830644637, 27.621520536405583 ], [ 85.319790977146212, 27.621644649621867 ], [ 85.319747172481641, 27.621728608562297 ], [ 85.319707018205776, 27.621841770612438 ], [ 85.319674164707351, 27.621936680719006 ], [ 85.319623059265354, 27.622020639659436 ], [ 85.319637660820177, 27.622068094712724 ] ] ] } },
{ "type": "Feature", "properties": { "id": null, "type": "Gravel", "quality": "2" }, "geometry": { "type": "MultiLineString", "coordinates": [ [ [ 85.320281298791087, 27.621345180701926 ], [ 85.320199820682205, 27.621407374355442 ], [ 85.32015966640634, 27.621487682907155 ], [ 85.320119512130489, 27.621589893791153 ], [ 85.320072057077212, 27.621717657396154 ], [ 85.320013650857774, 27.621812567502722 ], [ 85.319980797359349, 27.621881924888292 ], [ 85.319955244638351, 27.621969534217435 ], [ 85.319904139196353, 27.622049842769147 ], [ 85.319853033754313, 27.622188557540291 ] ] ] } },
{ "type": "Feature", "properties": { "id": null, "type": "Gravel", "quality": "2" }, "geometry": { "type": "MultiLineString", "coordinates": [ [ [ 85.320544874298392, 27.62148661146194 ], [ 85.320458998280913, 27.621546089126586 ], [ 85.320426144782488, 27.621619096900869 ], [ 85.320407892838915, 27.621677503120296 ], [ 85.32037138895177, 27.621757811672008 ], [ 85.320360437785624, 27.621856372167294 ], [ 85.320309332343626, 27.621965883828722 ], [ 85.320261877290349, 27.62206079393529 ], [ 85.32023267418063, 27.622148403264433 ], [ 85.320192519904779, 27.622243313371005 ], [ 85.320141414462739, 27.622371076976005 ] ] ] } },
{ "type": "Feature", "properties": { "id": null, "type": "Gravel", "quality": "2" }, "geometry": { "type": "MultiLineString", "coordinates": [ [ [ 85.320462648669604, 27.622553596411716 ], [ 85.320358612591221, 27.622626604185999 ], [ 85.320318458315356, 27.622692311182853 ], [ 85.320274653650785, 27.622765318957139 ], [ 85.32024180015236, 27.622834676342709 ], [ 85.320223548208787, 27.622940537615424 ], [ 85.320187044321642, 27.623035447721993 ], [ 85.320150540434497, 27.623137658605991 ], [ 85.320117686936072, 27.623203365602848 ], [ 85.320055630327928, 27.623309226875559 ], [ 85.319986272942359, 27.623378584261133 ], [ 85.319909614779363, 27.623477144756414 ], [ 85.319884062058364, 27.623524599809702 ], [ 85.319854858948645, 27.623575705251699 ], [ 85.319829306227646, 27.623659664192129 ], [ 85.319814704672794, 27.623754574298697 ], [ 85.319800103117942, 27.623816630906841 ], [ 85.319767249619503, 27.623885988292411 ], [ 85.319745347287224, 27.623969947232837 ], [ 85.319697892233933, 27.624057556561979 ], [ 85.319672339512934, 27.624152466668551 ], [ 85.319570128628939, 27.624243726386407 ], [ 85.3195184298431, 27.624349512907049 ] ] ] } },
{ "type": "Feature", "properties": { "id": null, "type": "Gravel", "quality": "2" }, "geometry": { "type": "MultiLineString", "coordinates": [ [ [ 85.324381987247577, 27.621704784480954 ], [ 85.324428796007581, 27.621593544179881 ], [ 85.324476251060858, 27.621494983684595 ], [ 85.324505454170577, 27.621421975910309 ], [ 85.324608597897196, 27.621320671394088 ] ] ] } },
{ "type": "Feature", "properties": { "id": null, "type": "Gravel", "quality": "2" }, "geometry": { "type": "MultiLineString", "coordinates": [ [ [ 85.31933199838673, 27.624139509657333 ], [ 85.319378483221428, 27.624039304618421 ], [ 85.319411336719853, 27.623973597621564 ], [ 85.319451490995718, 27.623904240235994 ], [ 85.319480694105422, 27.623842183627854 ], [ 85.319502596437715, 27.62378742779714 ], [ 85.31953179954742, 27.623736322355139 ], [ 85.319546401102286, 27.623648713025997 ], [ 85.319575604211991, 27.623586656417856 ], [ 85.319590205766858, 27.623525512406893 ], [ 85.319607545113243, 27.623477144756428 ], [ 85.319644961597575, 27.623404136982142 ], [ 85.31967598990164, 27.623353944137321 ], [ 85.319688766262132, 27.623327478819146 ], [ 85.319736221315424, 27.623221617546431 ], [ 85.319790977146141, 27.623123057051146 ], [ 85.319845732976844, 27.623042748499433 ], [ 85.319893188030136, 27.622995293446149 ], [ 85.319918740751135, 27.622907684117006 ], [ 85.319988098136704, 27.622831025954007 ], [ 85.320002699691557, 27.622706912737723 ], [ 85.32002825241257, 27.622604701853724 ], [ 85.320061105910995, 27.622546295634297 ], [ 85.320075707465847, 27.62248058863744 ], [ 85.320141414462739, 27.622371076976005 ] ] ] } },
{ "type": "Feature", "properties": { "id": null, "type": "Gravel", "quality": "2" }, "geometry": { "type": "MultiLineString", "coordinates": [ [ [ 85.31911128068549, 27.623880219930641 ], [ 85.319150333926771, 27.623816630906859 ], [ 85.31918318742521, 27.623739972743859 ], [ 85.319208740146209, 27.623677916135716 ], [ 85.31924889442206, 27.623583006029147 ], [ 85.31931460141891, 27.62352459980972 ], [ 85.319347454917349, 27.623433340091864 ], [ 85.319387609193214, 27.623332954402223 ], [ 85.319405861136772, 27.623287324543295 ], [ 85.319442365023917, 27.623216141963365 ], [ 85.319478868911062, 27.623123057051153 ], [ 85.319526323964354, 27.623000769029225 ], [ 85.319590205766843, 27.622898558145227 ], [ 85.319624884459628, 27.62284562750887 ], [ 85.31967416470728, 27.62276896934587 ], [ 85.319727095343637, 27.622690485988514 ], [ 85.31973987170413, 27.622538994856875 ], [ 85.319772725202554, 27.622465987082588 ], [ 85.31981470467278, 27.622367426587303 ], [ 85.319838432199418, 27.622309020367876 ], [ 85.319853033754313, 27.622188557540291 ] ] ] } },
{ "type": "Feature", "properties": { "id": null, "type": "Gravel", "quality": "2" }, "geometry": { "type": "MultiLineString", "coordinates": [ [ [ 85.320328442377715, 27.623542714707874 ], [ 85.320208946653935, 27.623520949421003 ], [ 85.32010308538122, 27.623466193590289 ], [ 85.320073882271515, 27.623433340091861 ], [ 85.319986272942359, 27.623378584261133 ], [ 85.319938817889081, 27.623334779596576 ], [ 85.319876761280938, 27.623294625320717 ], [ 85.31982930622766, 27.62325082065615 ], [ 85.319736221315424, 27.623221617546431 ], [ 85.319654087569376, 27.623188764048006 ], [ 85.319581079795086, 27.623144959383435 ], [ 85.319478868911062, 27.623123057051153 ], [ 85.319446015412666, 27.623071951609152 ], [ 85.319405861136801, 27.623017195778438 ], [ 85.319321902196378, 27.622955139170294 ], [ 85.319219691312384, 27.622896732950867 ], [ 85.31917771028489, 27.622829132236902 ] ] ] } },
{ "type": "Feature", "properties": { "id": null, "type": "Dirt", "quality": "1" }, "geometry": { "type": "MultiLineString", "coordinates": [ [ [ 85.318501933631481, 27.620492951982452 ], [ 85.318419147362789, 27.620552809636401 ], [ 85.318382718227639, 27.620576381429736 ], [ 85.318309859957324, 27.620608524784284 ], [ 85.318254144809444, 27.620642811029136 ], [ 85.318198429661564, 27.620700669067325 ], [ 85.318177000758524, 27.620730669531572 ], [ 85.318136285842769, 27.620777813118242 ], [ 85.318099856707605, 27.620831385375823 ], [ 85.318061284682145, 27.620880671852795 ], [ 85.31801842687608, 27.620929958329771 ], [ 85.317977711960324, 27.620974959026139 ], [ 85.317936997044569, 27.621013531051599 ], [ 85.3178962821288, 27.621054245967358 ], [ 85.31783842409061, 27.621090675102515 ], [ 85.31772485090454, 27.621154961811612 ], [ 85.317630563731214, 27.621223534301315 ], [ 85.31757484858332, 27.621283535229807 ], [ 85.31752770499665, 27.621339250377691 ], [ 85.317459132506954, 27.621394965525575 ], [ 85.317364845333614, 27.621454966454067 ], [ 85.317287701282694, 27.621472109576491 ], [ 85.317193414109354, 27.621532110504983 ], [ 85.31708198381358, 27.621562110969226 ], [ 85.317009125543265, 27.621587825652867 ], [ 85.316884837905675, 27.621634969239537 ], [ 85.31672197824264, 27.62168211282621 ], [ 85.31660626216626, 27.621733542193486 ], [ 85.31651197499292, 27.621776399999547 ], [ 85.316443402503211, 27.621797828902579 ], [ 85.316353401110476, 27.621836400928039 ], [ 85.316250542375926, 27.621879258734104 ], [ 85.316164826763796, 27.621960688565629 ], [ 85.316074825371061, 27.622059261519578 ], [ 85.316027681784377, 27.62212783400928 ], [ 85.315963395075286, 27.622234978524443 ], [ 85.315929108830431, 27.62229926523354 ], [ 85.315881965243761, 27.622389266626275 ], [ 85.315864822121341, 27.622466410677191 ], [ 85.315843393218302, 27.622534983166897 ], [ 85.315839107437696, 27.622590698314781 ], [ 85.315804821192842, 27.622697842829943 ], [ 85.315727677141936, 27.622809273125714 ], [ 85.315659104652227, 27.622869274054207 ], [ 85.315603389504346, 27.622954989666336 ], [ 85.315539102795256, 27.623070705742713 ], [ 85.315461958744336, 27.623186421819085 ], [ 85.315440529841297, 27.62326785165061 ], [ 85.315397672035232, 27.623374996165772 ], [ 85.315371957351601, 27.623490712242145 ], [ 85.315350528448562, 27.623589285196097 ], [ 85.315333385326142, 27.623662143466404 ], [ 85.315311956423102, 27.623760716420353 ], [ 85.315316242203707, 27.623820717348845 ], [ 85.315363385790391, 27.624022149037348 ], [ 85.315401957815851, 27.624120721991297 ], [ 85.315466244524956, 27.62421500916464 ], [ 85.315530531234046, 27.62430072477677 ], [ 85.31559481794315, 27.624416440853146 ], [ 85.31563338996861, 27.624476441781635 ], [ 85.315693390897096, 27.624549300051946 ], [ 85.315757677606186, 27.624596443638616 ], [ 85.315843393218316, 27.6246521587865 ], [ 85.31591625148863, 27.62469073081196 ], [ 85.316027681784405, 27.62473787439863 ], [ 85.31610911161593, 27.624772160643484 ], [ 85.31618196988623, 27.624789303765908 ], [ 85.316280542840175, 27.624815018449549 ], [ 85.316387687355345, 27.624849304694401 ], [ 85.31651626077354, 27.624887876719857 ], [ 85.316661977314155, 27.624905019842284 ], [ 85.316756264487495, 27.624939306087136 ], [ 85.316880552125085, 27.624947877648349 ], [ 85.316949124614794, 27.624887876719857 ], [ 85.317009125543279, 27.624802161107727 ], [ 85.317081983813594, 27.624725017056811 ], [ 85.317137698961474, 27.624635015664076 ], [ 85.317206271451184, 27.624527871148914 ], [ 85.317279129721499, 27.62442501241436 ], [ 85.317317701746944, 27.624369297266473 ], [ 85.317315558856663, 27.624246081074038 ], [ 85.317287165560117, 27.624164651242499 ], [ 85.317255557928178, 27.62409607875281 ], [ 85.317182699657863, 27.623976076895829 ], [ 85.317105555606958, 27.62391607596734 ], [ 85.317024125775433, 27.623838931916421 ], [ 85.316985553749973, 27.623723215840048 ], [ 85.316959839066328, 27.623573213518821 ], [ 85.316951267505118, 27.623496069467905 ], [ 85.316989839530578, 27.623337495585464 ], [ 85.317041268897853, 27.623174635922418 ], [ 85.317092698265128, 27.623118920774534 ], [ 85.317182699657863, 27.623033205162404 ], [ 85.317298415734243, 27.622981775795125 ], [ 85.317418417591227, 27.622968918453306 ], [ 85.317512704764567, 27.623033205162404 ], [ 85.317551276790027, 27.623118920774534 ], [ 85.317568419912448, 27.62319606482545 ], [ 85.317602706157302, 27.623294637779399 ], [ 85.317628420840947, 27.623384639172137 ], [ 85.317666992866407, 27.62345321166184 ], [ 85.317731279575497, 27.623521784151542 ], [ 85.317842709871272, 27.623577499299426 ], [ 85.317949854386427, 27.623620357105491 ], [ 85.318065570462807, 27.623590356641248 ], [ 85.318177000758567, 27.623560356177002 ], [ 85.318322717299196, 27.62353892727397 ], [ 85.318481291181627, 27.623534641493361 ], [ 85.318584149916191, 27.62353892727397 ], [ 85.318699865992556, 27.62353892727397 ], [ 85.318867011436211, 27.62353892727397 ], [ 85.318969870170775, 27.623547498835183 ], [ 85.319087708892155, 27.623587179681671 ] ] ] } },
{ "type": "Feature", "properties": { "id": null, "type": "Dirt", "quality": "1" }, "geometry": { "type": "MultiLineString", "coordinates": [ [ [ 85.31672197824264, 27.62168211282621 ], [ 85.316743942868257, 27.621719613406519 ], [ 85.316773943332507, 27.621777471444709 ], [ 85.316812515357967, 27.621824615031379 ], [ 85.316836087151302, 27.62185890127623 ], [ 85.316878944957367, 27.62189747330169 ], [ 85.316915374092517, 27.62192533087563 ], [ 85.316964660569496, 27.621957474230179 ], [ 85.317020375717377, 27.621998189145941 ], [ 85.317050376181626, 27.622026046719885 ], [ 85.317108234219816, 27.622071047416252 ], [ 85.317168235148301, 27.622128905454439 ], [ 85.317213235844676, 27.622169620370201 ], [ 85.317256093650741, 27.622236049969601 ], [ 85.317281808334371, 27.622298193788396 ], [ 85.317294665676201, 27.622377480729615 ] ] ] } },
{ "type": "Feature", "properties": { "id": null, "type": "Dirt", "quality": "1" }, "geometry": { "type": "MultiLineString", "coordinates": [ [ [ 85.31752770499665, 27.621339250377691 ], [ 85.317571098525306, 27.621387465409512 ], [ 85.317596813208951, 27.621421751654363 ], [ 85.317639671015016, 27.621458180789521 ], [ 85.317693243272601, 27.621496752814977 ], [ 85.317740386859271, 27.621531039059832 ], [ 85.317785387555631, 27.621561039524074 ], [ 85.3178261024714, 27.621586754207716 ], [ 85.317868960277465, 27.621603897330139 ], [ 85.317946104328385, 27.621646755136204 ], [ 85.318023248379291, 27.621689612942269 ], [ 85.318057534624145, 27.621711041845302 ], [ 85.31810253532052, 27.621734613638637 ], [ 85.318164679139315, 27.621756042541669 ], [ 85.318228965848405, 27.621777471444702 ] ] ] } },
{ "type": "Feature", "properties": { "id": null, "type": "Dirt", "quality": "1" }, "geometry": { "type": "MultiLineString", "coordinates": [ [ [ 85.315371957351601, 27.623490712242145 ], [ 85.315282491681486, 27.623431782758807 ], [ 85.315196776069357, 27.623423211197593 ], [ 85.315128203579647, 27.62341463963638 ], [ 85.314956772355387, 27.623393210733347 ], [ 85.314819627375982, 27.623341781366069 ], [ 85.314665339274157, 27.623277494656971 ], [ 85.314605338345658, 27.62324320841212 ], [ 85.314481050708068, 27.623187493264236 ], [ 85.314382477754123, 27.62315749279999 ], [ 85.314262475897138, 27.623131778116353 ], [ 85.314138188259548, 27.623088920310288 ], [ 85.314039615305603, 27.623054634065436 ], [ 85.313932470790448, 27.623020347820585 ], [ 85.313812468933463, 27.622981775795125 ], [ 85.313722467540728, 27.622926060647242 ], [ 85.313649609270414, 27.622878917060572 ], [ 85.313538178974653, 27.622818916132079 ], [ 85.313478178046154, 27.622776058326014 ], [ 85.313396748214629, 27.622733200519949 ], [ 85.313272460577039, 27.622694628494493 ], [ 85.313212459648554, 27.622668913810852 ], [ 85.313122458255819, 27.622647484907819 ], [ 85.312951973890137, 27.622630254574702 ] ] ] } },
{ "type": "Feature", "properties": { "id": null, "type": "Dirt", "quality": "1" }, "geometry": { "type": "MultiLineString", "coordinates": [ [ [ 85.317512704764567, 27.623033205162404 ], [ 85.317590384538079, 27.622956061111491 ], [ 85.317663242808393, 27.622900345963608 ], [ 85.317778958884773, 27.622866059718756 ], [ 85.317868960277508, 27.622887488621789 ], [ 85.317937532767203, 27.62292177486664 ] ] ] } },
{ "type": "Feature", "properties": { "id": null, "type": "Dirt", "quality": "1" }, "geometry": { "type": "MultiLineString", "coordinates": [ [ [ 85.313733181992262, 27.624944663312895 ], [ 85.313529607413386, 27.624863233481371 ], [ 85.313443891801256, 27.624794660991665 ], [ 85.313358176189126, 27.624708945379535 ], [ 85.313285317918812, 27.6246189439868 ], [ 85.313255317454576, 27.624546085716489 ], [ 85.313233888551537, 27.624490370568605 ], [ 85.313195316526077, 27.624417512298297 ], [ 85.313182459184262, 27.624340368247378 ], [ 85.313173887623051, 27.624293224660708 ], [ 85.313152458720012, 27.624224652171005 ], [ 85.313161030281236, 27.624164651242513 ], [ 85.313161030281236, 27.624066078288564 ], [ 85.313182459184262, 27.623993220018253 ], [ 85.313225316990327, 27.623898932844913 ], [ 85.313242460112747, 27.623766073646109 ], [ 85.313259603235181, 27.623710358498226 ], [ 85.313276746357602, 27.623624642886096 ], [ 85.313306746821851, 27.623526069932147 ], [ 85.313328175724877, 27.623406068075166 ], [ 85.313341033066706, 27.623303209340612 ], [ 85.313323889944272, 27.623148921238776 ], [ 85.313276746357602, 27.623088920310288 ], [ 85.313165316061841, 27.62293891798906 ], [ 85.313088172010922, 27.622831773473898 ], [ 85.313023885301817, 27.622711771616917 ], [ 85.312998170618187, 27.622656056469033 ], [ 85.312951973890137, 27.622630254574702 ] ] ] } },
{ "type": "Feature", "properties": { "id": null, "type": "Dirt", "quality": "1" }, "geometry": { "type": "MultiLineString", "coordinates": [ [ [ 85.316880552125085, 27.624947877648349 ], [ 85.316911088311954, 27.625014307247746 ], [ 85.31696037478892, 27.625044307711992 ], [ 85.317039661730149, 27.625115023091997 ], [ 85.317106091329549, 27.625172881130187 ], [ 85.317161806477429, 27.62520931026534 ], [ 85.317221807405915, 27.625245739400494 ], [ 85.31729252278592, 27.62529502587747 ], [ 85.317341809262899, 27.625320740561108 ], [ 85.317384667068964, 27.625346455244749 ], [ 85.317442525107154, 27.625372169928387 ], [ 85.317489668693824, 27.625391455941116 ], [ 85.317543240951409, 27.625412884844149 ], [ 85.317601098989599, 27.625436456637484 ], [ 85.317654671247169, 27.625449313979303 ], [ 85.317727529517484, 27.625451456869605 ], [ 85.317789673336279, 27.625416099179603 ], [ 85.317820745245669, 27.625392527386268 ], [ 85.317848602819623, 27.625376455708992 ], [ 85.317889317735379, 27.625349669580203 ], [ 85.317930032651148, 27.625333597902927 ], [ 85.317964318895989, 27.625315383335348 ], [ 85.318001819476294, 27.625291811542013 ], [ 85.318056463179033, 27.625268239748678 ], [ 85.318098249539943, 27.625247882290797 ], [ 85.318142178791163, 27.62522323905231 ], [ 85.318200036829353, 27.625198595813824 ], [ 85.318238608854813, 27.625180381246246 ], [ 85.318295395447848, 27.625154666562608 ], [ 85.318341467589363, 27.625134309104727 ], [ 85.318396111292103, 27.625110737311392 ], [ 85.318478612568725, 27.625075379621386 ], [ 85.318538613497225, 27.625064665169869 ], [ 85.31860075731602, 27.625036807595929 ], [ 85.318641472231775, 27.625026093144413 ], [ 85.318718616282695, 27.624989664009259 ], [ 85.318776474320885, 27.624970377996529 ], [ 85.318840761029975, 27.624948949093497 ], [ 85.318900761958474, 27.624921091519553 ], [ 85.31896076288696, 27.624899662616521 ], [ 85.319001477802715, 27.624880376603791 ], [ 85.31906362162151, 27.624856804810456 ], [ 85.319097907866364, 27.624837518797726 ], [ 85.319136479891824, 27.624816089894697 ], [ 85.319235052845769, 27.62477966075954 ], [ 85.319277910651834, 27.624753946075902 ], [ 85.319346483141544, 27.624706802489229 ], [ 85.319391483837904, 27.624683230695894 ], [ 85.31942628556007, 27.624657017665562 ], [ 85.319465413553402, 27.624617872541645 ], [ 85.319498628353102, 27.624592157858007 ], [ 85.319533986043098, 27.624557871613156 ], [ 85.319566129397643, 27.624542871381031 ], [ 85.3195848594425, 27.624528444247368 ] ] ] } },
{ "type": "Feature", "properties": { "id": null, "type": "Dirt", "quality": "1" }, "geometry": { "type": "MultiLineString", "coordinates": [ [ [ 85.317315558856663, 27.624246081074038 ], [ 85.317383595623753, 27.624207509048563 ], [ 85.317441453661942, 27.624171079913406 ], [ 85.317490740138922, 27.624153936790982 ], [ 85.317535740835282, 27.62413250788795 ], [ 85.317615027776512, 27.624115364765522 ], [ 85.317679314485602, 27.624098221643099 ], [ 85.317767172988042, 27.624059649617639 ], [ 85.317840031258342, 27.624057506727336 ], [ 85.317902175077137, 27.624042506495215 ], [ 85.317957890225031, 27.624044649385517 ], [ 85.318020034043826, 27.624042506495215 ], [ 85.318114321217166, 27.624048935166122 ], [ 85.318210751280816, 27.624078935630369 ] ] ] } },
{ "type": "Feature", "properties": { "id": null, "type": "Concrete", "quality": "5" }, "geometry": { "type": "MultiLineString", "coordinates": [ [ [ 85.30930063268211, 27.63930422953889 ], [ 85.309416259471391, 27.63931360468397 ], [ 85.309622512663097, 27.639338605070844 ], [ 85.309938142547367, 27.639394855941305 ], [ 85.310247522334919, 27.639469857101925 ], [ 85.310553777074119, 27.639572983697775 ], [ 85.310722529685506, 27.639697985632139 ], [ 85.310869406958389, 27.639863613195175 ], [ 85.311103785585317, 27.639991740177898 ], [ 85.311269413148352, 27.640126117257338 ], [ 85.311419415469587, 27.640219868708112 ], [ 85.311641293903094, 27.640385496271147 ], [ 85.31179442127268, 27.640516748302229 ], [ 85.311869422433318, 27.640604249656292 ], [ 85.311988174270965, 27.640832378186506 ], [ 85.3120006744644, 27.641060506716723 ], [ 85.311966298932447, 27.641229259328114 ], [ 85.311963173884081, 27.641366761455917 ], [ 85.312035049996354, 27.641485513293564 ], [ 85.312166302027435, 27.641563639502539 ], [ 85.312306929203586, 27.641588639889413 ], [ 85.312463181621553, 27.64160426513121 ], [ 85.31260693384607, 27.641588639889413 ], [ 85.312800686844326, 27.641544889212387 ], [ 85.312891313246752, 27.641482388245205 ], [ 85.312950689165575, 27.641304260488734 ], [ 85.312978814600797, 27.641051131571647 ], [ 85.31298818974588, 27.640882378960253 ], [ 85.312981939649163, 27.640732376639015 ], [ 85.312913188585256, 27.640482372770286 ], [ 85.312769436360739, 27.640235493949916 ], [ 85.312641309378009, 27.640101116870472 ], [ 85.312441306283034, 27.639947989500875 ], [ 85.312153801833986, 27.639779236889485 ], [ 85.311881922626753, 27.63965423495512 ], [ 85.311616293516224, 27.639607359229732 ], [ 85.311428790614684, 27.639516732827317 ], [ 85.311266288100001, 27.63943235652162 ], [ 85.311119410827132, 27.639310479635615 ], [ 85.31101315918292, 27.639210478088131 ], [ 85.310947533167379, 27.639113601588999 ], [ 85.310797530846145, 27.639029225283302 ], [ 85.310719404637169, 27.638954224122681 ], [ 85.310513151445463, 27.638860472671908 ], [ 85.310444400381556, 27.638782346462932 ], [ 85.310219396899711, 27.638747970930982 ], [ 85.310131895545652, 27.63864171928677 ], [ 85.309891266821992, 27.638622968996618 ], [ 85.309635012856546, 27.638688595012159 ], [ 85.309485010535312, 27.638785471511291 ], [ 85.309341258310795, 27.638951099074323 ], [ 85.309281882391971, 27.639122976734075 ], [ 85.309300632682124, 27.639304229538904 ] ] ] } },
{ "type": "Feature", "properties": { "id": null, "type": "Gravel", "quality": "2" }, "geometry": { "type": "MultiLineString", "coordinates": [ [ [ 85.321713194553794, 27.624504000510093 ], [ 85.321659027048895, 27.624580043353497 ], [ 85.321588192619416, 27.624663377976404 ], [ 85.321492357803081, 27.624721712212438 ], [ 85.321404856449021, 27.624780046448471 ], [ 85.321300688170396, 27.624867547802527 ], [ 85.321234020472062, 27.624963382618869 ], [ 85.321200686622902, 27.625038383779486 ], [ 85.321134018924582, 27.625138385326974 ], [ 85.321084018150827, 27.625246720336754 ], [ 85.321038184108232, 27.62536755553997 ], [ 85.320979849872202, 27.625425889776004 ], [ 85.320900681980433, 27.625525891323491 ], [ 85.320838181013258, 27.625592559021818 ], [ 85.320779846777228, 27.625688393838161 ], [ 85.320734012734619, 27.625763394998778 ], [ 85.320663178305153, 27.625863396546265 ], [ 85.320600677337978, 27.625934230975737 ], [ 85.320509009252774, 27.626009232136354 ], [ 85.32041734116757, 27.626117567146135 ], [ 85.320354840200395, 27.626217568693622 ], [ 85.320304839426655, 27.626321736972255 ], [ 85.32026733884635, 27.626400904864017 ], [ 85.320250671921755, 27.626534240260671 ], [ 85.32022983826603, 27.626592574496705 ], [ 85.32022150480374, 27.626688409313047 ], [ 85.32019650441687, 27.626763410473664 ], [ 85.32017150403, 27.626850911827717 ], [ 85.320127753352978, 27.626918621208826 ], [ 85.320036085267773, 27.626989455638299 ], [ 85.319969417569453, 27.627056123336622 ], [ 85.319906916602278, 27.62713112449724 ], [ 85.319831915441654, 27.627201958926712 ], [ 85.319786081399059, 27.627281126818474 ], [ 85.319661079464694, 27.627364461441381 ], [ 85.319611078690954, 27.627439462601995 ], [ 85.31953607753033, 27.627606131847809 ], [ 85.319456909638575, 27.62769779993301 ], [ 85.319381908477951, 27.627764467631334 ], [ 85.319311074048485, 27.627914469952568 ], [ 85.319269406737035, 27.628076972467237 ], [ 85.319173571920686, 27.628160307090145 ], [ 85.319111070953511, 27.628301975949086 ] ] ] } },
{ "type": "Feature", "properties": { "id": null, "type": "Dirt", "quality": "3" }, "geometry": { "type": "MultiLineString", "coordinates": [ [ [ 85.325214811239931, 27.624150870045515 ], [ 85.325177310659612, 27.624225871206132 ], [ 85.325136685030955, 27.624344623043775 ], [ 85.325080434160483, 27.624463374881419 ], [ 85.325024183290026, 27.624575876622341 ], [ 85.324999182903156, 27.624641502637882 ], [ 85.324949182129416, 27.624729003991934 ], [ 85.324924181742531, 27.624782129814037 ], [ 85.324874180968791, 27.624869631168089 ], [ 85.324821055146685, 27.624975882812297 ], [ 85.32476792932458, 27.625057134069632 ], [ 85.324721053599205, 27.625166510762199 ], [ 85.324692928163969, 27.62522276163266 ], [ 85.324664802728734, 27.625300887841636 ], [ 85.324642927390229, 27.625366513857173 ], [ 85.324596051664841, 27.625450890162867 ], [ 85.324567926229605, 27.62554464161364 ], [ 85.324527300600948, 27.62560401753246 ], [ 85.324474174778842, 27.625691518886512 ], [ 85.324414798860019, 27.625775895192206 ] ] ] } },
{ "type": "Feature", "properties": { "id": null, "type": "Concrete", "quality": "4" }, "geometry": { "type": "MultiLineString", "coordinates": [ [ [ 85.321279284844721, 27.622302843400973 ], [ 85.321215686855112, 27.622287403708928 ], [ 85.321090059911072, 27.622259278273695 ], [ 85.321000058518337, 27.622246153070588 ], [ 85.320876306603324, 27.622214277577324 ], [ 85.320698178846854, 27.622165526822926 ], [ 85.320715054107993, 27.622101775836398 ], [ 85.320739429485187, 27.622028649704799 ], [ 85.320765679891409, 27.621951773515164 ], [ 85.320797555384672, 27.621886147499623 ], [ 85.320820055732852, 27.621818646455068 ], [ 85.320842556081047, 27.621747395352482 ], [ 85.320889431806421, 27.621644268756633 ], [ 85.320940057589837, 27.621582392799123 ], [ 85.320973808112115, 27.621503641580478 ], [ 85.32100943366342, 27.621430515448875 ], [ 85.321041309156683, 27.621372389549396 ], [ 85.321071309620919, 27.621314263649918 ], [ 85.32110693517221, 27.621273013011578 ], [ 85.321159435984654, 27.621199886879978 ], [ 85.321200686622987, 27.62112113566133 ], [ 85.321273812754583, 27.621042384442681 ], [ 85.321309438305875, 27.620989883630244 ], [ 85.321345063857194, 27.620931757730766 ], [ 85.321378814379472, 27.620883006976367 ], [ 85.321328188596055, 27.62086050662818 ], [ 85.32127006269657, 27.620817380960826 ], [ 85.321202561652015, 27.620761130090361 ], [ 85.321148185810571, 27.620712379335963 ], [ 85.321067559562906, 27.620643003262391 ], [ 85.321000058518351, 27.62059800256602 ], [ 85.320910057125616, 27.620534251579496 ], [ 85.320750679659284, 27.620399249490376 ], [ 85.320692553759812, 27.620354248794005 ], [ 85.320587552134953, 27.620281122662401 ], [ 85.320510675945314, 27.620221121733909 ], [ 85.320454425074857, 27.620194871327694 ], [ 85.320336298246886, 27.620125495254122 ], [ 85.320250046912165, 27.62005611918055 ], [ 85.320146920316319, 27.619996118252057 ], [ 85.320062544010625, 27.619945492468641 ], [ 85.319981917762959, 27.619902366801284 ], [ 85.319850665731877, 27.619825490611653 ], [ 85.319768164455198, 27.61977298979922 ], [ 85.319677225547949, 27.619717207686008 ], [ 85.319652850170755, 27.619690957279794 ], [ 85.319648162598213, 27.61964783161244 ], [ 85.319673475489921, 27.619589705712961 ], [ 85.319725976302351, 27.61950345437825 ], [ 85.319768164455198, 27.619448141022296 ], [ 85.319799102433961, 27.619402202811418 ], [ 85.319828165383697, 27.619378764948724 ], [ 85.319862853420489, 27.619342201882922 ], [ 85.319916291747418, 27.619276107110128 ], [ 85.31995097978421, 27.619240481558837 ], [ 85.319985667821001, 27.619211418609098 ], [ 85.320015668285237, 27.619178605601327 ], [ 85.320042856205959, 27.619142980050032 ], [ 85.320081294300778, 27.619088604208585 ], [ 85.320117857366583, 27.619044541026724 ], [ 85.320140826472027, 27.619001884116624 ], [ 85.320177389537832, 27.618958758449271 ], [ 85.320223327748707, 27.618903445093316 ], [ 85.320273016017623, 27.618848131737359 ], [ 85.320326454344553, 27.618802193526481 ], [ 85.320368642497399, 27.618757192830113 ], [ 85.320415518222788, 27.618723442307836 ], [ 85.320478331694801, 27.618708442075711 ], [ 85.320543957710342, 27.618715942191773 ], [ 85.320580520776147, 27.618739380054464 ], [ 85.320629271530549, 27.618771255547728 ], [ 85.320679897313966, 27.618805006070005 ], [ 85.320732398126395, 27.618842506650314 ], [ 85.320771773735729, 27.618868757056529 ], [ 85.320813961888575, 27.618897820006268 ], [ 85.320875837846074, 27.618936258101087 ], [ 85.320942401376129, 27.618975633710409 ], [ 85.320984589528976, 27.619011259261704 ], [ 85.321022090109295, 27.619042665997707 ], [ 85.321045527971989, 27.619083916636047 ], [ 85.321064278262142, 27.619123292245373 ], [ 85.321106466414989, 27.619154230224126 ], [ 85.321152404625877, 27.61917766808682 ], [ 85.321222718213946, 27.619213293638111 ], [ 85.321265843881307, 27.619231106413761 ], [ 85.321322094751764, 27.619265794450545 ], [ 85.32137272053518, 27.619300482487329 ], [ 85.321434127735415, 27.619342905018797 ], [ 85.321509128896025, 27.619380405599106 ], [ 85.321591630172705, 27.619412281092366 ], [ 85.321681631565454, 27.619438531498584 ], [ 85.321790383248342, 27.619461031846768 ], [ 85.321904760018285, 27.619444156585629 ], [ 85.321974136091853, 27.619446031614643 ], [ 85.321989136323978, 27.619481657165938 ], [ 85.322011636672158, 27.619532282949354 ], [ 85.322039762107394, 27.619618534284065 ], [ 85.322092262919824, 27.619676660183544 ], [ 85.322141013674226, 27.619731036024991 ], [ 85.322208514718781, 27.619804162156591 ], [ 85.322255390444155, 27.619894632306586 ], [ 85.32227039067628, 27.619950883177047 ], [ 85.322277890792336, 27.620009009076526 ], [ 85.322306016227571, 27.620072760063049 ], [ 85.322377267330154, 27.620108385614344 ], [ 85.322471018780931, 27.620121510817452 ], [ 85.322579770463818, 27.620142136136622 ], [ 85.322673521914595, 27.620147761223667 ], [ 85.322772898452413, 27.620155261339729 ], [ 85.32289852539644, 27.620160886426774 ], [ 85.322956651295925, 27.620194636949055 ], [ 85.323016652224425, 27.620235887587395 ], [ 85.323061652920785, 27.620299638573918 ], [ 85.323093528414049, 27.620359639502411 ], [ 85.323138529110423, 27.620404640198782 ], [ 85.323185404835812, 27.620436515692045 ], [ 85.32325478090938, 27.620494641591524 ], [ 85.323303531663782, 27.620556517549034 ], [ 85.32335978253424, 27.620609018361463 ], [ 85.323388845483976, 27.620640425097474 ], [ 85.323430096122323, 27.620694800938921 ], [ 85.323484471963766, 27.620745426722337 ], [ 85.323501347224905, 27.620799802563784 ], [ 85.323499472195891, 27.620865428579325 ], [ 85.323476034333225, 27.620897304072589 ], [ 85.323435721209393, 27.620942304768956 ], [ 85.323396345600059, 27.621004180726466 ], [ 85.323353219932713, 27.621058556567913 ], [ 85.323314781837894, 27.621104494778791 ], [ 85.323274468714061, 27.621155120562211 ], [ 85.323227592988687, 27.621270434846657 ], [ 85.323199467553451, 27.621364186297431 ], [ 85.323167592060187, 27.621444812545093 ], [ 85.323134779052424, 27.62152121997747 ], [ 85.323116028762271, 27.62161309639923 ], [ 85.323035402514606, 27.621693722646892 ], [ 85.322941651063829, 27.621718098024093 ], [ 85.322864774874205, 27.621710597908031 ], [ 85.322757898220317, 27.621671222298708 ], [ 85.322664146769554, 27.621605596283167 ], [ 85.322570395318778, 27.621543720325658 ], [ 85.322452268490807, 27.621485594426179 ], [ 85.322399767678377, 27.621448093845871 ], [ 85.322362267098072, 27.621427468526701 ], [ 85.322304141198586, 27.621401218120486 ], [ 85.322234765125017, 27.621359967482146 ], [ 85.322142888703254, 27.621311216727744 ], [ 85.322043512165436, 27.621277466205466 ], [ 85.321983511236951, 27.621253090828265 ], [ 85.321904760018299, 27.621224965393033 ], [ 85.321852259205869, 27.621183714754693 ], [ 85.321807258509494, 27.621166839493554 ], [ 85.321752882668051, 27.621127463884232 ], [ 85.321707881971676, 27.621101213478017 ], [ 85.321662881275316, 27.621073088042785 ], [ 85.321599130288789, 27.621029962375427 ], [ 85.3215522545634, 27.620994336824136 ], [ 85.321466003228693, 27.620947461098751 ], [ 85.321402252242166, 27.620904335431394 ], [ 85.321378785082146, 27.620883006976353 ] ] ] } },
{ "type": "Feature", "properties": { "id": null, "type": "Concrete", "quality": "4" }, "geometry": { "type": "MultiLineString", "coordinates": [ [ [ 85.321974136091853, 27.619446031614643 ], [ 85.322012955051932, 27.61941945893788 ], [ 85.322012955051932, 27.619378208299544 ], [ 85.322009204993904, 27.619288206906806 ], [ 85.322018580138973, 27.619216955804223 ], [ 85.32200732996489, 27.619132579498533 ], [ 85.322014830080946, 27.619068828512013 ], [ 85.322033580371098, 27.61897320203223 ], [ 85.322057955748292, 27.618907576016692 ], [ 85.3220823311255, 27.618789449188728 ], [ 85.322117956676792, 27.61872007311516 ], [ 85.322138581995958, 27.618620696577349 ], [ 85.322213583156568, 27.618556945590825 ], [ 85.322301709520289, 27.618431318646799 ], [ 85.322378585709927, 27.61829819158671 ], [ 85.322489212421829, 27.618219440368065 ], [ 85.322618589423868, 27.618187564874798 ], [ 85.322749841454936, 27.618187564874798 ], [ 85.322866093253893, 27.618225065455103 ], [ 85.323019845633141, 27.618322566963901 ], [ 85.323121097199973, 27.618420068472698 ], [ 85.323199848418611, 27.618483819459222 ], [ 85.323293599869388, 27.618558820619835 ], [ 85.3234173517844, 27.618641321896508 ], [ 85.323511103235163, 27.618750073579399 ], [ 85.32361985491805, 27.618828824798044 ], [ 85.323668605672452, 27.61888132561047 ], [ 85.323736106717007, 27.618915076132748 ], [ 85.323848608457922, 27.618982577177299 ], [ 85.323961110198837, 27.619050078221854 ], [ 85.324017361069309, 27.619125079382467 ], [ 85.324006110895212, 27.619218830833233 ], [ 85.323938609850657, 27.619308832225968 ], [ 85.323863608690047, 27.61937633327052 ], [ 85.323758607065187, 27.619458834547196 ], [ 85.323717356426855, 27.619485084953411 ], [ 85.323683605904577, 27.619533835707809 ], [ 85.323634855150175, 27.619590086578267 ], [ 85.323578604279717, 27.619680087971005 ], [ 85.323518603351218, 27.619740088899494 ], [ 85.323421101842428, 27.619777589479803 ], [ 85.323362975942928, 27.619830090292233 ], [ 85.323319850275581, 27.619891966249739 ], [ 85.323278599637248, 27.619936966946106 ], [ 85.323244849114971, 27.620004467990658 ], [ 85.323181098128444, 27.620077594122254 ], [ 85.323102346909806, 27.620118844760594 ], [ 85.322991720197891, 27.620145095166809 ], [ 85.32289852539644, 27.620160886426774 ] ] ] } },
{ "type": "Feature", "properties": { "id": null, "type": "Concrete", "quality": "4" }, "geometry": { "type": "MultiLineString", "coordinates": [ [ [ 85.3234173517844, 27.618641321896508 ], [ 85.323343422068845, 27.618711769415214 ], [ 85.32328984981126, 27.618759984447038 ], [ 85.32323627755369, 27.61881355670462 ], [ 85.323174133734895, 27.618891772200687 ], [ 85.323118418587001, 27.618962487580696 ], [ 85.323048774652136, 27.619066417760401 ], [ 85.322982345052736, 27.619141418921014 ], [ 85.322944844472431, 27.619181062391622 ], [ 85.322898772330902, 27.619243206210417 ], [ 85.322835557066966, 27.619307492919514 ], [ 85.322789484925437, 27.619366422402852 ], [ 85.322866628976357, 27.619425351886193 ], [ 85.322927701350011, 27.619462852466501 ], [ 85.322975916381836, 27.619492852930744 ], [ 85.323016631297591, 27.619531424956204 ], [ 85.323079846561541, 27.619573211317118 ], [ 85.323128061593366, 27.619603211781364 ], [ 85.323197705528216, 27.619639640916517 ], [ 85.323231991773056, 27.619664284155007 ], [ 85.323315564494891, 27.619578568542877 ], [ 85.323384136984586, 27.619499281601659 ], [ 85.323452709474296, 27.619411423099226 ], [ 85.323527710634906, 27.619319278816185 ], [ 85.323596283124616, 27.619244277655572 ], [ 85.323662712724015, 27.619167133604655 ], [ 85.323754857007046, 27.619059989089493 ], [ 85.323848608457922, 27.618982577177299 ] ] ] } },
{ "type": "Feature", "properties": { "id": null, "type": "Concrete", "quality": "4" }, "geometry": { "type": "MultiLineString", "coordinates": [ [ [ 85.323527710634906, 27.619319278816185 ], [ 85.323480567048236, 27.619287135461636 ], [ 85.323416280339146, 27.619244277655572 ], [ 85.323343422068831, 27.619192848288296 ], [ 85.323294135591851, 27.619237848984664 ], [ 85.323249134895491, 27.619274278119818 ], [ 85.323195562637906, 27.619329993267701 ] ] ] } },
{ "type": "Feature", "properties": { "id": null, "type": "Concrete", "quality": "4" }, "geometry": { "type": "MultiLineString", "coordinates": [ [ [ 85.323343422068831, 27.619192848288296 ], [ 85.323381994094291, 27.619141418921018 ], [ 85.323420566119751, 27.619094275334348 ], [ 85.32347842415794, 27.619038560186461 ] ] ] } },
{ "type": "Feature", "properties": { "id": null, "type": "Concrete", "quality": "4" }, "geometry": { "type": "MultiLineString", "coordinates": [ [ [ 85.322944844472431, 27.619181062391622 ], [ 85.322854843079696, 27.619119990017989 ], [ 85.322771270357876, 27.619047131747678 ], [ 85.322698412087561, 27.618957130354943 ], [ 85.322604124914221, 27.618860700291297 ], [ 85.322518409302091, 27.618815699594929 ], [ 85.322428407909356, 27.618744984214924 ], [ 85.322361978309956, 27.618706412189464 ], [ 85.322321263394187, 27.618661411493097 ], [ 85.322248405123887, 27.618609982125818 ], [ 85.322213583156568, 27.618556945590825 ] ] ] } },
{ "type": "Feature", "properties": { "id": null, "type": "Concrete", "quality": "4" }, "geometry": { "type": "MultiLineString", "coordinates": [ [ [ 85.322789484925437, 27.619366422402852 ], [ 85.322739127003331, 27.619415708879842 ], [ 85.322694126306956, 27.619443566453786 ], [ 85.322664125842707, 27.619494995821064 ], [ 85.322625553817261, 27.619529282065916 ], [ 85.322599839133616, 27.619569996981674 ], [ 85.322559124217861, 27.619617140568348 ], [ 85.322507694850572, 27.619672855716232 ], [ 85.322462694154211, 27.619722142193208 ] ] ] } },
{ "type": "Feature", "properties": { "id": null, "type": "Concrete", "quality": "4" }, "geometry": { "type": "MultiLineString", "coordinates": [ [ [ 85.323231991773056, 27.619664284155007 ], [ 85.323174133734923, 27.619721070748049 ], [ 85.323110918470974, 27.619772500115328 ], [ 85.323024131413689, 27.619791786128058 ], [ 85.322896629440649, 27.619810000695633 ], [ 85.322771270357904, 27.619834643934119 ], [ 85.322658768616989, 27.619834643934119 ], [ 85.322554838437284, 27.619814286476242 ], [ 85.32248198016697, 27.619756428438052 ], [ 85.322462694154211, 27.619722142193208 ] ] ] } },
{ "type": "Feature", "properties": { "id": null, "type": "Concrete", "quality": "4" }, "geometry": { "type": "MultiLineString", "coordinates": [ [ [ 85.322771270357904, 27.619834643934119 ], [ 85.322785199144903, 27.619784286011992 ], [ 85.322804485157633, 27.619743571096233 ], [ 85.322815199609138, 27.619692141728954 ] ] ] } },
{ "type": "Feature", "properties": { "id": null, "type": "Concrete", "quality": "4" }, "geometry": { "type": "MultiLineString", "coordinates": [ [ [ 85.322428407909356, 27.618744984214924 ], [ 85.322530195198837, 27.618637839699765 ], [ 85.322575195895212, 27.618560695648849 ] ] ] } },
{ "type": "Feature", "properties": { "id": null, "type": "Concrete", "quality": "4" }, "geometry": { "type": "MultiLineString", "coordinates": [ [ [ 85.322698412087561, 27.618957130354943 ], [ 85.322637339714021, 27.618976416367673 ], [ 85.322568767224311, 27.619008559722221 ], [ 85.322519480747331, 27.619066417760411 ], [ 85.322502337624911, 27.619098561114956 ] ] ] } },
{ "type": "Feature", "properties": { "id": null, "type": "Concrete", "quality": "4" }, "geometry": { "type": "MultiLineString", "coordinates": [ [ [ 85.322462694154211, 27.619722142193208 ], [ 85.3223748356519, 27.619659998374406 ], [ 85.322314834723414, 27.619580711433183 ], [ 85.32226126246583, 27.619456423795597 ], [ 85.322226976220975, 27.619349279280435 ], [ 85.32223983356279, 27.619190705397994 ], [ 85.32226983402704, 27.619104989785864 ] ] ] } },
{ "type": "Feature", "properties": { "id": null, "type": "Concrete", "quality": "4" }, "geometry": { "type": "MultiLineString", "coordinates": [ [ [ 85.322575195895212, 27.618560695648849 ], [ 85.322612696475574, 27.618527480849142 ], [ 85.322644839830133, 27.618477122927018 ], [ 85.322681268965283, 27.618423550669437 ] ] ] } },
{ "type": "Feature", "properties": { "id": null, "type": "Concrete", "quality": "4" }, "geometry": { "type": "MultiLineString", "coordinates": [ [ [ 85.322471018780931, 27.620121510817452 ], [ 85.322459479818903, 27.620205096095297 ], [ 85.322438050915878, 27.620273668585003 ], [ 85.322403764671023, 27.620342241074706 ], [ 85.322363049755253, 27.620385098880774 ], [ 85.322330906400708, 27.620436528248053 ], [ 85.322305191717078, 27.620479386054118 ], [ 85.322253762349789, 27.620539386982607 ], [ 85.322290191484953, 27.620610102362615 ], [ 85.322279477033433, 27.620682960632926 ], [ 85.322225904775848, 27.620781533586875 ], [ 85.322150903615238, 27.620845820295973 ], [ 85.322118760260693, 27.620873677869913 ] ] ] } },
{ "type": "Feature", "properties": { "id": null, "type": "Concrete", "quality": "4" }, "geometry": { "type": "MultiLineString", "coordinates": [ [ [ 85.322305191717078, 27.620479386054118 ], [ 85.322352335303748, 27.620535101202002 ], [ 85.322414479122543, 27.620580101898369 ], [ 85.322461622709213, 27.620599387911099 ], [ 85.322534480979513, 27.620629388375345 ] ] ] } },
{ "type": "Feature", "properties": { "id": null, "type": "Concrete", "quality": "4" }, "geometry": { "type": "MultiLineString", "coordinates": [ [ [ 85.322306016227571, 27.620072760063049 ], [ 85.32226769113673, 27.620096880134987 ], [ 85.32220983309854, 27.620120451928322 ], [ 85.322149832170041, 27.620139737941052 ], [ 85.322102688583371, 27.620161166844085 ], [ 85.322071616673981, 27.620183667192268 ], [ 85.322021258751846, 27.620212596211363 ], [ 85.321966615049121, 27.620253311127122 ], [ 85.321909828456086, 27.620311169165312 ], [ 85.321853041863051, 27.620347598300466 ], [ 85.321821969953646, 27.620394741887136 ], [ 85.321766254805766, 27.620456885705931 ], [ 85.321709468212731, 27.620497600621693 ], [ 85.321661253180906, 27.620508315073209 ], [ 85.321590537800901, 27.620486886170177 ], [ 85.321527322536951, 27.620447242699566 ], [ 85.321484464730887, 27.620408670674109 ], [ 85.321439464034555, 27.62035938419713 ], [ 85.321389641835012, 27.620295097488032 ], [ 85.321397677673644, 27.620242060953029 ], [ 85.32142982102819, 27.620213131933934 ], [ 85.321465178718199, 27.620182595747114 ], [ 85.321503750743659, 27.620137595050746 ], [ 85.321539108433655, 27.620102237360744 ], [ 85.321577680459114, 27.620076522677103 ], [ 85.321616252484574, 27.620044379322554 ], [ 85.321650003006852, 27.620004200129369 ], [ 85.321643574335951, 27.619949556426636 ], [ 85.321608216645942, 27.619865983704809 ], [ 85.321580894794579, 27.619814554337534 ], [ 85.321494107737294, 27.619751874796165 ], [ 85.321436249699104, 27.619735803118893 ], [ 85.321301247610009, 27.619700445428887 ], [ 85.321224103559089, 27.619652230397065 ], [ 85.321185531533629, 27.619610444036152 ] ] ] } },
{ "type": "Feature", "properties": { "id": null, "type": "Concrete", "quality": "4" }, "geometry": { "type": "MultiLineString", "coordinates": [ [ [ 85.321494107737294, 27.619751874796165 ], [ 85.321529465427304, 27.619687588087068 ], [ 85.321542322769119, 27.619616872707063 ], [ 85.321548751440034, 27.619549371662512 ], [ 85.321548751440034, 27.619485084953414 ], [ 85.321509128896025, 27.619380405599106 ] ] ] } },
{ "type": "Feature", "properties": { "id": null, "type": "Concrete", "quality": "4" }, "geometry": { "type": "MultiLineString", "coordinates": [ [ [ 85.323227592988687, 27.621270434846657 ], [ 85.323175205180178, 27.621225647602223 ], [ 85.323126990148353, 27.621198325750857 ], [ 85.323084400203584, 27.621166985980171 ], [ 85.323048238929715, 27.621150914302898 ], [ 85.322991988059258, 27.621112342277439 ], [ 85.322928504934012, 27.621062520077889 ], [ 85.322855378802416, 27.621007876375156 ], [ 85.322805556602873, 27.620969304349696 ], [ 85.322731626887403, 27.620933946659694 ], [ 85.322662920467053, 27.620880307436792 ], [ 85.322632384280226, 27.620861021424062 ], [ 85.322580954912951, 27.620889950443157 ], [ 85.322535150632717, 27.620946201313615 ], [ 85.322484524849301, 27.621002452184076 ], [ 85.322441131320659, 27.621049060048172 ], [ 85.322411398717705, 27.621088435657494 ], [ 85.322373630276118, 27.621130222018408 ], [ 85.322333451082926, 27.621167186876139 ], [ 85.32229889697679, 27.621192097975914 ], [ 85.322259521367471, 27.621245134510918 ], [ 85.322142888703254, 27.621311216727744 ] ] ] } },
{ "type": "Feature", "properties": { "id": null, "type": "Concrete", "quality": "4" }, "geometry": { "type": "MultiLineString", "coordinates": [ [ [ 85.322632384280226, 27.620861021424062 ], [ 85.322654081044547, 27.620816824311557 ], [ 85.322670152721827, 27.620794323963374 ], [ 85.322699885324781, 27.620765394944279 ], [ 85.322729617927735, 27.620724412167231 ], [ 85.32276176128228, 27.620689858061091 ], [ 85.322790690301375, 27.620641643029266 ], [ 85.32281560140116, 27.620615124761766 ] ] ] } },
{ "type": "Feature", "properties": { "id": null, "type": "Concrete", "quality": "4" }, "geometry": { "type": "MultiLineString", "coordinates": [ [ [ 85.321397677673644, 27.620242060953029 ], [ 85.321375579117387, 27.620188421730134 ], [ 85.321341828595109, 27.620130563691948 ], [ 85.321264684544204, 27.620074312821487 ], [ 85.321214862344647, 27.620032526460573 ], [ 85.321166647312822, 27.620018061951029 ], [ 85.321089503261902, 27.619965025416022 ], [ 85.321039681062359, 27.619928060558291 ], [ 85.320991466030534, 27.619902345874653 ], [ 85.320919143482797, 27.619900738706924 ], [ 85.320810659661205, 27.619873818647484 ], [ 85.320727086939371, 27.619819174944752 ], [ 85.320614585198456, 27.619754888235654 ], [ 85.320531012476636, 27.619703458868376 ], [ 85.320402439058441, 27.619616671811094 ], [ 85.320299580323876, 27.619552385101997 ], [ 85.320212793266606, 27.619475241051081 ], [ 85.320109934532042, 27.619385239658346 ], [ 85.320055290829316, 27.61934988196834 ], [ 85.31995097978421, 27.619240481558837 ] ] ] } },
{ "type": "Feature", "properties": { "id": null, "type": "Concrete", "quality": "4" }, "geometry": { "type": "MultiLineString", "coordinates": [ [ [ 85.320109934532042, 27.619385239658346 ], [ 85.320114756035224, 27.61944631203199 ], [ 85.320087434183847, 27.619504170070176 ], [ 85.320036004816572, 27.619589349959728 ] ] ] } },
{ "type": "Feature", "properties": { "id": null, "type": "Concrete", "quality": "4" }, "geometry": { "type": "MultiLineString", "coordinates": [ ] } },
{ "type": "Feature", "properties": { "id": null, "type": "Concrete", "quality": "4" }, "geometry": { "type": "MultiLineString", "coordinates": [ [ [ 85.320402439058441, 27.619616671811094 ], [ 85.320469940102996, 27.619585733832334 ], [ 85.320514137215511, 27.619535108048918 ], [ 85.320555119992548, 27.619482071513914 ], [ 85.32057922750846, 27.619438677985276 ], [ 85.320613781614611, 27.619400105959816 ], [ 85.32063065687575, 27.619362337518222 ], [ 85.320663603814154, 27.619340640753901 ], [ 85.32071864930883, 27.619299858872818 ], [ 85.32075400699884, 27.61924360800236 ], [ 85.32081829370793, 27.619188964299628 ], [ 85.32087615174612, 27.619158428112804 ], [ 85.320951688629307, 27.619135927764621 ], [ 85.321064278262142, 27.619123292245373 ] ] ] } },
{ "type": "Feature", "properties": { "id": null, "type": "Concrete", "quality": "4" }, "geometry": { "type": "MultiLineString", "coordinates": [ [ [ 85.320177389537832, 27.618958758449271 ], [ 85.320217212977866, 27.61898324683051 ], [ 85.320291142693321, 27.619002532843236 ], [ 85.320386769173112, 27.61906360521688 ] ] ] } },
{ "type": "Feature", "properties": { "id": null, "type": "Concrete", "quality": "4" }, "geometry": { "type": "MultiLineString", "coordinates": [ ] } },
{ "type": "Feature", "properties": { "id": null, "type": "Concrete", "quality": "4" }, "geometry": { "type": "MultiLineString", "coordinates": [ ] } },
{ "type": "Feature", "properties": { "id": null, "type": "Concrete", "quality": "4" }, "geometry": { "type": "MultiLineString", "coordinates": [ [ [ 85.321661253180906, 27.620508315073209 ], [ 85.321623484739391, 27.620577557216119 ], [ 85.321628306242573, 27.620657915602489 ], [ 85.321634734913488, 27.620690058957038 ], [ 85.32168134277758, 27.620730238150223 ], [ 85.321747236654403, 27.620754345666136 ], [ 85.321787415847595, 27.620781667517502 ], [ 85.321846881053503, 27.620807382201143 ], [ 85.321887060246695, 27.620847561394328 ], [ 85.321949739788053, 27.620881311916602 ], [ 85.321997954819878, 27.620931134116152 ], [ 85.322073491703065, 27.620935955619334 ], [ 85.322118760260693, 27.620873677869913 ] ] ] } },
{ "type": "Feature", "properties": { "id": null, "type": "Concrete", "quality": "4" }, "geometry": { "type": "MultiLineString", "coordinates": [ [ [ 85.322213583156568, 27.618556945590825 ], [ 85.32214420708307, 27.618504310847729 ], [ 85.322078313206248, 27.618488239170457 ], [ 85.321991526148963, 27.618475381828638 ], [ 85.321888667414413, 27.618472167493181 ], [ 85.321766522667119, 27.618472167493181 ], [ 85.321658842429386, 27.618476988996363 ], [ 85.321541519185288, 27.618475381828638 ], [ 85.321441874786188, 27.618478596164092 ], [ 85.321361516399818, 27.618489846338182 ], [ 85.321269907839351, 27.618523596860459 ], [ 85.321192763788432, 27.618576633395463 ], [ 85.321165441937069, 27.618605562414558 ], [ 85.321126869911609, 27.618673063459109 ], [ 85.321105976731147, 27.618726099994117 ], [ 85.321081869215234, 27.618793601038668 ], [ 85.321062583202504, 27.618841816070489 ], [ 85.321044904357507, 27.618907709947315 ], [ 85.321032047015692, 27.618955924979137 ], [ 85.321033654183424, 27.619013783017326 ], [ 85.321022090109295, 27.619042665997707 ] ] ] } },
{ "type": "Feature", "properties": { "id": null, "type": "Concrete", "quality": "4" }, "geometry": { "type": "MultiLineString", "coordinates": [ [ [ 85.321509128896025, 27.619380405599106 ], [ 85.321523036756417, 27.619294635577685 ], [ 85.32154714427233, 27.619233563204045 ], [ 85.32157285895596, 27.619166062159493 ], [ 85.321593752136422, 27.619121061463122 ], [ 85.321614645316885, 27.619090525276302 ], [ 85.321640360000515, 27.619048738915389 ], [ 85.32166928901961, 27.618997309548114 ], [ 85.321717504051435, 27.618939451509924 ], [ 85.32174643307053, 27.618878379136284 ], [ 85.321760897580077, 27.618859093123554 ], [ 85.321775362089625, 27.618841414278553 ] ] ] } },
{ "type": "Feature", "properties": { "id": null, "type": "Concrete", "quality": "4" }, "geometry": { "type": "MultiLineString", "coordinates": [ [ [ 85.320386769173112, 27.61906360521688 ], [ 85.320403644434279, 27.619080882269937 ], [ 85.320424537614727, 27.619099364698801 ], [ 85.320456680969286, 27.619117043543806 ], [ 85.320496860162464, 27.6191548119854 ], [ 85.320542664442698, 27.619181330252903 ], [ 85.320581236468158, 27.619199812681767 ], [ 85.320609361903379, 27.619219098694497 ], [ 85.320644719593389, 27.619244813378135 ], [ 85.320680880867258, 27.61926972447791 ], [ 85.32071864930883, 27.619299858872818 ] ] ] } },
{ "type": "Feature", "properties": { "id": null, "type": "Concrete", "quality": "4" }, "geometry": { "type": "MultiLineString", "coordinates": [ [ [ 85.320531012476636, 27.619703458868376 ], [ 85.3205185569268, 27.619748861356641 ], [ 85.320492038659296, 27.619805112227098 ], [ 85.320473556230425, 27.619836451997784 ], [ 85.320458288137019, 27.619879845526423 ], [ 85.320424537614741, 27.619923239055066 ], [ 85.320386769173155, 27.619976074694105 ], [ 85.320350607899286, 27.620019468222743 ] ] ] } },
{ "type": "Feature", "properties": { "id": null, "type": "Concrete", "quality": "4" }, "geometry": { "type": "MultiLineString", "coordinates": [ [ [ 85.321089503261902, 27.619965025416022 ], [ 85.321045707941394, 27.620005807297062 ], [ 85.320998296493443, 27.620049200825701 ], [ 85.320964545971165, 27.620095005105934 ], [ 85.32093963487138, 27.620123934125029 ], [ 85.320917134523199, 27.620159291815032 ], [ 85.32089383059116, 27.620192238753443 ], [ 85.320873740994557, 27.62024125736913 ], [ 85.320806641741939, 27.620305343182263 ] ] ] } },
{ "type": "Feature", "properties": { "id": null, "type": "Concrete", "quality": "4" }, "geometry": { "type": "MultiLineString", "coordinates": [ [ [ 85.320350607899286, 27.620019468222743 ], [ 85.320325696799486, 27.620058040248203 ], [ 85.320250046912165, 27.62005611918055 ] ] ] } },
{ "type": "Feature", "properties": { "id": null, "type": "Concrete", "quality": "4" }, "geometry": { "type": "MultiLineString", "coordinates": [ [ [ 85.320806641741939, 27.620305343182263 ], [ 85.320773293011584, 27.620340700872266 ], [ 85.320750679659284, 27.620399249490376 ] ] ] } },
{ "type": "Feature", "properties": { "id": null, "type": "Concrete", "quality": "4" }, "geometry": { "type": "MultiLineString", "coordinates": [ [ [ 85.321389641835012, 27.620295097488032 ], [ 85.321361516399833, 27.620307753933865 ], [ 85.321309283448684, 27.62033266503364 ], [ 85.321268300671647, 27.620372844226825 ], [ 85.321245800323453, 27.620405791165236 ] ] ] } },
{ "type": "Feature", "properties": { "id": null, "type": "Concrete", "quality": "4" }, "geometry": { "type": "MultiLineString", "coordinates": [ [ [ 85.320036004816572, 27.619589349959728 ], [ 85.320001450710521, 27.619630332736751 ], [ 85.319952432094823, 27.619676137016985 ], [ 85.319884127466409, 27.619721137713352 ], [ 85.319856002031187, 27.619786228006312 ], [ 85.319850665731877, 27.619825490611653 ] ] ] } },
{ "type": "Feature", "properties": { "id": null, "type": "Concrete", "quality": "4" }, "geometry": { "type": "MultiLineString", "coordinates": [ [ [ 85.323181098128444, 27.620077594122254 ], [ 85.323197303736492, 27.620122929645198 ], [ 85.323230250674911, 27.62015185866429 ], [ 85.323280072874454, 27.620184002018838 ], [ 85.3233499846706, 27.620219359708845 ], [ 85.323408646292648, 27.620249092311802 ], [ 85.323460075659924, 27.620293691216244 ], [ 85.323514719362663, 27.620325834570792 ], [ 85.323585434742668, 27.620369228099431 ], [ 85.323625613935846, 27.62040940729262 ], [ 85.323697936483583, 27.620456015156712 ] ] ] } },
{ "type": "Feature", "properties": { "id": null, "type": "Concrete", "quality": "4" }, "geometry": { "type": "MultiLineString", "coordinates": [ [ [ 85.323408646292648, 27.620249092311802 ], [ 85.323443401294753, 27.620208511326695 ], [ 85.323472330313848, 27.620179582307603 ], [ 85.323509295171576, 27.620155474791691 ], [ 85.323543045693853, 27.620108866927595 ], [ 85.323571974712948, 27.620084759411682 ], [ 85.323583224887045, 27.620047794553951 ], [ 85.32357358188068, 27.620009222528495 ], [ 85.323526974016588, 27.61996904333531 ] ] ] } },
{ "type": "Feature", "properties": { "id": null, "type": "Concrete", "quality": "4" }, "geometry": { "type": "MultiLineString", "coordinates": [ [ [ 85.323526974016588, 27.61996904333531 ], [ 85.323480366152481, 27.619994758018947 ], [ 85.323453044301118, 27.620034937212132 ] ] ] } },
{ "type": "Feature", "properties": { "id": null, "type": "Concrete", "quality": "4" }, "geometry": { "type": "MultiLineString", "coordinates": [ [ [ 85.323499472195891, 27.620865428579325 ], [ 85.323586439222495, 27.620944594145865 ], [ 85.32358965355796, 27.62101530952587 ], [ 85.32357358188068, 27.621111739589516 ], [ 85.323621796912505, 27.621195312311343 ], [ 85.32373429865342, 27.621262813355894 ], [ 85.32382751438162, 27.621323885729552 ], [ 85.323904658432539, 27.621397815445011 ], [ 85.323985016818909, 27.621442816141382 ], [ 85.324078232547095, 27.621494245508657 ], [ 85.324181091281645, 27.621532817534117 ], [ 85.32427109267438, 27.621571389559573 ], [ 85.324346629557581, 27.621646926442768 ], [ 85.324381987247577, 27.621704784480954 ], [ 85.324478417311227, 27.621756213848233 ], [ 85.324565204368554, 27.621787955410834 ], [ 85.324708242296268, 27.621894430272789 ], [ 85.324875387739922, 27.622048718374622 ], [ 85.324952531790842, 27.622209435147365 ], [ 85.324971817803572, 27.622370151920109 ], [ 85.324958960461743, 27.622505154009211 ], [ 85.324933245778112, 27.622601584072857 ], [ 85.324901102423567, 27.622717300149233 ], [ 85.324862530398107, 27.622826587554698 ], [ 85.324830387043548, 27.622961589643801 ], [ 85.324766100334458, 27.623090163061995 ], [ 85.324733956979912, 27.623173735783823 ], [ 85.324746814321728, 27.623308737872925 ], [ 85.324798243689003, 27.623385881923845 ], [ 85.324971817803572, 27.623482311987487 ], [ 85.325081105209037, 27.623514455342036 ], [ 85.325158249259943, 27.623565884709315 ], [ 85.325203249956317, 27.623681600785691 ], [ 85.325209678627232, 27.623681600785691 ], [ 85.325238607646355, 27.623790888191156 ], [ 85.32525146498817, 27.623871246577526 ], [ 85.32525146498817, 27.623941961957531 ], [ 85.325254679323635, 27.624009463002086 ], [ 85.325238607646355, 27.624083392717548 ], [ 85.325214811239931, 27.624150870045515 ] ] ] } },
{ "type": "Feature", "properties": { "id": null, "type": "Gravel", "quality": "3" }, "geometry": { "type": "MultiLineString", "coordinates": [ [ [ 85.323586439222495, 27.620944594145865 ], [ 85.323631439918913, 27.620936558307235 ], [ 85.323689297957088, 27.620880307436774 ], [ 85.323731084318013, 27.620812806392223 ], [ 85.323782513685288, 27.620716376328577 ], [ 85.323808228368918, 27.620677804303117 ], [ 85.32384840756211, 27.62060226741993 ], [ 85.323888586755302, 27.620541195046286 ], [ 85.32392876594848, 27.620489765679007 ], [ 85.323972159477123, 27.620439943479457 ], [ 85.323993052657585, 27.620393335615361 ] ] ] } },
{ "type": "Feature", "properties": { "id": null, "type": "Gravel", "quality": "3" }, "geometry": { "type": "MultiLineString", "coordinates": [ [ [ 85.32384840756211, 27.62060226741993 ], [ 85.323808228368918, 27.620573338400835 ], [ 85.32377126351119, 27.620534766375378 ], [ 85.323750370330742, 27.620475301169463 ], [ 85.323697936483583, 27.620456015156712 ] ] ] } },
{ "type": "Feature", "properties": { "id": null, "type": "Gravel", "quality": "3" }, "geometry": { "type": "MultiLineString", "coordinates": [ [ [ 85.323782513685288, 27.620716376328577 ], [ 85.323801799698032, 27.62074369817994 ], [ 85.323838764555759, 27.620799949050401 ], [ 85.323891801090767, 27.620830485237221 ], [ 85.323952873464407, 27.620854592753133 ], [ 85.324009124334864, 27.620883521772228 ], [ 85.324057339366689, 27.620920486629959 ], [ 85.324115197404879, 27.620962272990873 ], [ 85.324169841107619, 27.621007273687241 ], [ 85.324234127816709, 27.621058703054516 ], [ 85.324309664699896, 27.621113346757252 ], [ 85.324369129905818, 27.62115674028589 ], [ 85.324418952105361, 27.621217812659534 ], [ 85.324486453149916, 27.621259599020448 ], [ 85.324552347026739, 27.621301385381358 ], [ 85.324608597897196, 27.621320671394088 ], [ 85.324690563451298, 27.621376922264549 ], [ 85.324714670967211, 27.6214444233091 ], [ 85.324729135476773, 27.621547282043661 ], [ 85.324729135476773, 27.621651747945947 ], [ 85.324811101030846, 27.621836170442656 ], [ 85.324875387739922, 27.622048718374622 ] ] ] } },
{ "type": "Feature", "properties": { "id": null, "type": "Gravel", "quality": "3" }, "geometry": { "type": "MultiLineString", "coordinates": [ [ [ 85.32416501960445, 27.62060226741993 ], [ 85.324129661914441, 27.620668161296756 ], [ 85.324107161566261, 27.620730840838124 ], [ 85.324086268385798, 27.620803163385858 ], [ 85.324009124334864, 27.620883521772228 ], [ 85.323994659825345, 27.620986380506785 ], [ 85.323968945141701, 27.621089239241339 ], [ 85.32392394444534, 27.62117602629862 ], [ 85.323875729413516, 27.621270849194541 ], [ 85.32382751438162, 27.621323885729552 ] ] ] } },
{ "type": "Feature", "properties": { "id": null, "type": "Gravel", "quality": "3" }, "geometry": { "type": "MultiLineString", "coordinates": [ [ [ 85.32382751438162, 27.621323885729552 ], [ 85.323735905821223, 27.62141870862547 ], [ 85.323697333795764, 27.621489424005475 ], [ 85.323668404776669, 27.621547282043664 ], [ 85.323652333099389, 27.621622818926852 ], [ 85.323636261422124, 27.621751392345047 ], [ 85.323610546738479, 27.621847822408693 ], [ 85.323551081532571, 27.621933002298245 ], [ 85.323510902339379, 27.622021396523255 ], [ 85.323427329617545, 27.622148362773721 ] ] ] } },
{ "type": "Feature", "properties": { "id": null, "type": "Gravel", "quality": "3" }, "geometry": { "type": "MultiLineString", "coordinates": [ [ [ 85.324078232547095, 27.621494245508657 ], [ 85.324034839018523, 27.621585854069121 ], [ 85.323989838322163, 27.621680676965038 ], [ 85.323940016122606, 27.621796393041414 ], [ 85.323909479935793, 27.621926573627334 ], [ 85.323877336581234, 27.622019789355527 ], [ 85.323853229065321, 27.622056754213258 ], [ 85.323817871375326, 27.622119433754627 ], [ 85.323792156691681, 27.622209435147365 ], [ 85.323727869982591, 27.622307472378736 ] ] ] } },
{ "type": "Feature", "properties": { "id": null, "type": "Gravel", "quality": "3" }, "geometry": { "type": "MultiLineString", "coordinates": [ [ [ 85.323993052657585, 27.620393335615361 ], [ 85.324075018211673, 27.62026395861329 ], [ 85.324097518559853, 27.620116099182368 ], [ 85.324055732198943, 27.619958596745079 ], [ 85.323988231154388, 27.619791451301428 ], [ 85.323917515774383, 27.619704664244146 ], [ 85.323859657736193, 27.619640377535049 ], [ 85.323811442704368, 27.61956966215504 ], [ 85.323717356426855, 27.619485084953411 ] ] ] } },
{ "type": "Feature", "properties": { "id": null, "type": "Gravel", "quality": "3" }, "geometry": { "type": "MultiLineString", "coordinates": [ [ [ 85.324309664699896, 27.621113346757252 ], [ 85.324351451060764, 27.620996425305076 ], [ 85.324396451757124, 27.620887137899611 ], [ 85.324465559969411, 27.620776243326418 ] ] ] } },
{ "type": "Feature", "properties": { "id": null, "type": "Gravel", "quality": "3" }, "geometry": { "type": "MultiLineString", "coordinates": [ [ [ 85.324309664699896, 27.621113346757252 ], [ 85.324272699842112, 27.621190892600097 ], [ 85.324240556487567, 27.621268036651013 ], [ 85.324189127120292, 27.621343573534201 ], [ 85.324155376598014, 27.621412681746481 ], [ 85.324078232547095, 27.621494245508657 ] ] ] } },
{ "type": "Feature", "properties": { "id": null, "type": "Concrete", "quality": "4" }, "geometry": { "type": "MultiLineString", "coordinates": [ [ [ 85.323427329617545, 27.622148362773721 ], [ 85.323363042908412, 27.622119835546549 ], [ 85.323297149031589, 27.622066799011545 ], [ 85.323250541167496, 27.62202661981836 ], [ 85.323147682432946, 27.621955904438352 ], [ 85.323072145549745, 27.621906082238802 ], [ 85.323014287511569, 27.621835366858793 ], [ 85.322974108318377, 27.621787151826972 ], [ 85.322864774874205, 27.621710597908031 ] ] ] } },
{ "type": "Feature", "properties": { "id": null, "type": "Concrete", "quality": "4" }, "geometry": { "type": "MultiLineString", "coordinates": [ [ [ 85.323427329617545, 27.622148362773721 ], [ 85.323469115978426, 27.622219479945663 ], [ 85.323546260029346, 27.622264480642031 ], [ 85.323599296564353, 27.622335196022036 ], [ 85.323727869982591, 27.622307472378736 ], [ 85.323830728717098, 27.622375375215224 ], [ 85.323845193226646, 27.622450912098412 ], [ 85.323922337277565, 27.622531270484782 ], [ 85.324004302831668, 27.62260198586479 ], [ 85.32410876873395, 27.622655022399794 ], [ 85.324145733591692, 27.622688772922057 ], [ 85.324192341455799, 27.622686362170459 ], [ 85.324226895561935, 27.622646182977274 ], [ 85.324277521345351, 27.622583503435912 ] ] ] } },
{ "type": "Feature", "properties": { "id": null, "type": "Concrete", "quality": "4" }, "geometry": { "type": "MultiLineString", "coordinates": [ [ [ 85.324277521345351, 27.622583503435912 ], [ 85.324377165744437, 27.62257064609409 ], [ 85.324470381472622, 27.622622075461368 ], [ 85.324579668878087, 27.622712076854103 ], [ 85.324672884606287, 27.622760291885928 ], [ 85.324788600682652, 27.622821364259572 ], [ 85.324862530398107, 27.622826587554698 ] ] ] } },
{ "type": "Feature", "properties": { "id": null, "type": "Gravel", "quality": "3" }, "geometry": { "type": "MultiLineString", "coordinates": [ [ [ 85.324381987247577, 27.621704784480954 ], [ 85.324300021693517, 27.621744561882192 ], [ 85.324242163655327, 27.621795991249471 ], [ 85.324219663307147, 27.621860277958568 ], [ 85.324190734288052, 27.621930993338573 ], [ 85.324171448275322, 27.622078852769498 ], [ 85.324123233243498, 27.622168854162233 ], [ 85.324078232547137, 27.622239569542241 ], [ 85.324033231850763, 27.62233278527043 ], [ 85.323975373812573, 27.622419572327711 ], [ 85.323845193226646, 27.622450912098412 ] ] ] } },
{ "type": "Feature", "properties": { "id": null, "type": "Gravel", "quality": "3" }, "geometry": { "type": "MultiLineString", "coordinates": [ [ [ 85.320889431806421, 27.621644268756633 ], [ 85.320760234773871, 27.621618399215588 ], [ 85.320644518697492, 27.621560541177402 ], [ 85.320544874298392, 27.62148661146194 ], [ 85.320467730247472, 27.621431967759207 ], [ 85.320393800532017, 27.621374109721021 ], [ 85.320281298791087, 27.621345180701926 ], [ 85.320204154740182, 27.62128732266374 ], [ 85.320146296701992, 27.621264822315556 ], [ 85.320053080973793, 27.621206964277366 ], [ 85.319969508251972, 27.621165177916453 ], [ 85.319857006511057, 27.621081605194629 ], [ 85.319808791479232, 27.621039818833708 ], [ 85.319702718409218, 27.620988389466433 ], [ 85.319619145687383, 27.620930531428243 ], [ 85.319513072617383, 27.620827672693689 ], [ 85.319468071921008, 27.620737671300951 ], [ 85.319307355148268, 27.620647669908216 ], [ 85.319255925780993, 27.620560882850935 ], [ 85.319198067742803, 27.620528739496386 ], [ 85.319137101267756, 27.620502077954235 ], [ 85.319095121797545, 27.62046648666427 ], [ 85.319012988051469, 27.620332334879027 ] ] ] } },
{ "type": "Feature", "properties": { "id": null, "type": "Concrete", "quality": "4" }, "geometry": { "type": "MultiLineString", "coordinates": [ [ [ 85.320698178846854, 27.622165526822926 ], [ 85.32068951939381, 27.622307874170634 ], [ 85.320702376735625, 27.62240430423428 ], [ 85.320702376735625, 27.622449304930647 ], [ 85.320708805406539, 27.622520020310652 ], [ 85.320721662748355, 27.622597164361572 ], [ 85.3207538061029, 27.622712880437945 ], [ 85.320760234773815, 27.622777167147042 ], [ 85.32077309211563, 27.622873597210688 ], [ 85.320789163792909, 27.622902526229783 ], [ 85.320805235470189, 27.623002170628883 ], [ 85.320808449805639, 27.623079314679799 ], [ 85.32081166414109, 27.623156458730715 ], [ 85.320837378824734, 27.623265746136184 ], [ 85.320847021831099, 27.623365390535284 ], [ 85.320863093508365, 27.623452177592565 ], [ 85.32087273651473, 27.623579947426894 ], [ 85.320937023223834, 27.623663520148721 ], [ 85.320994881262024, 27.623753521541456 ], [ 85.321043096293835, 27.623788879231459 ], [ 85.321139526357484, 27.62385638027601 ], [ 85.321203813066589, 27.623891737966016 ], [ 85.321316314807504, 27.623973703520122 ], [ 85.321419173542068, 27.62404763323558 ], [ 85.321544532624813, 27.624140848963773 ], [ 85.321695606391188, 27.62420513567287 ], [ 85.321766321771193, 27.624282279723786 ], [ 85.321766321771193, 27.624397995800162 ], [ 85.321713194553794, 27.624504000510093 ] ] ] } },
{ "type": "Feature", "properties": { "id": null, "type": "Gravel", "quality": "2" }, "geometry": { "type": "MultiLineString", "coordinates": [ [ [ 85.32081166414109, 27.623156458730715 ], [ 85.32067344771653, 27.623165566014507 ], [ 85.32056201742077, 27.62320199514966 ], [ 85.32047630180864, 27.623289853652093 ], [ 85.32041844377045, 27.623356283251493 ], [ 85.32037987174499, 27.623433427302409 ], [ 85.320328442377715, 27.623542714707874 ], [ 85.320279155900735, 27.623634858990915 ], [ 85.320242726765585, 27.623701288590315 ], [ 85.32019986895952, 27.62379128998305 ], [ 85.320146296701935, 27.623926292072156 ], [ 85.32010343889587, 27.624046293929137 ], [ 85.320062723980115, 27.624134152431569 ], [ 85.32001129461284, 27.624189867579453 ], [ 85.319979151258281, 27.624247725617639 ], [ 85.31992772189102, 27.624303440765527 ], [ 85.319865578072225, 27.624399870829173 ], [ 85.319762719337675, 27.624483443551 ], [ 85.31967271794494, 27.624522015576456 ], [ 85.3195848594425, 27.624528444247368 ] ] ] } },
{ "type": "Feature", "properties": { "id": null, "type": "Dirt", "quality": "2" }, "geometry": { "type": "MultiLineString", "coordinates": [ [ [ 85.3195848594425, 27.624528444247368 ], [ 85.319572002100685, 27.624452371641606 ], [ 85.3195184298431, 27.624349512907049 ], [ 85.319428428450365, 27.6242509399531 ], [ 85.31933199838673, 27.624139509657333 ], [ 85.31928056901944, 27.624090223180357 ], [ 85.319192710517015, 27.62401307912944 ], [ 85.31911128068549, 27.623880219930641 ], [ 85.319070565769721, 27.623766646744567 ], [ 85.319066279989116, 27.623672895293801 ], [ 85.319087708892155, 27.623587179681671 ], [ 85.31909413756307, 27.623499321179239 ], [ 85.31909413756307, 27.623385747993169 ], [ 85.319100566233971, 27.623296282323007 ], [ 85.3191198522467, 27.623225566943002 ], [ 85.3191198522467, 27.62314628000178 ], [ 85.31913913825943, 27.623077707512078 ], [ 85.31914128114974, 27.622985563229037 ], [ 85.319162710052765, 27.622921276519939 ], [ 85.31917771028489, 27.622829132236902 ], [ 85.319194853407311, 27.622719844831437 ], [ 85.31922699676187, 27.622623414767791 ], [ 85.319261283006711, 27.622526984704145 ], [ 85.319269854567935, 27.622443411982317 ], [ 85.31928056901944, 27.622319660067305 ], [ 85.319314855264295, 27.622186800868505 ], [ 85.319323426825505, 27.622111799707891 ], [ 85.319344855728545, 27.622056084560008 ], [ 85.319336284167335, 27.621966618889847 ], [ 85.31932342682552, 27.621865903045595 ], [ 85.319308426593395, 27.62175661564013 ], [ 85.319306283703085, 27.621651614015271 ], [ 85.319312712374, 27.621568041293443 ], [ 85.319297712141875, 27.621497325913438 ], [ 85.31930414081279, 27.621400895849792 ], [ 85.319306283703085, 27.621324823244027 ], [ 85.319327712606139, 27.621247679193104 ], [ 85.319336284167349, 27.621187678264612 ], [ 85.319359855960684, 27.621119105774909 ], [ 85.319389856424934, 27.620994818137319 ], [ 85.319437000011604, 27.620911245415495 ], [ 85.319513072617383, 27.620827672693689 ] ] ] } },
{ "type": "Feature", "properties": { "id": null, "type": "Gravel", "quality": "3" }, "geometry": { "type": "MultiLineString", "coordinates": [ [ [ 85.319969508251972, 27.621165177916453 ], [ 85.320029621308421, 27.621089790537219 ], [ 85.320066125195567, 27.621024083540362 ], [ 85.320113580248844, 27.620969327709652 ], [ 85.320157384913415, 27.620921872656364 ], [ 85.320186588023134, 27.620870767214367 ], [ 85.320226742298985, 27.62079775944008 ], [ 85.320255945408704, 27.620732052443223 ], [ 85.32026324618613, 27.620648093502798 ], [ 85.320292449295849, 27.620556833784942 ], [ 85.32033625396042, 27.620454622900944 ], [ 85.320394660179844, 27.620359712794372 ], [ 85.320442115233135, 27.620264802687803 ], [ 85.320510675945314, 27.620221121733909 ] ] ] } },
{ "type": "Feature", "properties": { "id": null, "type": "Gravel", "quality": "4" }, "geometry": { "type": "MultiLineString", "coordinates": [ [ [ 85.320393800532017, 27.621374109721021 ], [ 85.320369107458845, 27.621246757251932 ], [ 85.320380058624991, 27.621159147922789 ], [ 85.320412912123416, 27.621086140148506 ], [ 85.320464017565413, 27.62101313237422 ], [ 85.320507822229985, 27.620940124599937 ], [ 85.320515123007411, 27.62087441760308 ], [ 85.320540675728409, 27.62081236099494 ], [ 85.320562578060702, 27.620743003609366 ], [ 85.320584480392981, 27.620684597389939 ], [ 85.320610033113979, 27.620607939226939 ], [ 85.320646537001124, 27.620549533007512 ], [ 85.320697642443122, 27.620472874844513 ], [ 85.320750679659284, 27.620399249490376 ] ] ] } },
{ "type": "Feature", "properties": { "id": null, "type": "Gravel", "quality": "3" }, "geometry": { "type": "MultiLineString", "coordinates": [ [ [ 85.320544874298392, 27.62148661146194 ], [ 85.320599081947833, 27.621370870468215 ], [ 85.320646537001124, 27.621319765026215 ], [ 85.320693992054402, 27.621232155697076 ], [ 85.320734146330267, 27.621155497534076 ], [ 85.320777950994838, 27.621086140148506 ], [ 85.320796202938396, 27.620962026932222 ], [ 85.320836357214262, 27.620852515270794 ], [ 85.320883812267539, 27.620768556330365 ], [ 85.320913015377258, 27.62072840205451 ], [ 85.320945868875683, 27.620655394280224 ], [ 85.321000058518351, 27.62059800256602 ] ] ] } },
{ "type": "Feature", "properties": { "id": null, "type": "Concrete", "quality": "4" }, "geometry": { "type": "MultiLineString", "coordinates": [ [ [ 85.319648162598213, 27.61964783161244 ], [ 85.319582448690895, 27.61972637035246 ], [ 85.319524042471457, 27.619804853709816 ], [ 85.319461985863313, 27.619908889788171 ], [ 85.319399929255184, 27.619987373145527 ], [ 85.319363425368039, 27.62006220611417 ], [ 85.31919550748718, 27.620208221662743 ], [ 85.319012988051469, 27.620332334879027 ], [ 85.318837769393184, 27.620419944208166 ], [ 85.318618746070328, 27.620463748872737 ], [ 85.318501933631481, 27.620492951982452 ], [ 85.318392421970046, 27.620492951982452 ], [ 85.318268308753773, 27.620500252759882 ], [ 85.318063886985769, 27.620492951982452 ], [ 85.317852164440339, 27.620522155092168 ], [ 85.317713449669199, 27.620522155092168 ], [ 85.317472524014065, 27.620544057424453 ], [ 85.317282703800927, 27.620624365976166 ] ] ] } },
{ "type": "Feature", "properties": { "id": null, "type": "Gravel", "quality": "3" }, "geometry": { "type": "MultiLineString", "coordinates": [ [ [ 85.324875387739922, 27.622048718374622 ], [ 85.324682954321872, 27.622188557540237 ], [ 85.324515036441028, 27.622155704041809 ], [ 85.324405524779593, 27.622177606374095 ] ] ] } },
{ "type": "Feature", "properties": { "id": null, "type": "Gravel", "quality": "3" }, "geometry": { "type": "MultiLineString", "coordinates": [ [ [ 85.324682954321872, 27.622188557540237 ], [ 85.324657401600874, 27.622305369979092 ], [ 85.324617247325023, 27.622360125809806 ], [ 85.32459534499273, 27.622418532029233 ], [ 85.324562491494305, 27.622480588637377 ], [ 85.32452598760716, 27.622549946022946 ], [ 85.324435640486485, 27.62260378925648 ] ] ] } }
]
}
