{
  "type": "FeatureCollection",
  "generator": "overpass-ide",
  "copyright": "The data included in this document is from www.openstreetmap.org. The data is made available under ODbL.",
  "timestamp": "2020-12-22T11:08:02Z",
  "features": [
    {
      "type": "Feature",
      "properties": {
        "@id": "node/697284801",
        "leisure": "park",
        "name": "Rawdah Park"
      },
      "geometry": {
        "type": "Point",
        "coordinates": [
          46.7626727,
          24.7217683
        ]
      },
      "id": "node/697284801"
    },
    {
      "type": "Feature",
      "properties": {
        "@id": "node/2570569488",
        "leisure": "park",
        "name": "منتزه سد وادي نمار"
      },
      "geometry": {
        "type": "Point",
        "coordinates": [
          46.6829673,
          24.5730216
        ]
      },
      "id": "node/2570569488"
    },
    {
      "type": "Feature",
      "properties": {
        "@id": "node/3386289546",
        "leisure": "park"
      },
      "geometry": {
        "type": "Point",
        "coordinates": [
          46.6653635,
          24.5377545
        ]
      },
      "id": "node/3386289546"
    },
    {
      "type": "Feature",
      "properties": {
        "@id": "node/3394423867",
        "leisure": "park"
      },
      "geometry": {
        "type": "Point",
        "coordinates": [
          46.1246275,
          24.6053008
        ]
      },
      "id": "node/3394423867"
    },
    {
      "type": "Feature",
      "properties": {
        "@id": "node/3410005173",
        "leisure": "park"
      },
      "geometry": {
        "type": "Point",
        "coordinates": [
          46.7621668,
          24.7657116
        ]
      },
      "id": "node/3410005173"
    },
    {
      "type": "Feature",
      "properties": {
        "@id": "node/3410005797",
        "leisure": "park"
      },
      "geometry": {
        "type": "Point",
        "coordinates": [
          46.7539435,
          24.7596568
        ]
      },
      "id": "node/3410005797"
    },
    {
      "type": "Feature",
      "properties": {
        "@id": "node/3410325377",
        "leisure": "park"
      },
      "geometry": {
        "type": "Point",
        "coordinates": [
          46.7481483,
          24.7979782
        ]
      },
      "id": "node/3410325377"
    },
    {
      "type": "Feature",
      "properties": {
        "@id": "node/3412001820",
        "leisure": "park"
      },
      "geometry": {
        "type": "Point",
        "coordinates": [
          46.8064549,
          24.7086606
        ]
      },
      "id": "node/3412001820"
    },
    {
      "type": "Feature",
      "properties": {
        "@id": "node/3412001821",
        "leisure": "park"
      },
      "geometry": {
        "type": "Point",
        "coordinates": [
          46.8120913,
          24.7102648
        ]
      },
      "id": "node/3412001821"
    },
    {
      "type": "Feature",
      "properties": {
        "@id": "node/3412001825",
        "leisure": "park"
      },
      "geometry": {
        "type": "Point",
        "coordinates": [
          46.8147415,
          24.7131085
        ]
      },
      "id": "node/3412001825"
    },
    {
      "type": "Feature",
      "properties": {
        "@id": "node/3412009484",
        "leisure": "park"
      },
      "geometry": {
        "type": "Point",
        "coordinates": [
          46.8084904,
          24.70251
        ]
      },
      "id": "node/3412009484"
    },
    {
      "type": "Feature",
      "properties": {
        "@id": "node/3412009491",
        "leisure": "park"
      },
      "geometry": {
        "type": "Point",
        "coordinates": [
          46.8133617,
          24.704074
        ]
      },
      "id": "node/3412009491"
    },
    {
      "type": "Feature",
      "properties": {
        "@id": "node/3412009693",
        "leisure": "park"
      },
      "geometry": {
        "type": "Point",
        "coordinates": [
          46.8165798,
          24.6998262
        ]
      },
      "id": "node/3412009693"
    },
    {
      "type": "Feature",
      "properties": {
        "@id": "node/4509806989",
        "leisure": "park"
      },
      "geometry": {
        "type": "Point",
        "coordinates": [
          46.6780648,
          24.5987433
        ]
      },
      "id": "node/4509806989"
    },
    {
      "type": "Feature",
      "properties": {
        "@id": "node/5451982642",
        "leisure": "park"
      },
      "geometry": {
        "type": "Point",
        "coordinates": [
          46.7176885,
          24.5471483
        ]
      },
      "id": "node/5451982642"
    },
    {
      "type": "Feature",
      "properties": {
        "@id": "node/5451982912",
        "leisure": "park"
      },
      "geometry": {
        "type": "Point",
        "coordinates": [
          46.6992497,
          24.5686106
        ]
      },
      "id": "node/5451982912"
    },
    {
      "type": "Feature",
      "properties": {
        "@id": "node/6001451044",
        "leisure": "park"
      },
      "geometry": {
        "type": "Point",
        "coordinates": [
          46.7050685,
          24.7666222
        ]
      },
      "id": "node/6001451044"
    },
    {
      "type": "Feature",
      "properties": {
        "@id": "node/6001451056",
        "leisure": "park"
      },
      "geometry": {
        "type": "Point",
        "coordinates": [
          46.6703826,
          24.762764
        ]
      },
      "id": "node/6001451056"
    },
    {
      "type": "Feature",
      "properties": {
        "@id": "node/6001606810",
        "leisure": "park"
      },
      "geometry": {
        "type": "Point",
        "coordinates": [
          46.7732936,
          24.7589855
        ]
      },
      "id": "node/6001606810"
    },
    {
      "type": "Feature",
      "properties": {
        "@id": "node/6001606814",
        "leisure": "park"
      },
      "geometry": {
        "type": "Point",
        "coordinates": [
          46.7814852,
          24.7360612
        ]
      },
      "id": "node/6001606814"
    },
    {
      "type": "Feature",
      "properties": {
        "@id": "node/6001606915",
        "leisure": "park"
      },
      "geometry": {
        "type": "Point",
        "coordinates": [
          46.7568354,
          24.7417021
        ]
      },
      "id": "node/6001606915"
    },
    {
      "type": "Feature",
      "properties": {
        "@id": "node/6001607121",
        "leisure": "park"
      },
      "geometry": {
        "type": "Point",
        "coordinates": [
          46.7917016,
          24.6907236
        ]
      },
      "id": "node/6001607121"
    },
    {
      "type": "Feature",
      "properties": {
        "@id": "node/6001714049",
        "leisure": "park",
        "name": "AlRaja Park"
      },
      "geometry": {
        "type": "Point",
        "coordinates": [
          46.7659844,
          24.6976646
        ]
      },
      "id": "node/6001714049"
    },
    {
      "type": "Feature",
      "properties": {
        "@id": "node/6003937589",
        "leisure": "park"
      },
      "geometry": {
        "type": "Point",
        "coordinates": [
          46.6532104,
          24.5975952
        ]
      },
      "id": "node/6003937589"
    },
    {
      "type": "Feature",
      "properties": {
        "@id": "node/6003939583",
        "leisure": "park"
      },
      "geometry": {
        "type": "Point",
        "coordinates": [
          46.6631895,
          24.603262
        ]
      },
      "id": "node/6003939583"
    },
    {
      "type": "Feature",
      "properties": {
        "@id": "node/6003939662",
        "leisure": "park"
      },
      "geometry": {
        "type": "Point",
        "coordinates": [
          46.6656078,
          24.590319
        ]
      },
      "id": "node/6003939662"
    },
    {
      "type": "Feature",
      "properties": {
        "@id": "node/6004005599",
        "leisure": "park"
      },
      "geometry": {
        "type": "Point",
        "coordinates": [
          46.6152935,
          24.592377
        ]
      },
      "id": "node/6004005599"
    },
    {
      "type": "Feature",
      "properties": {
        "@id": "node/6004005638",
        "leisure": "park"
      },
      "geometry": {
        "type": "Point",
        "coordinates": [
          46.606827,
          24.5831606
        ]
      },
      "id": "node/6004005638"
    },
    {
      "type": "Feature",
      "properties": {
        "@id": "node/6004005662",
        "leisure": "park"
      },
      "geometry": {
        "type": "Point",
        "coordinates": [
          46.624291,
          24.5787866
        ]
      },
      "id": "node/6004005662"
    },
    {
      "type": "Feature",
      "properties": {
        "@id": "node/6004005733",
        "leisure": "park"
      },
      "geometry": {
        "type": "Point",
        "coordinates": [
          46.6451537,
          24.5765789
        ]
      },
      "id": "node/6004005733"
    },
    {
      "type": "Feature",
      "properties": {
        "@id": "node/6017753643",
        "leisure": "park"
      },
      "geometry": {
        "type": "Point",
        "coordinates": [
          46.7548874,
          24.6175478
        ]
      },
      "id": "node/6017753643"
    },
    {
      "type": "Feature",
      "properties": {
        "@id": "node/7022872971",
        "leisure": "park",
        "name": "حديقة النهضة"
      },
      "geometry": {
        "type": "Point",
        "coordinates": [
          46.7511414,
          24.6956092
        ]
      },
      "id": "node/7022872971"
    },
    {
      "type": "Feature",
      "properties": {
        "@id": "node/7274025096",
        "leisure": "park"
      },
      "geometry": {
        "type": "Point",
        "coordinates": [
          46.2806398,
          24.5801975
        ]
      },
      "id": "node/7274025096"
    },
    {
      "type": "Feature",
      "properties": {
        "@id": "node/7329276852",
        "leisure": "park",
        "name": "مهرجان الملك عبدالعزيز للإبل"
      },
      "geometry": {
        "type": "Point",
        "coordinates": [
          46.8234,
          25.6411
        ]
      },
      "id": "node/7329276852"
    },
    {
      "type": "Feature",
      "properties": {
        "@id": "node/7334284813",
        "leisure": "park",
        "name": "منتزة الثمامة البري"
      },
      "geometry": {
        "type": "Point",
        "coordinates": [
          46.6501,
          25.1542
        ]
      },
      "id": "node/7334284813"
    },
    {
      "type": "Feature",
      "properties": {
        "@id": "node/7832546922",
        "leisure": "park"
      },
      "geometry": {
        "type": "Point",
        "coordinates": [
          46.677242,
          24.7108524
        ]
      },
      "id": "node/7832546922"
    },
    {
      "type": "Feature",
      "properties": {
        "@id": "node/7906706474",
        "leisure": "park",
        "name": "Diriyyah Park حديقة الدرعية"
      },
      "geometry": {
        "type": "Point",
        "coordinates": [
          46.5732065,
          24.7379379
        ]
      },
      "id": "node/7906706474"
    },
    {
      "type": "Feature",
      "properties": {
        "@id": "node/7906706476",
        "leisure": "park",
        "name": "حديقة منتزه البجيري"
      },
      "geometry": {
        "type": "Point",
        "coordinates": [
          46.573269,
          24.7387948
        ]
      },
      "id": "node/7906706476"
    },
    {
      "type": "Feature",
      "properties": {
        "@id": "node/8069529889",
        "addr:street": "شارع حلب",
        "leisure": "park",
        "name": "حديقة لبن",
        "opening_hours": "24/7"
      },
      "geometry": {
        "type": "Point",
        "coordinates": [
          46.5542958,
          24.6368017
        ]
      },
      "id": "node/8069529889"
    }
  ]
}
