{
  "type": "FeatureCollection",
  "generator": "overpass-ide",
  "copyright": "The data included in this document is from www.openstreetmap.org. The data is made available under ODbL.",
  "timestamp": "2020-12-22T10:48:03Z",
  "features": [
    {
      "type": "Feature",
      "properties": {
        "@id": "node/672612225",
        "addr:street": "Tahliya St.",
        "amenity": "hospital",
        "name": "Al Nokhba Clinics",
        "wheelchair": "yes"
      },
      "geometry": {
        "type": "Point",
        "coordinates": [
          46.6899776,
          24.6994716
        ]
      },
      "id": "node/672612225"
    },
    {
      "type": "Feature",
      "properties": {
        "@id": "node/672727262",
        "amenity": "hospital",
        "emergency": "yes",
        "name": "المستشفي الوطني",
        "name:ar": "المستشفى الوطني رعايه",
        "name:en": "National Hospital (1,398 patient )",
        "phone": "920004585"
      },
      "geometry": {
        "type": "Point",
        "coordinates": [
          46.7270653,
          24.6793946
        ]
      },
      "id": "node/672727262"
    },
    {
      "type": "Feature",
      "properties": {
        "@id": "node/746341536",
        "amenity": "hospital"
      },
      "geometry": {
        "type": "Point",
        "coordinates": [
          46.7972478,
          24.68704
        ]
      },
      "id": "node/746341536"
    },
    {
      "type": "Feature",
      "properties": {
        "@id": "node/978265130",
        "addr:street": "Al Imam Abdullah Bin Saud Bin Abdulaziz",
        "amenity": "hospital",
        "healthcare": "hospital",
        "internet_access": "wlan",
        "name": "مستشفى أبانمي",
        "name:ar": "مستشفى أستر سند",
        "name:en": "Aster Sanad Hospital",
        "opening_hours": "24/7",
        "phone": "0112407778",
        "website": "http://www.sanadhospital.com"
      },
      "geometry": {
        "type": "Point",
        "coordinates": [
          46.7395065,
          24.77919
        ]
      },
      "id": "node/978265130"
    },
    {
      "type": "Feature",
      "properties": {
        "@id": "node/1236703743",
        "GNS:dsg_code": "CTRM",
        "GNS:dsg_name": "medical center",
        "GNS:id": "9165935",
        "alt_name": "King Fahd Medical City",
        "amenity": "hospital",
        "int_name": "Madīnat al Malik Fahd aţ Ţibbīyah",
        "name": "مدينة الملك فهد الطبية",
        "name:ar": "مدينة الملك فهد الطبية",
        "name:de": "Madinat al Malik Fahd at Tibbiyah",
        "name:en": "Madinat al Malik Fahd at Tibbiyah",
        "name:fr": "Madinat al Malik Fahd at Tibbiyah"
      },
      "geometry": {
        "type": "Point",
        "coordinates": [
          46.7066341,
          24.686732
        ]
      },
      "id": "node/1236703743"
    },
    {
      "type": "Feature",
      "properties": {
        "@id": "node/1242612369",
        "amenity": "hospital"
      },
      "geometry": {
        "type": "Point",
        "coordinates": [
          46.9211311,
          24.820636
        ]
      },
      "id": "node/1242612369"
    },
    {
      "type": "Feature",
      "properties": {
        "@id": "node/1267900197",
        "amenity": "hospital",
        "emergency": "yes",
        "name": "Dallah Hospital مستشفى الدالة",
        "name:ar": "Dallah Hospital مستشفى دلة",
        "name:en": "Dallah Hospital مستشفى دلة"
      },
      "geometry": {
        "type": "Point",
        "coordinates": [
          46.6518327,
          24.7466763
        ]
      },
      "id": "node/1267900197"
    },
    {
      "type": "Feature",
      "properties": {
        "@id": "node/1354660020",
        "amenity": "hospital"
      },
      "geometry": {
        "type": "Point",
        "coordinates": [
          46.864015,
          24.5833126
        ]
      },
      "id": "node/1354660020"
    },
    {
      "type": "Feature",
      "properties": {
        "@id": "node/2429936983",
        "amenity": "hospital",
        "emergency": "no",
        "internet_access": "wlan",
        "name": "Alam El Teb",
        "name:ar": "مستوصف عالم الطب"
      },
      "geometry": {
        "type": "Point",
        "coordinates": [
          46.7330847,
          24.6712998
        ]
      },
      "id": "node/2429936983"
    },
    {
      "type": "Feature",
      "properties": {
        "@id": "node/2429936997",
        "amenity": "hospital",
        "name": "Obied hospital",
        "name:ar": "مستشفى عبيد التخصصي"
      },
      "geometry": {
        "type": "Point",
        "coordinates": [
          46.7227958,
          24.6669612
        ]
      },
      "id": "node/2429936997"
    },
    {
      "type": "Feature",
      "properties": {
        "@id": "node/2930726644",
        "amenity": "hospital",
        "emergency": "yes",
        "name": "KAL Medical Development Foundation"
      },
      "geometry": {
        "type": "Point",
        "coordinates": [
          46.6785028,
          24.69339
        ]
      },
      "id": "node/2930726644"
    },
    {
      "type": "Feature",
      "properties": {
        "@id": "node/3631527750",
        "addr:city": "Riyadh",
        "addr:housenumber": "An Nuzhah",
        "addr:postcode": "12471",
        "addr:street": "Abi Bakr As Siddiq Rd",
        "amenity": "hospital",
        "name": "Dr Soliman Al-Kharashi Medical Center",
        "operator": "Dr Soliman Al-Kharashi",
        "phone": "+966112222822",
        "website": "http://www.drsolimanalkharashi.com.sa/"
      },
      "geometry": {
        "type": "Point",
        "coordinates": [
          46.6999612,
          24.7512906
        ]
      },
      "id": "node/3631527750"
    },
    {
      "type": "Feature",
      "properties": {
        "@id": "node/3835882185",
        "amenity": "hospital"
      },
      "geometry": {
        "type": "Point",
        "coordinates": [
          46.783275,
          24.7998013
        ]
      },
      "id": "node/3835882185"
    },
    {
      "type": "Feature",
      "properties": {
        "@id": "node/3856703650",
        "addr:street": "شارع الإمام عبد الله بن سعود بن عبد العزيز",
        "amenity": "hospital",
        "name": "فال العافية"
      },
      "geometry": {
        "type": "Point",
        "coordinates": [
          46.7819482,
          24.7983522
        ]
      },
      "id": "node/3856703650"
    },
    {
      "type": "Feature",
      "properties": {
        "@id": "node/4129960497",
        "addr:street": "شارع الأمير محمد بن عبد الرحمن",
        "amenity": "hospital",
        "name": "مجمع طب الاسرة 2"
      },
      "geometry": {
        "type": "Point",
        "coordinates": [
          46.7280761,
          24.6100189
        ]
      },
      "id": "node/4129960497"
    },
    {
      "type": "Feature",
      "properties": {
        "@id": "node/4222319390",
        "amenity": "hospital"
      },
      "geometry": {
        "type": "Point",
        "coordinates": [
          46.7020164,
          24.6018367
        ]
      },
      "id": "node/4222319390"
    },
    {
      "type": "Feature",
      "properties": {
        "@id": "node/4222647492",
        "amenity": "hospital",
        "name": "مستشفى المبارك",
        "name:en": "Mubarak hospital"
      },
      "geometry": {
        "type": "Point",
        "coordinates": [
          46.706969,
          24.6566664
        ]
      },
      "id": "node/4222647492"
    },
    {
      "type": "Feature",
      "properties": {
        "@id": "node/4227738192",
        "amenity": "hospital",
        "name": "مجمع عيادات اللوتس"
      },
      "geometry": {
        "type": "Point",
        "coordinates": [
          46.7947663,
          24.80364
        ]
      },
      "id": "node/4227738192"
    },
    {
      "type": "Feature",
      "properties": {
        "@id": "node/4227738390",
        "amenity": "hospital",
        "name": "مستوصف اليرموك"
      },
      "geometry": {
        "type": "Point",
        "coordinates": [
          46.7908317,
          24.8103493
        ]
      },
      "id": "node/4227738390"
    },
    {
      "type": "Feature",
      "properties": {
        "@id": "node/4227753689",
        "amenity": "hospital",
        "name": "الفارابي"
      },
      "geometry": {
        "type": "Point",
        "coordinates": [
          46.8019821,
          24.78625
        ]
      },
      "id": "node/4227753689"
    },
    {
      "type": "Feature",
      "properties": {
        "@id": "node/4239906094",
        "addr:street": "Omer bin AbdulAziz",
        "amenity": "hospital",
        "name": "Hayat National Hospital"
      },
      "geometry": {
        "type": "Point",
        "coordinates": [
          46.7727851,
          24.6940156
        ]
      },
      "id": "node/4239906094"
    },
    {
      "type": "Feature",
      "properties": {
        "@id": "node/4243601659",
        "amenity": "hospital",
        "name": "SMC"
      },
      "geometry": {
        "type": "Point",
        "coordinates": [
          46.6866873,
          24.6794458
        ]
      },
      "id": "node/4243601659"
    },
    {
      "type": "Feature",
      "properties": {
        "@id": "node/4244291528",
        "addr:street": "شارع غبيرة العام",
        "amenity": "hospital",
        "name": "مستشفى الفلاح"
      },
      "geometry": {
        "type": "Point",
        "coordinates": [
          46.7292391,
          24.6191751
        ]
      },
      "id": "node/4244291528"
    },
    {
      "type": "Feature",
      "properties": {
        "@id": "node/4300430789",
        "amenity": "hospital",
        "name": "Hammadi suwadi",
        "name:en": "Hammadi suwadi (5 patient )"
      },
      "geometry": {
        "type": "Point",
        "coordinates": [
          46.7030747,
          24.6022144
        ]
      },
      "id": "node/4300430789"
    },
    {
      "type": "Feature",
      "properties": {
        "@id": "node/4325375298",
        "amenity": "hospital",
        "name": "مستوصف حكومي"
      },
      "geometry": {
        "type": "Point",
        "coordinates": [
          46.5904055,
          24.7779808
        ]
      },
      "id": "node/4325375298"
    },
    {
      "type": "Feature",
      "properties": {
        "@id": "node/4351353190",
        "amenity": "hospital",
        "name": "Olaya Medical Center"
      },
      "geometry": {
        "type": "Point",
        "coordinates": [
          46.6998164,
          24.7011303
        ]
      },
      "id": "node/4351353190"
    },
    {
      "type": "Feature",
      "properties": {
        "@id": "node/4378219310",
        "amenity": "hospital",
        "name": "مستوصف الحاير",
        "name:ar": "مستوصف الحاير",
        "opening_hours": "Su-Th"
      },
      "geometry": {
        "type": "Point",
        "coordinates": [
          46.8351733,
          24.4009602
        ]
      },
      "id": "node/4378219310"
    },
    {
      "type": "Feature",
      "properties": {
        "@id": "node/4385410790",
        "amenity": "hospital",
        "name": "المجمع الطبي"
      },
      "geometry": {
        "type": "Point",
        "coordinates": [
          46.661891,
          24.6755467
        ]
      },
      "id": "node/4385410790"
    },
    {
      "type": "Feature",
      "properties": {
        "@id": "node/4397361589",
        "addr:street": "Abi Saeed Al Khidri",
        "amenity": "hospital",
        "healthcare": "hospital",
        "name": "الرعايه الأوليه. حي الخليج",
        "name:ar": "الرعايه الأوليه. حي الخليج"
      },
      "geometry": {
        "type": "Point",
        "coordinates": [
          46.7898996,
          24.7682894
        ]
      },
      "id": "node/4397361589"
    },
    {
      "type": "Feature",
      "properties": {
        "@id": "node/4413247390",
        "addr:street": "Derab Road",
        "amenity": "hospital",
        "name": "الامام عبد الرحمن الفيصل",
        "name:ar": "الامام عبد الرحمن الفيصل"
      },
      "geometry": {
        "type": "Point",
        "coordinates": [
          46.6527136,
          24.5288033
        ]
      },
      "id": "node/4413247390"
    },
    {
      "type": "Feature",
      "properties": {
        "@id": "node/4518646789",
        "amenity": "hospital",
        "name": "مستشفى الشميسي",
        "name:en": "King Saud Medical City"
      },
      "geometry": {
        "type": "Point",
        "coordinates": [
          46.6903989,
          24.6278072
        ]
      },
      "id": "node/4518646789"
    },
    {
      "type": "Feature",
      "properties": {
        "@id": "node/4525669790",
        "amenity": "hospital",
        "name": "مركز الملك فهد الوطني لسرطان الاطفال",
        "name:ar": "مركز الملك فهد الوطني لسرطان الاطفال"
      },
      "geometry": {
        "type": "Point",
        "coordinates": [
          46.6921323,
          24.8287332
        ]
      },
      "id": "node/4525669790"
    },
    {
      "type": "Feature",
      "properties": {
        "@id": "node/4547239097",
        "addr:street": "Ali Ibn Talib Road",
        "amenity": "hospital",
        "name:en": "Al Ajaj Polyclinic (58 patient )"
      },
      "geometry": {
        "type": "Point",
        "coordinates": [
          46.7463366,
          24.6723908
        ]
      },
      "id": "node/4547239097"
    },
    {
      "type": "Feature",
      "properties": {
        "@id": "node/4547254891",
        "amenity": "hospital",
        "name:en": "Dallah hospital (20,586 patient )"
      },
      "geometry": {
        "type": "Point",
        "coordinates": [
          46.7104187,
          24.6326975
        ]
      },
      "id": "node/4547254891"
    },
    {
      "type": "Feature",
      "properties": {
        "@id": "node/4576041993",
        "amenity": "hospital",
        "name": "مستوصف حراء الطبي",
        "opening_hours": "24/7"
      },
      "geometry": {
        "type": "Point",
        "coordinates": [
          46.7029077,
          24.6035617
        ]
      },
      "id": "node/4576041993"
    },
    {
      "type": "Feature",
      "properties": {
        "@id": "node/4681231793",
        "amenity": "hospital"
      },
      "geometry": {
        "type": "Point",
        "coordinates": [
          46.7171387,
          24.6640318
        ]
      },
      "id": "node/4681231793"
    },
    {
      "type": "Feature",
      "properties": {
        "@id": "node/4691206490",
        "addr:street": "King Khalid Road",
        "amenity": "hospital",
        "name": "Dc 41",
        "name:ar": "Dc 41"
      },
      "geometry": {
        "type": "Point",
        "coordinates": [
          46.6213305,
          24.713169
        ]
      },
      "id": "node/4691206490"
    },
    {
      "type": "Feature",
      "properties": {
        "@id": "node/4693900090",
        "addr:street": "شارع البردة",
        "amenity": "hospital",
        "internet_access": "wlan",
        "name": "مركز الصحي عسير",
        "opening_hours": "Sa-Th"
      },
      "geometry": {
        "type": "Point",
        "coordinates": [
          46.698579,
          24.6138392
        ]
      },
      "id": "node/4693900090"
    },
    {
      "type": "Feature",
      "properties": {
        "@id": "node/4781746022",
        "amenity": "hospital",
        "name": "مركز صحي",
        "name:ar": "مركز صحي",
        "name:en": "Markz sahe"
      },
      "geometry": {
        "type": "Point",
        "coordinates": [
          46.5402127,
          24.5623363
        ]
      },
      "id": "node/4781746022"
    },
    {
      "type": "Feature",
      "properties": {
        "@id": "node/4883439121",
        "addr:street": "شارع ال عباد",
        "amenity": "hospital",
        "name": "مستوصف الخليجي الطبي بشبرا",
        "name:ar": "مستوصف الخليجي الطبي بشبرا"
      },
      "geometry": {
        "type": "Point",
        "coordinates": [
          46.6798455,
          24.5859269
        ]
      },
      "id": "node/4883439121"
    },
    {
      "type": "Feature",
      "properties": {
        "@id": "node/5021592921",
        "amenity": "hospital",
        "name": "مستشفي عناية العائلة",
        "name:ar": "مستشفي عناية العائلة",
        "name:en": "family care hospital"
      },
      "geometry": {
        "type": "Point",
        "coordinates": [
          46.8715477,
          24.8009724
        ]
      },
      "id": "node/5021592921"
    },
    {
      "type": "Feature",
      "properties": {
        "@id": "node/5263321422",
        "addr:postcode": "11433",
        "addr:street": "شارع الإمام الشافعي",
        "amenity": "hospital",
        "name": "مستشفى السلام",
        "name:en": "Al Salam Hospital",
        "opening_hours": "24/7",
        "phone": "+9662222211"
      },
      "geometry": {
        "type": "Point",
        "coordinates": [
          46.8017677,
          24.7037444
        ]
      },
      "id": "node/5263321422"
    },
    {
      "type": "Feature",
      "properties": {
        "@id": "node/6168993898",
        "addr:street": "شارع الجامعة",
        "amenity": "hospital",
        "name": "مسشفى الملك عبدالعزيز الجامعي حي الملز"
      },
      "geometry": {
        "type": "Point",
        "coordinates": [
          46.7202753,
          24.6620523
        ]
      },
      "id": "node/6168993898"
    },
    {
      "type": "Feature",
      "properties": {
        "@id": "node/6239194585",
        "amenity": "hospital"
      },
      "geometry": {
        "type": "Point",
        "coordinates": [
          46.8312954,
          24.746033
        ]
      },
      "id": "node/6239194585"
    },
    {
      "type": "Feature",
      "properties": {
        "@id": "node/6292916668",
        "amenity": "hospital",
        "healthcare": "hospital",
        "name": "الطوارئ"
      },
      "geometry": {
        "type": "Point",
        "coordinates": [
          46.6781378,
          24.6708929
        ]
      },
      "id": "node/6292916668"
    },
    {
      "type": "Feature",
      "properties": {
        "@id": "node/6591379354",
        "amenity": "hospital",
        "description": "مستشفى الدكتور سليمان الحبيب - فرع الريان",
        "healthcare": "hospital",
        "name": "مستشفى د.سليمان الحبيب",
        "name:en": "Dr. Sulaiman Al Habib Hospital",
        "phone": "+966 11 490 9999",
        "url": "hmg.com.sa"
      },
      "geometry": {
        "type": "Point",
        "coordinates": [
          46.7749475,
          24.7211092
        ]
      },
      "id": "node/6591379354"
    },
    {
      "type": "Feature",
      "properties": {
        "@id": "node/6591379355",
        "amenity": "hospital",
        "healthcare": "hospital",
        "name": "مستشفى د.سليمان الحبيب",
        "name:en": "Dr. Sulaiman Al Habib Hospital",
        "phone": "+966 11 283 3333",
        "url": "hmg.com.sa"
      },
      "geometry": {
        "type": "Point",
        "coordinates": [
          46.6569223,
          24.7191157
        ]
      },
      "id": "node/6591379355"
    },
    {
      "type": "Feature",
      "properties": {
        "@id": "node/6591379373",
        "amenity": "hospital",
        "description": "مستشفى الدكتور سليمان الحبيب - فرع السويدي",
        "healthcare": "hospital",
        "name": "مستشفى د.سليمان الحبيب",
        "name:en": "Dr. Sulaiman Al Habib Hospital",
        "phone": "+966 11 475 4444",
        "url": "hmg.com.sa"
      },
      "geometry": {
        "type": "Point",
        "coordinates": [
          46.6408727,
          24.5672549
        ]
      },
      "id": "node/6591379373"
    },
    {
      "type": "Feature",
      "properties": {
        "@id": "node/6591379374",
        "amenity": "hospital",
        "description": "مستشفى الدكتور سليمان الحبيب - فرع العليا",
        "healthcare": "hospital",
        "name": "مستشفى د.سليمان الحبيب",
        "name:en": "Dr. Sulaiman Al Habib Hospital",
        "phone": "+966 11 525 9999",
        "url": "hmg.com.sa"
      },
      "geometry": {
        "type": "Point",
        "coordinates": [
          46.6766773,
          24.7043587
        ]
      },
      "id": "node/6591379374"
    },
    {
      "type": "Feature",
      "properties": {
        "@id": "node/6685537807",
        "amenity": "hospital",
        "healthcare": "hospital",
        "name": "مبنى العيادات الخارجية"
      },
      "geometry": {
        "type": "Point",
        "coordinates": [
          46.6775189,
          24.6714995
        ]
      },
      "id": "node/6685537807"
    },
    {
      "type": "Feature",
      "properties": {
        "@id": "node/6685537808",
        "amenity": "hospital",
        "healthcare": "hospital",
        "name": "مبنى عيادة الأورام"
      },
      "geometry": {
        "type": "Point",
        "coordinates": [
          46.6767299,
          24.6718644
        ]
      },
      "id": "node/6685537808"
    },
    {
      "type": "Feature",
      "properties": {
        "@id": "node/6685537809",
        "amenity": "hospital",
        "healthcare": "hospital",
        "name": "مركز الأبحاث"
      },
      "geometry": {
        "type": "Point",
        "coordinates": [
          46.6764375,
          24.6722421
        ]
      },
      "id": "node/6685537809"
    },
    {
      "type": "Feature",
      "properties": {
        "@id": "node/6685537810",
        "amenity": "hospital",
        "healthcare": "hospital",
        "name": "البرج الشمالي"
      },
      "geometry": {
        "type": "Point",
        "coordinates": [
          46.6753844,
          24.671922
        ]
      },
      "id": "node/6685537810"
    },
    {
      "type": "Feature",
      "properties": {
        "@id": "node/6685537811",
        "amenity": "hospital",
        "healthcare": "hospital",
        "name": "بنك الدم"
      },
      "geometry": {
        "type": "Point",
        "coordinates": [
          46.6765256,
          24.6704529
        ]
      },
      "id": "node/6685537811"
    },
    {
      "type": "Feature",
      "properties": {
        "@id": "node/6685537812",
        "amenity": "hospital",
        "healthcare": "hospital",
        "name": "المدخل الرئيسي"
      },
      "geometry": {
        "type": "Point",
        "coordinates": [
          46.6773498,
          24.6696879
        ]
      },
      "id": "node/6685537812"
    },
    {
      "type": "Feature",
      "properties": {
        "@id": "node/6783657385",
        "amenity": "hospital",
        "name": "مستشفى الدارة",
        "name:en": "Al Dara Hospital"
      },
      "geometry": {
        "type": "Point",
        "coordinates": [
          46.6832163,
          24.663358
        ]
      },
      "id": "node/6783657385"
    },
    {
      "type": "Feature",
      "properties": {
        "@id": "node/6834328901",
        "amenity": "hospital",
        "designation": "general",
        "emergency": "yes",
        "name": "alhabib hospital",
        "source": "Bing"
      },
      "geometry": {
        "type": "Point",
        "coordinates": [
          46.5873739,
          24.8629022
        ]
      },
      "id": "node/6834328901"
    },
    {
      "type": "Feature",
      "properties": {
        "@id": "node/6953249575",
        "addr:city": "الرياض",
        "addr:housenumber": "حي الربوة",
        "addr:postcode": "12883",
        "addr:street": "شارع صلاح الدين الأيوبي",
        "amenity": "hospital",
        "emergency": "yes",
        "healthcare": "hospital",
        "healthcare:speciality": "dentist",
        "name": "صفوة المهيدب - فرع الربوة",
        "operator": "صفوة المهيدب - فرع الربوة",
        "operator:type": "business",
        "phone": "+966536536366"
      },
      "geometry": {
        "type": "Point",
        "coordinates": [
          46.7760564,
          24.6788288
        ]
      },
      "id": "node/6953249575"
    },
    {
      "type": "Feature",
      "properties": {
        "@id": "node/7011337045",
        "addr:street": "الزبير بن العوام",
        "amenity": "hospital",
        "name": "عيادات سما"
      },
      "geometry": {
        "type": "Point",
        "coordinates": [
          46.7902221,
          24.6944418
        ]
      },
      "id": "node/7011337045"
    },
    {
      "type": "Feature",
      "properties": {
        "@id": "node/7022884871",
        "amenity": "hospital",
        "name": "مستوصف الطب الحديث"
      },
      "geometry": {
        "type": "Point",
        "coordinates": [
          46.7664237,
          24.6859304
        ]
      },
      "id": "node/7022884871"
    },
    {
      "type": "Feature",
      "properties": {
        "@id": "node/7217806920",
        "amenity": "hospital",
        "emergency": "yes"
      },
      "geometry": {
        "type": "Point",
        "coordinates": [
          46.6980459,
          24.7445982
        ]
      },
      "id": "node/7217806920"
    },
    {
      "type": "Feature",
      "properties": {
        "@id": "node/7440135188",
        "amenity": "hospital",
        "name": "مستشفى حريملاء العام"
      },
      "geometry": {
        "type": "Point",
        "coordinates": [
          46.1102,
          25.1136
        ]
      },
      "id": "node/7440135188"
    },
    {
      "type": "Feature",
      "properties": {
        "@id": "node/8093059683",
        "addr:city": "الرياض",
        "addr:street": "علي بن شيبان",
        "amenity": "hospital",
        "email": "namarmedicalcomplex.marketing@gmail.com",
        "emergency": "yes",
        "healthcare": "hospital",
        "healthcare:speciality": "clinics;مستشفى;gynaecology;نسائية_و_ولادة;عيادات;specialist_pediatrician;internist",
        "image": "https://static.wixstatic.com/media/1e494d_3db7bd1f49624dd881033d59b33f6e69f000.jpg/v1/fill/w_521,h_296,al_c,q_80,usm_0.33_1.00_0.00/1e494d_3db7bd1f49624dd881033d59b33f6e69f000.webp",
        "name": "NAMAR MEDICAL COMPLEX",
        "operator": "NAMAR",
        "operator:type": "public",
        "phone": "00966550909684",
        "website": "https://namarmedicalcomple.wixsite.com/namarmedicalcomplex"
      },
      "geometry": {
        "type": "Point",
        "coordinates": [
          46.5850458,
          24.5600138
        ]
      },
      "id": "node/8093059683"
    }
  ]
}
