{
  "type": "FeatureCollection",
  "generator": "overpass-ide",
  "copyright": "The data included in this document is from www.openstreetmap.org. The data is made available under ODbL.",
  "timestamp": "2020-12-22T11:24:02Z",
  "features": [
    {
      "type": "Feature",
      "properties": {
        "@id": "node/1128199393",
        "amenity": "parking"
      },
      "geometry": {
        "type": "Point",
        "coordinates": [
          50.2212337,
          26.2890733
        ]
      },
      "id": "node/1128199393"
    },
    {
      "type": "Feature",
      "properties": {
        "@id": "node/1128199396",
        "amenity": "parking"
      },
      "geometry": {
        "type": "Point",
        "coordinates": [
          50.2219229,
          26.2848932
        ]
      },
      "id": "node/1128199396"
    },
    {
      "type": "Feature",
      "properties": {
        "@id": "node/1128199405",
        "amenity": "parking"
      },
      "geometry": {
        "type": "Point",
        "coordinates": [
          50.2182751,
          26.2832579
        ]
      },
      "id": "node/1128199405"
    },
    {
      "type": "Feature",
      "properties": {
        "@id": "node/1128275568",
        "amenity": "parking"
      },
      "geometry": {
        "type": "Point",
        "coordinates": [
          50.220334,
          26.2891787
        ]
      },
      "id": "node/1128275568"
    },
    {
      "type": "Feature",
      "properties": {
        "@id": "node/1128492072",
        "amenity": "parking"
      },
      "geometry": {
        "type": "Point",
        "coordinates": [
          50.2224583,
          26.29722
        ]
      },
      "id": "node/1128492072"
    },
    {
      "type": "Feature",
      "properties": {
        "@id": "node/1305616943",
        "amenity": "parking"
      },
      "geometry": {
        "type": "Point",
        "coordinates": [
          50.0815651,
          26.4486901
        ]
      },
      "id": "node/1305616943"
    },
    {
      "type": "Feature",
      "properties": {
        "@id": "node/1332225013",
        "amenity": "parking"
      },
      "geometry": {
        "type": "Point",
        "coordinates": [
          50.0855155,
          26.4761999
        ]
      },
      "id": "node/1332225013"
    },
    {
      "type": "Feature",
      "properties": {
        "@id": "node/1332225020",
        "amenity": "parking"
      },
      "geometry": {
        "type": "Point",
        "coordinates": [
          50.0856871,
          26.4735108
        ]
      },
      "id": "node/1332225020"
    },
    {
      "type": "Feature",
      "properties": {
        "@id": "node/1768317665",
        "amenity": "parking",
        "name": "Al Rashed car park",
        "parking": "multi-storey",
        "source": "field observation 28 may 2012"
      },
      "geometry": {
        "type": "Point",
        "coordinates": [
          50.1796346,
          26.2924972
        ]
      },
      "id": "node/1768317665"
    },
    {
      "type": "Feature",
      "properties": {
        "@id": "node/1768317669",
        "amenity": "parking",
        "name": "Carrefour car park",
        "parking": "garage",
        "source": "field observation 28 may 2012"
      },
      "geometry": {
        "type": "Point",
        "coordinates": [
          50.1807821,
          26.2927333
        ]
      },
      "id": "node/1768317669"
    },
    {
      "type": "Feature",
      "properties": {
        "@id": "node/2054089712",
        "amenity": "parking"
      },
      "geometry": {
        "type": "Point",
        "coordinates": [
          50.0221935,
          26.3222416
        ]
      },
      "id": "node/2054089712"
    },
    {
      "type": "Feature",
      "properties": {
        "@id": "node/2141539561",
        "amenity": "parking",
        "name": "Ad Diwan car park"
      },
      "geometry": {
        "type": "Point",
        "coordinates": [
          50.1304973,
          26.3034973
        ]
      },
      "id": "node/2141539561"
    },
    {
      "type": "Feature",
      "properties": {
        "@id": "node/2141551637",
        "amenity": "parking"
      },
      "geometry": {
        "type": "Point",
        "coordinates": [
          50.1277507,
          26.3093088
        ]
      },
      "id": "node/2141551637"
    },
    {
      "type": "Feature",
      "properties": {
        "@id": "node/2141551840",
        "amenity": "parking"
      },
      "geometry": {
        "type": "Point",
        "coordinates": [
          50.1275737,
          26.3087991
        ]
      },
      "id": "node/2141551840"
    },
    {
      "type": "Feature",
      "properties": {
        "@id": "node/2141558561",
        "amenity": "parking"
      },
      "geometry": {
        "type": "Point",
        "coordinates": [
          50.1293493,
          26.3074767
        ]
      },
      "id": "node/2141558561"
    },
    {
      "type": "Feature",
      "properties": {
        "@id": "node/2141559076",
        "amenity": "parking"
      },
      "geometry": {
        "type": "Point",
        "coordinates": [
          50.1320959,
          26.3092703
        ]
      },
      "id": "node/2141559076"
    },
    {
      "type": "Feature",
      "properties": {
        "@id": "node/2141559737",
        "amenity": "parking",
        "name": "Company vehicle / U-Drive reserved parking"
      },
      "geometry": {
        "type": "Point",
        "coordinates": [
          50.129816,
          26.3110448
        ]
      },
      "id": "node/2141559737"
    },
    {
      "type": "Feature",
      "properties": {
        "@id": "node/2141571014",
        "amenity": "parking"
      },
      "geometry": {
        "type": "Point",
        "coordinates": [
          50.1366771,
          26.3156898
        ]
      },
      "id": "node/2141571014"
    },
    {
      "type": "Feature",
      "properties": {
        "@id": "node/2141576517",
        "amenity": "parking"
      },
      "geometry": {
        "type": "Point",
        "coordinates": [
          50.1324714,
          26.3126316
        ]
      },
      "id": "node/2141576517"
    },
    {
      "type": "Feature",
      "properties": {
        "@id": "node/2141576518",
        "amenity": "parking"
      },
      "geometry": {
        "type": "Point",
        "coordinates": [
          50.1327396,
          26.3144108
        ]
      },
      "id": "node/2141576518"
    },
    {
      "type": "Feature",
      "properties": {
        "@id": "node/2141576519",
        "amenity": "parking"
      },
      "geometry": {
        "type": "Point",
        "coordinates": [
          50.1336087,
          26.3132086
        ]
      },
      "id": "node/2141576519"
    },
    {
      "type": "Feature",
      "properties": {
        "@id": "node/2141586195",
        "amenity": "parking"
      },
      "geometry": {
        "type": "Point",
        "coordinates": [
          50.1279411,
          26.3209574
        ]
      },
      "id": "node/2141586195"
    },
    {
      "type": "Feature",
      "properties": {
        "@id": "node/2520777956",
        "amenity": "parking"
      },
      "geometry": {
        "type": "Point",
        "coordinates": [
          50.2150921,
          26.2808562
        ]
      },
      "id": "node/2520777956"
    },
    {
      "type": "Feature",
      "properties": {
        "@id": "node/3245969062",
        "amenity": "parking"
      },
      "geometry": {
        "type": "Point",
        "coordinates": [
          50.1022674,
          26.4435698
        ]
      },
      "id": "node/3245969062"
    },
    {
      "type": "Feature",
      "properties": {
        "@id": "node/3245970411",
        "amenity": "parking",
        "name": "Parking"
      },
      "geometry": {
        "type": "Point",
        "coordinates": [
          50.1053599,
          26.4392369
        ]
      },
      "id": "node/3245970411"
    },
    {
      "type": "Feature",
      "properties": {
        "@id": "node/5312165036",
        "amenity": "parking"
      },
      "geometry": {
        "type": "Point",
        "coordinates": [
          50.0261144,
          26.3174597
        ]
      },
      "id": "node/5312165036"
    },
    {
      "type": "Feature",
      "properties": {
        "@id": "node/5312165090",
        "amenity": "parking"
      },
      "geometry": {
        "type": "Point",
        "coordinates": [
          50.0183809,
          26.3214954
        ]
      },
      "id": "node/5312165090"
    },
    {
      "type": "Feature",
      "properties": {
        "@id": "node/5312165798",
        "amenity": "parking"
      },
      "geometry": {
        "type": "Point",
        "coordinates": [
          49.9927635,
          26.3085821
        ]
      },
      "id": "node/5312165798"
    },
    {
      "type": "Feature",
      "properties": {
        "@id": "node/5312165799",
        "amenity": "parking"
      },
      "geometry": {
        "type": "Point",
        "coordinates": [
          49.9899289,
          26.3069256
        ]
      },
      "id": "node/5312165799"
    },
    {
      "type": "Feature",
      "properties": {
        "@id": "node/5312165800",
        "amenity": "parking"
      },
      "geometry": {
        "type": "Point",
        "coordinates": [
          49.9954549,
          26.3104353
        ]
      },
      "id": "node/5312165800"
    },
    {
      "type": "Feature",
      "properties": {
        "@id": "node/5312165805",
        "amenity": "parking"
      },
      "geometry": {
        "type": "Point",
        "coordinates": [
          49.9995782,
          26.3053401
        ]
      },
      "id": "node/5312165805"
    },
    {
      "type": "Feature",
      "properties": {
        "@id": "node/5312165806",
        "amenity": "parking"
      },
      "geometry": {
        "type": "Point",
        "coordinates": [
          50.002027,
          26.3073478
        ]
      },
      "id": "node/5312165806"
    },
    {
      "type": "Feature",
      "properties": {
        "@id": "node/5312165807",
        "amenity": "parking"
      },
      "geometry": {
        "type": "Point",
        "coordinates": [
          50.001234,
          26.3088867
        ]
      },
      "id": "node/5312165807"
    },
    {
      "type": "Feature",
      "properties": {
        "@id": "node/5312165809",
        "amenity": "parking"
      },
      "geometry": {
        "type": "Point",
        "coordinates": [
          50.0037263,
          26.3093867
        ]
      },
      "id": "node/5312165809"
    },
    {
      "type": "Feature",
      "properties": {
        "@id": "node/5312166531",
        "amenity": "parking"
      },
      "geometry": {
        "type": "Point",
        "coordinates": [
          50.0259166,
          26.2904504
        ]
      },
      "id": "node/5312166531"
    },
    {
      "type": "Feature",
      "properties": {
        "@id": "node/5312166532",
        "amenity": "parking"
      },
      "geometry": {
        "type": "Point",
        "coordinates": [
          50.0264855,
          26.291117
        ]
      },
      "id": "node/5312166532"
    },
    {
      "type": "Feature",
      "properties": {
        "@id": "node/6403145284",
        "amenity": "parking"
      },
      "geometry": {
        "type": "Point",
        "coordinates": [
          50.1919937,
          26.3637965
        ]
      },
      "id": "node/6403145284"
    },
    {
      "type": "Feature",
      "properties": {
        "@id": "node/6403145485",
        "amenity": "parking"
      },
      "geometry": {
        "type": "Point",
        "coordinates": [
          50.1921949,
          26.3639527
        ]
      },
      "id": "node/6403145485"
    },
    {
      "type": "Feature",
      "properties": {
        "@id": "node/6403145486",
        "amenity": "parking"
      },
      "geometry": {
        "type": "Point",
        "coordinates": [
          50.191637,
          26.363746
        ]
      },
      "id": "node/6403145486"
    },
    {
      "type": "Feature",
      "properties": {
        "@id": "node/6403145500",
        "amenity": "parking"
      },
      "geometry": {
        "type": "Point",
        "coordinates": [
          50.1910415,
          26.3654884
        ]
      },
      "id": "node/6403145500"
    },
    {
      "type": "Feature",
      "properties": {
        "@id": "node/6403145503",
        "amenity": "parking"
      },
      "geometry": {
        "type": "Point",
        "coordinates": [
          50.1910694,
          26.3654554
        ]
      },
      "id": "node/6403145503"
    },
    {
      "type": "Feature",
      "properties": {
        "@id": "node/6697086308",
        "amenity": "parking",
        "layer": "-1",
        "parking": "underground"
      },
      "geometry": {
        "type": "Point",
        "coordinates": [
          50.1903785,
          26.338423
        ]
      },
      "id": "node/6697086308"
    },
    {
      "type": "Feature",
      "properties": {
        "@id": "node/7900241539",
        "access": "private",
        "amenity": "parking",
        "name": "PS-01 Students"
      },
      "geometry": {
        "type": "Point",
        "coordinates": [
          50.187847,
          26.3961909
        ]
      },
      "id": "node/7900241539"
    },
    {
      "type": "Feature",
      "properties": {
        "@id": "node/7900241540",
        "access": "private",
        "amenity": "parking",
        "name": "PF-01 Faculty"
      },
      "geometry": {
        "type": "Point",
        "coordinates": [
          50.1895138,
          26.3957976
        ]
      },
      "id": "node/7900241540"
    },
    {
      "type": "Feature",
      "properties": {
        "@id": "node/7900241541",
        "access": "customers",
        "amenity": "parking",
        "name": "PV-05 Visitors",
        "parking": "carports"
      },
      "geometry": {
        "type": "Point",
        "coordinates": [
          50.189526,
          26.3971778
        ]
      },
      "id": "node/7900241541"
    },
    {
      "type": "Feature",
      "properties": {
        "@id": "node/7900241542",
        "access": "private",
        "amenity": "parking",
        "name": "PS-01 Students",
        "parking": "carports"
      },
      "geometry": {
        "type": "Point",
        "coordinates": [
          50.191136,
          26.3979571
        ]
      },
      "id": "node/7900241542"
    },
    {
      "type": "Feature",
      "properties": {
        "@id": "node/7900241543",
        "access": "private",
        "amenity": "parking",
        "name": "PM-01"
      },
      "geometry": {
        "type": "Point",
        "coordinates": [
          50.1899326,
          26.3976439
        ]
      },
      "id": "node/7900241543"
    },
    {
      "type": "Feature",
      "properties": {
        "@id": "node/7900241544",
        "access": "private",
        "amenity": "parking",
        "name": "PM-02"
      },
      "geometry": {
        "type": "Point",
        "coordinates": [
          50.1902253,
          26.3978478
        ]
      },
      "id": "node/7900241544"
    },
    {
      "type": "Feature",
      "properties": {
        "@id": "node/7900241546",
        "access": "private",
        "amenity": "parking",
        "name": "PF-15 Faculty"
      },
      "geometry": {
        "type": "Point",
        "coordinates": [
          50.1909489,
          26.3958195
        ]
      },
      "id": "node/7900241546"
    },
    {
      "type": "Feature",
      "properties": {
        "@id": "node/7900241560",
        "access": "private",
        "amenity": "parking",
        "name": "PF-08 Faculty"
      },
      "geometry": {
        "type": "Point",
        "coordinates": [
          50.1899204,
          26.3933504
        ]
      },
      "id": "node/7900241560"
    },
    {
      "type": "Feature",
      "properties": {
        "@id": "node/7900241561",
        "access": "private",
        "amenity": "parking",
        "name": "PF-02 Faculty"
      },
      "geometry": {
        "type": "Point",
        "coordinates": [
          50.1888297,
          26.3931073
        ]
      },
      "id": "node/7900241561"
    },
    {
      "type": "Feature",
      "properties": {
        "@id": "node/7900241563",
        "access": "private",
        "amenity": "parking",
        "name": "PF-13 Faculty"
      },
      "geometry": {
        "type": "Point",
        "coordinates": [
          50.1907985,
          26.3936672
        ]
      },
      "id": "node/7900241563"
    },
    {
      "type": "Feature",
      "properties": {
        "@id": "node/7900241564",
        "amenity": "parking",
        "name": "-2"
      },
      "geometry": {
        "type": "Point",
        "coordinates": [
          50.1909367,
          26.3941734
        ]
      },
      "id": "node/7900241564"
    },
    {
      "type": "Feature",
      "properties": {
        "@id": "node/7900241565",
        "access": "private",
        "amenity": "parking",
        "name": "PF-11 Faculty"
      },
      "geometry": {
        "type": "Point",
        "coordinates": [
          50.1904977,
          26.3949345
        ]
      },
      "id": "node/7900241565"
    },
    {
      "type": "Feature",
      "properties": {
        "@id": "node/7900241566",
        "access": "private",
        "amenity": "parking",
        "name": "PF-20 Faculty"
      },
      "geometry": {
        "type": "Point",
        "coordinates": [
          50.1932846,
          26.3954502
        ]
      },
      "id": "node/7900241566"
    },
    {
      "type": "Feature",
      "properties": {
        "@id": "node/7900241567",
        "access": "private",
        "amenity": "parking",
        "name": "PF-19 Faculty"
      },
      "geometry": {
        "type": "Point",
        "coordinates": [
          50.1928581,
          26.3960824
        ]
      },
      "id": "node/7900241567"
    },
    {
      "type": "Feature",
      "properties": {
        "@id": "node/7900241572",
        "access": "customers",
        "amenity": "parking",
        "name": "PV-07 Visitors"
      },
      "geometry": {
        "type": "Point",
        "coordinates": [
          50.1938314,
          26.3947197
        ]
      },
      "id": "node/7900241572"
    },
    {
      "type": "Feature",
      "properties": {
        "@id": "node/7902998979",
        "access": "private",
        "amenity": "parking",
        "name": "PM-04 Service & Maintenance"
      },
      "geometry": {
        "type": "Point",
        "coordinates": [
          50.1916595,
          26.398527
        ]
      },
      "id": "node/7902998979"
    },
    {
      "type": "Feature",
      "properties": {
        "@id": "node/7902998980",
        "access": "private",
        "amenity": "parking",
        "name": "PM-11 Service & Maintenance"
      },
      "geometry": {
        "type": "Point",
        "coordinates": [
          50.194193,
          26.3975186
        ]
      },
      "id": "node/7902998980"
    },
    {
      "type": "Feature",
      "properties": {
        "@id": "node/7902998981",
        "access": "private",
        "amenity": "parking",
        "name": "PM-06 Service & Maintenance"
      },
      "geometry": {
        "type": "Point",
        "coordinates": [
          50.1926426,
          26.3976775
        ]
      },
      "id": "node/7902998981"
    },
    {
      "type": "Feature",
      "properties": {
        "@id": "node/7902998982",
        "access": "private",
        "amenity": "parking",
        "name": "PM-05 Service & Maintenance"
      },
      "geometry": {
        "type": "Point",
        "coordinates": [
          50.1921989,
          26.398146
        ]
      },
      "id": "node/7902998982"
    },
    {
      "type": "Feature",
      "properties": {
        "@id": "node/7902998983",
        "access": "private",
        "amenity": "parking",
        "name": "PF-16 Faculty"
      },
      "geometry": {
        "type": "Point",
        "coordinates": [
          50.1919374,
          26.3963138
        ]
      },
      "id": "node/7902998983"
    },
    {
      "type": "Feature",
      "properties": {
        "@id": "node/7903025688",
        "access": "private",
        "amenity": "parking",
        "name": "PF-34 Faculty"
      },
      "geometry": {
        "type": "Point",
        "coordinates": [
          50.194115,
          26.3987928
        ]
      },
      "id": "node/7903025688"
    },
    {
      "type": "Feature",
      "properties": {
        "@id": "node/7903025689",
        "access": "private",
        "amenity": "parking",
        "name": "PM-09 Service & Maintenance"
      },
      "geometry": {
        "type": "Point",
        "coordinates": [
          50.193273,
          26.398397
        ]
      },
      "id": "node/7903025689"
    },
    {
      "type": "Feature",
      "properties": {
        "@id": "node/7903025761",
        "access": "private",
        "amenity": "parking",
        "name": "PF-17 Faculty"
      },
      "geometry": {
        "type": "Point",
        "coordinates": [
          50.1935316,
          26.3930949
        ]
      },
      "id": "node/7903025761"
    },
    {
      "type": "Feature",
      "properties": {
        "@id": "node/7903025763",
        "access": "private",
        "amenity": "parking",
        "name": "PF-42 Faculty"
      },
      "geometry": {
        "type": "Point",
        "coordinates": [
          50.1997677,
          26.3973898
        ]
      },
      "id": "node/7903025763"
    },
    {
      "type": "Feature",
      "properties": {
        "@id": "node/7903025828",
        "access": "private",
        "amenity": "parking",
        "name": "PF-39 Faculty"
      },
      "geometry": {
        "type": "Point",
        "coordinates": [
          50.1984612,
          26.3947628
        ]
      },
      "id": "node/7903025828"
    },
    {
      "type": "Feature",
      "properties": {
        "@id": "node/7903025829",
        "access": "private",
        "amenity": "parking",
        "name": "PF-31 Faculty"
      },
      "geometry": {
        "type": "Point",
        "coordinates": [
          50.1968106,
          26.3939252
        ]
      },
      "id": "node/7903025829"
    },
    {
      "type": "Feature",
      "properties": {
        "@id": "node/7903025830",
        "access": "private",
        "amenity": "parking",
        "name": "PF-06 Faculty"
      },
      "geometry": {
        "type": "Point",
        "coordinates": [
          50.1897042,
          26.3898464
        ]
      },
      "id": "node/7903025830"
    },
    {
      "type": "Feature",
      "properties": {
        "@id": "node/7903025831",
        "access": "private",
        "amenity": "parking",
        "name": "PF-05 Faculty"
      },
      "geometry": {
        "type": "Point",
        "coordinates": [
          50.1891797,
          26.3907787
        ]
      },
      "id": "node/7903025831"
    },
    {
      "type": "Feature",
      "properties": {
        "@id": "node/7903025832",
        "access": "private",
        "amenity": "parking",
        "name": "PF-04 Faculty"
      },
      "geometry": {
        "type": "Point",
        "coordinates": [
          50.1887407,
          26.3921189
        ]
      },
      "id": "node/7903025832"
    },
    {
      "type": "Feature",
      "properties": {
        "@id": "node/7903025833",
        "access": "customers",
        "amenity": "parking",
        "name": "PV-02 Visitors"
      },
      "geometry": {
        "type": "Point",
        "coordinates": [
          50.1888911,
          26.3906768
        ]
      },
      "id": "node/7903025833"
    },
    {
      "type": "Feature",
      "properties": {
        "@id": "node/7903573557",
        "amenity": "parking"
      },
      "geometry": {
        "type": "Point",
        "coordinates": [
          50.0275633,
          26.5308684
        ]
      },
      "id": "node/7903573557"
    },
    {
      "type": "Feature",
      "properties": {
        "@id": "node/7904528627",
        "amenity": "parking"
      },
      "geometry": {
        "type": "Point",
        "coordinates": [
          49.9562196,
          26.335837
        ]
      },
      "id": "node/7904528627"
    },
    {
      "type": "Feature",
      "properties": {
        "@id": "node/7904528649",
        "amenity": "parking"
      },
      "geometry": {
        "type": "Point",
        "coordinates": [
          49.9585029,
          26.3343861
        ]
      },
      "id": "node/7904528649"
    },
    {
      "type": "Feature",
      "properties": {
        "@id": "node/7904528665",
        "amenity": "parking"
      },
      "geometry": {
        "type": "Point",
        "coordinates": [
          49.9595348,
          26.331519
        ]
      },
      "id": "node/7904528665"
    }
  ]
}
