AuthHolderRef,AuthRef,dateAuthsign,landfilltype,easting,northing,Tforlandfill,lat,lng
Eastwood Envirowaste Ltd,WPPC 01/05 P0340/10A,16/02/2011,non-haz,315734,378013,"29,178",54.636931963841704,-6.207366629238363
IRS Environmental Recycling,WPPC 02/01 P0332/09A,02/07/2012,inert,354371,375636,0,54.60526403375555,-5.610665403975672
Quinn Environmental Ltd,WPPC 03/01 P0145/06A/V1,07/08/2009,non-haz,304792,344558,0,54.33886826601527,-6.388631960665902
Robinsons Quarry Masters Ltd,WPPC 04/03 P0389/12A,03/07/2012,inert,325318,399880,0,54.83098502999899,-6.049597734358174
Whitemountain Quarries Ltd,WPPC 07/06 P0259/07A/V1,21/09/2012,inert,327857,372445,"510,254",54.58401387619853,-6.02213529760698
Anderson Haulage Ltd,WPPC 07/08 P0345/10A,10/08/2011,inert,329313,376945,0,54.624048176396485,-5.997644500306189
AES Power Ltd,WPPC 08/01 P0155/06A/V1,30/10/2007,non-haz,344271,388356,"46,868",54.72243820675759,-5.7605797036425255
Morrow Group,WPPC 09/02 P0305/09A,04/01/2010,inert,338714,363615,0,54.50187802473605,-5.858467210271366
Coleraine Skip Hire & Recycling Ltd,WPPC 10/01 P0087/05A/V9,07/12/2015,non-haz,281835,421345,"122,389",55.03275753608908,-6.720006064835087
Causeway Coast and Glens District Council,WPPC 10/02 P0148/06A/V3,01/04/2015,non-haz,288322,438962,"31,752",55.189864097008865,-6.613103318177004
Mid Ulster District Council,WPPC 11/01 P0143/06A/V3,01/04/2015,non-haz,273117,376654,"18,926",54.6326954406739,-6.867626500411079
Lafarge Tarmac Cement and Lime Ltd,WPPC 11/03 P0293/08A/V2,07/10/2013,haz,279646,375121,0,54.617938391558795,-6.766952450030976
Stanley Bell & Sons Ltd,WPPC 11/06 P0449/14A,07/01/2015,inert,273736,385024,"17,894",54.70778759396231,-6.85593056529855
"Newry, Mourne and Down District Council",WPPC 14/02 P0154/06A/V3,01/04/2015,non-haz,338232,344736,"19,609",54.33250838105092,-5.874692834182002
Mid Ulster & Fermanagh and Omagh District Councils,WPPC 15/01 P0184/07A/V4,01/04/2015,non-haz,264594,354881,"65,108",54.438271533421755,-7.004371892857634
Fermanagh and Omagh District Council,WPPC 16/01 P0044/04A/V4,01/04/2015,non-haz,220700,344852,"16,056",54.351847789628884,-7.681612351749554
Campbell Contracts Ltd,WPPC 16/05 P0459/14A,04/08/2015,inert,237133,351817,0,54.41349077936203,-7.427997069211978
Anderson Haulage Ltd (Crosshill),WPPC 17/02 P0395/12A/V1,18/06/2015,inert,338000,397000,"15,930",54.80179958345621,-5.853738779511165
Alpha Resource Management Ltd,WPPC 19/02 P0107/05A/V2,23/09/2015,non-haz,324738,369102,"267,754",54.55477505743698,-6.0717712209336785
Aughrim Landfill Ltd,WPPC 19/03 P0110/06A/V1,08/09/2010,non-haz,324929,370238,"60,891",54.56492833302207,-6.068338337050953
Quarry Landfill Services,WPPC 19/05 P0162/07A/V1,25/06/2013,inert,325334,369703,"22,506",54.56002439812711,-6.062308039412174
Eastwood Ltd,WPPC 19/10 P0260/07A,14/08/2008,inert,324892,372128,0,54.58190807507689,-6.06810735431414
John McQuillan (Contracts) Ltd,WPPC 19/13 P0410/12A,23/09/2013,inert,325801,372467,"32,803",54.584726800509316,-6.053910335626079
Magherafelt District Council,WPPC 20/02 P0336/09A,16/04/2010,non-haz,295428,400621,0,54.84422075652515,-6.5143488245608046
"Newry, Mourne and Down District Council",WPPC 22/01 P0152/06A/V2,09/09/2015,non-haz,314398,325031,"8,420",54.16144327304116,-6.248443684646117
Biffa Waste Services Ltd,WPPC 23/01 P0090/05A/V2,08/10/2008,non-haz,327799,383101,"163,803",54.67970681368471,-6.018384144180735
Macwill Services,WPPC 23/06 P0324/09A/V1,29/01/2015,non-haz,331289,379710,0,54.64836414024621,-5.965828991772122
William Campbell Brown,WPPC 24/02 P0294/08A,12/04/2010,inert,350464,377629,"2,183",54.62433259295642,-5.67005892407109
Tipco (NI) Ltd,WPPC 24/03 P0304/09A/V1,14/12/2012,inert,350555,377853,0,54.62631627601813,-5.668536034790046
