<svg xmlns="http://www.w3.org/2000/svg" id="flag-icon-css-ee" viewBox="0 0 640 480">
  <g fill-rule="evenodd" stroke-width="1pt">
    <rect width="640" height="477.9" rx="0" ry="0"/>
    <rect width="640" height="159.3" y="320.7" fill="#fff" rx="0" ry="0"/>
    <path fill="#1291ff" d="M0 0h640v159.3H0z"/>
  </g>
</svg>
1063v236.2H0z"/>
  </g>
</svg>
