module github.com/ONSdigital/dp-search-api

go 1.17

replace github.com/coreos/etcd => github.com/coreos/etcd v3.3.24+incompatible

require (
	github.com/ONSdigital/dp-api-clients-go/v2 v2.4.4
	github.com/ONSdigital/dp-authorisation v0.2.0
	github.com/ONSdigital/dp-component-test v0.6.3
	github.com/ONSdigital/dp-elasticsearch/v2 v2.3.0
	github.com/ONSdigital/dp-healthcheck v1.2.1
	github.com/ONSdigital/dp-net v1.2.0
	github.com/ONSdigital/log.go/v2 v2.0.9
	github.com/cucumber/godog v0.12.2
	github.com/google/go-cmp v0.5.6
	github.com/gorilla/mux v1.8.0
	github.com/kelseyhightower/envconfig v1.4.0
	github.com/maxcnunes/httpfake v1.2.4
	github.com/pkg/errors v0.9.1
	github.com/smartystreets/goconvey v1.7.2
	github.com/tdewolff/minify v2.3.6+incompatible
)

require (
	github.com/ONSdigital/dp-api-clients-go v1.41.1 // indirect
	github.com/ONSdigital/dp-mongodb-in-memory v1.1.0 // indirect
	github.com/ONSdigital/dp-rchttp v1.0.0 // indirect
	github.com/ONSdigital/go-ns v0.0.0-20200205115900-a11716f93bad // indirect
	github.com/aws/aws-sdk-go v1.38.15 // indirect
	github.com/cucumber/gherkin-go/v19 v19.0.3 // indirect
	github.com/cucumber/messages-go/v16 v16.0.1 // indirect
	github.com/davecgh/go-spew v1.1.1 // indirect
	github.com/fatih/color v1.13.0 // indirect
	github.com/go-stack/stack v1.8.0 // indirect
	github.com/gofrs/uuid v4.0.0+incompatible // indirect
	github.com/golang/snappy v0.0.1 // indirect
	github.com/gopherjs/gopherjs v0.0.0-20210202160940-bed99a852dfe // indirect
	github.com/hashicorp/go-immutable-radix v1.3.0 // indirect
	github.com/hashicorp/go-memdb v1.3.0 // indirect
	github.com/hashicorp/golang-lru v0.5.4 // indirect
	github.com/hokaccha/go-prettyjson v0.0.0-20211117102719-0474bc63780f // indirect
	github.com/jmespath/go-jmespath v0.4.0 // indirect
	github.com/jtolds/gls v4.20.0+incompatible // indirect
	github.com/justinas/alice v1.2.0 // indirect
	github.com/klauspost/compress v1.13.6 // indirect
	github.com/mattn/go-colorable v0.1.12 // indirect
	github.com/mattn/go-isatty v0.0.14 // indirect
	github.com/pmezard/go-difflib v1.0.0 // indirect
	github.com/smartystreets/assertions v1.2.0 // indirect
	github.com/spf13/afero v1.6.0 // indirect
	github.com/spf13/pflag v1.0.5 // indirect
	github.com/stretchr/testify v1.7.0 // indirect
	github.com/tdewolff/parse v2.3.4+incompatible // indirect
	github.com/tdewolff/test v1.0.6 // indirect
	github.com/xdg-go/pbkdf2 v1.0.0 // indirect
	github.com/xdg-go/scram v1.0.2 // indirect
	github.com/xdg-go/stringprep v1.0.2 // indirect
	github.com/youmark/pkcs8 v0.0.0-20181117223130-1be2e3e5546d // indirect
	go.mongodb.org/mongo-driver v1.8.0 // indirect
	golang.org/x/crypto v0.0.0-20211117183948-ae814b36b871 // indirect
	golang.org/x/net v0.0.0-20211112202133-69e39bad7dc2 // indirect
	golang.org/x/sync v0.0.0-20210220032951-036812b2e83c // indirect
	golang.org/x/sys v0.0.0-20211124211545-fe61309f8881 // indirect
	golang.org/x/text v0.3.7 // indirect
	gopkg.in/yaml.v3 v3.0.0-20210107192922-496545a6307b // indirect
)
