# ------------------------------------------------------------------------------
#    ScarTOzzo Linux 7.10
# ------------------------------------------------------------------------------

#    Premessa
# ------------------------------------------------------------------------------
ScarTOzzo Linux (SL) nasce a partire dal progetto LFS/BLFS.
La costruzione del sistema operativo è basata sul libro LFS, seppure con
alcune modifiche sostanziali.

Le directory /bin, /sbin e /lib, (rindondanti in /usr/bin, /usr/sbin e /usr/lib),
sono state create come link simbolici alle rispettive corrispondenze in /usr.
Quindi le modifiche alle istruzioni per la compilazione del sistema di base
sono prevalentemente volte all'installazione degli applicativi in /usr/bin,
/usr/sbin e /usr/lib.

Le variabili CFLAGS e CXXFLAGS, assenti nel progetto LFS, sono state inizializzate
ai seguenti valori per le differenti architetture:
  32 bit
CFLAGS="-O2 -march=i686 -mtune=i686"
CXXFLAGS="-O2 -march=i686 -mtune=i686" 
  64 bit
CFLAGS="-O2 -fPIC"
CXXFLAGS="-O2 -fPIC"

#    Revisione e modifiche al testo "Linux From Scratch 7.10"
# ------------------------------------------------------------------------------
Il testo LFS è da seguire fedelmente fino al capitolo 6 incluso, fatte salve
le modifiche elencate a seguire.

#    LINUX FROM SCRATCH 7.10
# -----------------------------

#    4. Final Preparation
# --------------------------

#    4.4. Setting Up the Environment
# -------------------------------------
In questo paragrafo la modifica riguarda il file .bashrc.

#    .bashrc
# -------------
cat > ~/.bashrc << "EOF"
set +h
umask 022
LFS=/mnt/sda3
LC_ALL=POSIX
LFS_TGT=$(uname -m)-sl-linux-gnu
CFLAGS="-O2 -march=i686 -mtune=i686"
CXXFLAGS="-O2 -march=i686 -mtune=i686"
# CFLAGS="-O2 -fPIC"
# CXXFLAGS="-O2 -fPIC"
PATH=/tools/bin:/bin:/usr/bin
export LFS LC_ALL LFS_TGT CFLAGS CXXFLAGS PATH
EOF

#    6. Installing Basic System Software
# -----------------------------------------

Nel caso di ricompilazione, a fronte di una toolchain pre-esistente,
basta scompatare i file tools_7.19.txz e lfs-filesystem_7.10.txz

#    6.4. Entering the Chroot Environment
# ------------------------------------------
Sono introdotte le variabili CFLAGS e CXXFLAGS in ambiente chroot.

chroot "$LFS" /tools/bin/env -i \
  HOME=/root \
  TERM="$TERM" \
  PS1='\u:\w\$ ' \
  CFLAGS="-O2 -march=i686 -mtune=i686" \
  CXXFLAGS="-O2 -march=i686 -mtune=i686" \
  PATH=/bin:/usr/bin:/sbin:/usr/sbin:/tools/bin \
  /tools/bin/bash --login +h

#    6.5. Creating Directories
# -------------------------------
mkdir -pv /{boot,etc/{opt,sysconfig},home,mnt,opt}
mkdir -pv /{media/{floppy,cdrom},srv,var}
install -dv -m 0750 /root
install -dv -m 1777 /tmp /var/tmp
mkdir -pv /usr/{,local/}{bin,include,lib/firmware,sbin,src}
mkdir -pv /usr/{,local/}share/{color,dict,doc,info,locale,man}
mkdir -v  /usr/{,local/}share/{misc,terminfo,zoneinfo}
mkdir -v  /usr/libexec
mkdir -pv /usr/{,local/}share/man/man{1..8}

ln -sv /usr/sbin /sbin
ln -sv /usr/bin /bin
ln -sv /usr/lib /lib

case $(uname -m) in
 x86_64) ln -sv lib /usr/lib64
         ln -sv lib /usr/local/lib64 ;;
esac

mkdir -v /var/{log,mail,spool}
ln -sv /run /var/run
ln -sv /run/lock /var/lock
mkdir -pv /var/{opt,cache,lib/{color,misc,locate},local}

#    6.6. Creating Essential Files and Symlinks
# ------------------------------------------------
ln -sv /tools/bin/{bash,cat,echo,pwd,stty} /usr/bin
ln -sv /tools/bin/perl /usr/bin
ln -sv /tools/lib/libgcc_s.so{,.1} /usr/lib
ln -sv /tools/lib/libstdc++.so{,.6} /usr/lib
sed 's/tools/usr/' /tools/lib/libstdc++.la > /usr/lib/libstdc++.la
ln -sv bash /usr/bin/sh

#    6.11. Zlib-1.2.8
# ----------------------
# Eliminare le seguenti istruzioni:

mv -v /usr/lib/libz.so.* /lib
ln -sfv ../../lib/$(readlink /usr/lib/libz.so) /usr/lib/libz.so

#    6.17. GCC
# ---------------
# Sostituire le seguenti istruzioni

  "ln -sv ../usr/bin/cpp /lib"

ln -sv ../bin/cpp /usr/lib

#    6.18. Bzip2
# -----------------
# Sostituire le seguenti istruzioni:

  "cp -v bzip2-shared /bin/bzip2
   cp -av libbz2.so* /lib
   ln -sv ../../lib/libbz2.so.1.0 /usr/lib/libbz2.so
   rm -v /usr/bin/{bunzip2,bzcat,bzip2}
   ln -sv bzip2 /bin/bunzip2
   ln -sv bzip2 /bin/bzcat"

rm -v /usr/bin/{bunzip2,bzcat,bzip2}
cp -v bzip2-shared /usr/bin/bzip2
cp -av libbz2.so* /usr/lib/
ln -sv bzip2 /usr/bin/bunzip2
ln -sv bzip2 /usr/bin/bzcat
ln -sv ../../usr/lib/libbz2.so.1.0 /usr/lib/libbz2.so

#    6.20. Ncurses
# -------------------
# Eliminare le seguenti istruzioni

mv -v /usr/lib/libncursesw.so.6* /lib
ln -sfv ../../lib/$(readlink /usr/lib/libncursesw.so) /usr/lib/libncursesw.so

#    6.21. Attr
# ----------------
# Sostituire le seguenti istruzioni:

  "./configure --prefix=/usr \
               --bindir=/bin \
               --disable-static"

./configure --prefix=/usr \
            --bindir=/usr/bin \
            --disable-static

# Eliminare le seguenti istruzioni

mv -v /usr/lib/libattr.so.* /lib
ln -sfv ../../lib/$(readlink /usr/lib/libattr.so) /usr/lib/libattr.so

#    6.22. Acl
# ---------------
# Sostituire le seguenti istruzioni:

  "./configure --prefix=/usr    \
               --bindir=/bin    \
               --disable-static \
               --libexecdir=/usr/lib"

./configure --prefix=/usr \
            --bindir=/usr/bin \
            --disable-static \
            --libexecdir=/usr/lib


# Eliminare le seguenti istruzioni

mv -v /usr/lib/libacl.so.* /lib
ln -sfv ../../lib/$(readlink /usr/lib/libacl.so) /usr/lib/libacl.so

#    6.23. Libcap
# ------------------
# Eliminare le seguenti istruzioni

mv -v /usr/lib/libcap.so.* /lib
ln -sfv ../../lib/$(readlink /usr/lib/libcap.so) /usr/lib/libcap.so

#    6.24. Sed-4.2.2
# ---------------------
# Sostituire le seguenti istruzioni:

  "./configure --prefix=/usr --bindir=/bin --htmldir=/usr/share/doc/sed-4.2.2"

./configure --prefix=/usr --bindir=/usr/bin --htmldir=/usr/share/doc/sed-4.2.2

#    6.25. Shadow
# ------------------
# Eliminare le seguenti istruzioni

mv -v /usr/bin/passwd /bin

#    6.26. Psmisc
# ------------------
# Eliminare le seguenti istruzioni

mv -v /usr/bin/fuser   /bin
mv -v /usr/bin/killall /bin

#    6.31. Grep-2.25
# ---------------------
# Sostituire le seguenti istruzioni:

  "./configure --prefix=/usr --bindir=/bin"

./configure --prefix=/usr --bindir=/usr/bin

#    6.32. Readline
# --------------------
# Eliminare le seguenti istruzioni

mv -v /usr/lib/lib{readline,history}.so.* /lib
ln -sfv ../../lib/$(readlink /usr/lib/libreadline.so) /usr/lib/libreadline.so
ln -sfv ../../lib/$(readlink /usr/lib/libhistory.so ) /usr/lib/libhistory.so

#    6.33. Bash
# ----------------
# Eliminare le seguenti istruzioni

mv -vf /usr/bin/bash /bin

#    6.39. Inetutils
# ---------------------
# Eliminare le seguenti istruzioni

mv -v /usr/bin/{hostname,ping,ping6,traceroute} /bin

# Sostituire le seguenti istruzioni:

  "mv -v /usr/bin/ifconfig /sbin"

mv -v /usr/bin/ifconfig /usr/sbin

#    6.45. Xz
# --------------
# Eliminare le seguenti istruzioni

mv -v   /usr/bin/{lzma,unlzma,lzcat,xz,unxz,xzcat} /bin
mv -v /usr/lib/liblzma.so.* /lib
ln -svf ../../lib/$(readlink /usr/lib/liblzma.so) /usr/lib/liblzma.so

#    6.46. Kmod
# ----------------
# Sostituire le seguenti istruzioni:

  "./configure --prefix=/usr          \
               --bindir=/bin          \
               --sysconfdir=/etc      \
               --with-rootlibdir=/lib \
               --with-xz              \
               --with-zlib"

./configure \
  --prefix=/usr \
  --bindir=/usr/bin \
  --sysconfdir=/etc \
  --with-rootlibdir=/usr/lib \
  --with-xz \
  --with-zlib


  "for target in depmod insmod lsmod modinfo modprobe rmmod; do
     ln -sfv ../bin/kmod /sbin/$target
   done

   ln -sfv kmod /bin/lsmod"

for target in depmod insmod lsmod modinfo modprobe rmmod; do
  ln -sfv ../bin/kmod /usr/sbin/$target
done

ln -sfv kmod /usr/bin/lsmod

#    6.48. Procps-ng
# ---------------------
# Eliminare le seguenti istruzioni

mv -v /usr/lib/libprocps.so.* /lib
ln -sfv ../../lib/$(readlink /usr/lib/libprocps.so) /usr/lib/libprocps.so

#    6.49. E2fsprogs-1.43.1
# ----------------------------
# Sostituire le seguenti istruzioni:

  "LIBS=-L/tools/lib                    \
   CFLAGS=-I/tools/include              \
   PKG_CONFIG_PATH=/tools/lib/pkgconfig \
   ../configure --prefix=/usr           \
                --bindir=/bin           \
                --with-root-prefix=""   \
                --enable-elf-shlibs     \
                --disable-libblkid      \
                --disable-libuuid       \
                --disable-uuidd         \
                --disable-fsck"

LIBS=-L/tools/lib \
CFLAGS=-I/tools/include \
PKG_CONFIG_PATH=/tools/lib/pkgconfig \
../configure --prefix=/usr \
             --enable-elf-shlibs \
             --disable-libblkid \
             --disable-libuuid \
             --disable-uuidd \
             --disable-fsck

#    6.50. Coreutils
# ---------------------
# Sostituire le seguenti istruzioni:

  "mv -v /usr/bin/{cat,chgrp,chmod,chown,cp,date,dd,df,echo} /bin
   mv -v /usr/bin/{false,ln,ls,mkdir,mknod,mv,pwd,rm} /bin
   mv -v /usr/bin/{rmdir,stty,sync,true,uname} /bin
   mv -v /usr/bin/chroot /usr/sbin
   mv -v /usr/share/man/man1/chroot.1 /usr/share/man/man8/chroot.8
   sed -i s/\"1\"/\"8\"/1 /usr/share/man/man8/chroot.8

   mv -v /usr/bin/{head,sleep,nice,test,[} /bin"

mv -v /usr/bin/chroot /usr/sbin
mv -v /usr/share/man/man1/chroot.1 /usr/share/man/man8/chroot.8
sed -i s/\"1\"/\"8\"/1 /usr/share/man/man8/chroot.8

#    6.53. Findutils
# ---------------------
# Eliminare le seguenti istruzioni

mv -v /usr/bin/find /bin
sed -i 's|find:=${BINDIR}|find:=/bin|' /usr/bin/updatedb

#    6.55. GRUB-2.02~beta3
# ---------------------------
  "./configure --prefix=/usr          \
               --sbindir=/sbin        \
               --sysconfdir=/etc      \
               --disable-efiemu       \
               --disable-werror"

./configure --prefix=/usr          \
            --sbindir=/usr/sbin        \
            --sysconfdir=/etc      \
            --disable-efiemu       \
            --disable-werror

#    6.57. Gzip
# ----------------
# Eliminare le seguenti istruzioni

mv -v /usr/bin/gzip /bin

#    6.63. Sysklogd-1.5.1
# --------------------------
# Sostituire le seguenti istruzioni:

  "make BINDIR=/sbin install"

make BINDIR=/usr/sbin install

#    6.65 Eudev
# ----------------
# Sostituire le seguenti istruzioni:

  "./configure --prefix=/usr           \
               --bindir=/sbin          \
               --sbindir=/sbin         \
               --libdir=/usr/lib       \
               --sysconfdir=/etc       \
               --libexecdir=/lib       \
               --with-rootprefix=      \
               --with-rootlibdir=/lib  \
               --enable-manpages       \
               --disable-static        \
               --config-cache"

./configure \
  --prefix=/usr \
  --bindir=/usr/sbin \
  --sbindir=/usr/sbin \
  --libdir=/usr/lib \
  --sysconfdir=/etc \
  --libexecdir=/usr/lib \
  --with-rootprefix= \
  --with-rootlibdir=/usr/lib \
  --enable-manpages \
  --disable-static \
  --config-cache

#    6.66. Util-linux-2.28.1
# -----------------------------
# Sostituire le seguenti istruzioni:

  "./configure ADJTIME_PATH=/var/lib/hwclock/adjtime   \
               --docdir=/usr/share/doc/util-linux-2.28.1 \
               --disable-chfn-chsh  \
               --disable-login      \
               --disable-nologin    \
               --disable-su         \
               --disable-setpriv    \
               --disable-runuser    \
               --disable-pylibmount \
               --disable-static     \
               --without-python     \
               --without-systemd    \
               --without-systemdsystemunitdir"

./configure ADJTIME_PATH=/var/lib/hwclock/adjtime   \
            --bindir=/usr/bin \
            --sbindir=/usr/sbin \
            --libdir=/usr/lib \
            --exec-prefix=/usr \
            --docdir=/usr/share/doc/util-linux-2.28.1 \
            --disable-chfn-chsh  \
            --disable-login      \
            --disable-nologin    \
            --disable-su         \
            --disable-setpriv    \
            --disable-runuser    \
            --disable-pylibmount \
            --disable-static     \
            --without-python     \
            --without-systemd    \
            --without-systemdsystemunitdir

#    6.68. Tar-1.29
# --------------------
# Sostituire le seguenti istruzioni:

  "FORCE_UNSAFE_CONFIGURE=1  \
   ./configure --prefix=/usr \
               --bindir=/bin"

FORCE_UNSAFE_CONFIGURE=1  \
./configure --prefix=/usr \
            --bindir=/usr/bin

#    Archiviazione del sistema
# --------------------------------------------------------------------------------
L'archiviazione permetterà un riutilizzo futuro del sistea su altre postazione

#    Installazione degli archivi per la gestione dei pacchetti
# ------------------------------------------------------------------------------
Scompattare dalla directory root l0archivio 00_SLpack.txz, contenente il gestore
dei pacchetti e altri programmi di servizio

#    Compressione delle pagine man e info
# ------------------------------------------------------------------------------

#!/bin/bash
#---------------------------------------------------------------------------------------------------------
# AUTHOR flavio gallucci
# EMAIL  flavio.gallucci@gmail.com
# ScarTOzzoLinux 7.10
#---------------------------------------------------------------------------------------------------------
set -e
LFS="$1"                                        # Variabile LFS

COLORS="/usr/lib/pack/colors"
. "$COLORS"

#---------------------------------------------------------------------------------------------------------
#    Compatta pagine man/info, ricrea link simbolici
#---------------------------------------------------------------------------------------------------------
clear
if [[ -n "${LFS}" ]] || [[ -d "${LFS}" ]]; then     # Controllo variabile LFS
  shopt -s extglob
  for arg in $(find $LFS/usr/share/@(man|info)/ -type f | sort -rn); do
    dirman=$(dirname ${arg}); pagman=$(basename ${arg}); cd "${dirman}"
    if [[ $pagman != *gz ]]; then
      gzip -9f "${pagman}"; chown root:root "${pagman}.gz"; chmod 644 "${pagman}.gz"
    fi
  done
  for arg in $(find $LFS/usr/share/@(man|info)/ -type l | sort -rn); do
    dirman=$(dirname ${arg}); pagman=$(basename ${arg}); cd "${dirman}"
    if [[ ! -h ${pagman}.gz ]]; then
      ln -s $( readlink $pagman ).gz $pagman.gz; rm $pagman
    fi
  done
  shopt -u extglob
else
  echo ""
  echo -e "${b_ros}Comando${z}: ${b_cia}${0}${z} ${b_blu}directory LFS${z}"
  echo -e "Compatta pagine man/info e ricrea link simbolici in LFS"
  echo ""
  echo -e "${b_ros}Argomento obbligatorio${z}"
  echo -e "  ${b_blu}directory${z}   percorso LFS"
  echo ""
fi

#    Chroot / logout definitivo
# --------------------------------------------------------------------------------
export LFS=/mnt/lfs

mount -v --bind /dev $LFS/dev
mount -vt devpts devpts $LFS/dev/pts -o gid=5,mode=620
mount -vt proc proc $LFS/proc
mount -vt sysfs sysfs $LFS/sys
mount -vt tmpfs tmpfs $LFS/run
if [ -h $LFS/dev/shm ]; then
  mkdir -pv $LFS/$(readlink $LFS/dev/shm)
fi

chroot "$LFS" /usr/bin/env -i              \
    HOME=/root TERM="$TERM" PS1='\u:\w\$ ' \
    PATH=/bin:/usr/bin:/sbin:/usr/sbin     \
    /usr/bin/bash --login

logout

umount -v $LFS/dev/pts
umount -v $LFS/dev
umount -v $LFS/run
umount -v $LFS/proc
umount -v $LFS/sys


#    Configurazione del sistema
# --------------------------------------------------------------------------------

#    Chapter 7. System Configuration
# -------------------------------------

#    7.2. LFS-Bootscripts-20150222
# -------------------------------------
In SL il sistema di boot è stato revisionato e gli script di inizializzazione,
nonchè i demoni, risiedono nella directory /etc/rc.d.

##    8.3. Linux-4.7.2
## ----------------------

install -v -m755 -d /etc/modprobe.d
cat > /etc/modprobe.d/usb.conf << "EOF"
# Begin /etc/modprobe.d/usb.conf

install ohci_hcd /sbin/modprobe ehci_hcd ; /sbin/modprobe -i ohci_hcd ; true
install uhci_hcd /sbin/modprobe ehci_hcd ; /sbin/modprobe -i uhci_hcd ; true

# End /etc/modprobe.d/usb.conf
EOF

#    7.3. Overview of Device and Module Handling
#    7.3.3. Problems with Loading Modules and Creating Devices 
#    7.3.3.3. Udev loads some unwanted module
# ----------------------------------------------
Archivio con l'elenco dei moduli che il kernel non deve caricare.

touch /etc/modprobe.d/blacklist.conf

#    7.4. Managing Devices
#    7.4.1. Network Devices
#    7.4.1.2. Creating Custom Udev Rules
# -----------------------------------------
Genera le regole per la scheda di rete e quindi il file /etc/udev/rules.d/70-persistent-net.rules

bash /lib/udev/init-net-rules.sh

#    7.4.2. CD-ROM symlinks 
# ----------------------------

sed -i -e 's/"write_cd_rules"/"write_cd_rules by-id"/' \
    /etc/udev/rules.d/83-cdrom-symlinks.rules

##    Beyond Linux® From Scratch - Version 7.10
## -----------------------------------------------

##    Chapter 3. After LFS Configuration Issues
##    About Devices
##    Devices for DVD Drives
## ----------------------------

sed '1d;/SYMLINK.*cdrom/ a\
KERNEL=="sr0", ENV{ID_CDROM_DVD}=="1", SYMLINK+="dvd", OPTIONS+="link_priority=-100"' \
/lib/udev/rules.d/60-cdrom_id.rules > /etc/udev/rules.d/60-cdrom_id.rules

##    Archivio creato da me in alternativa la metodo precedente
## ---------------------------------------------------------------

cat > /udev/rules.d/70-persistent-cd.rules << "EOF"
# This file was automatically generated by the /lib/udev/write_cd_rules
# program, run by the cd-aliases-generator.rules rules file.
#
# You can modify it, as long as you keep each rule on a single
# line, and set the $GENERATED variable.

SUBSYSTEM=="block", ENV{ID_CDROM}=="?*", ENV{DEVNAME}=="/dev/sr0", SYMLINK+="cdrom", ENV{GENERATED}="1"
SUBSYSTEM=="block", ENV{ID_CDROM}=="?*", ENV{DEVNAME}=="/dev/sr0", SYMLINK+="cdrw", ENV{GENERATED}="1"
SUBSYSTEM=="block", ENV{ID_CDROM}=="?*", ENV{DEVNAME}=="/dev/sr0", SYMLINK+="dvd", ENV{GENERATED}="1"
SUBSYSTEM=="block", ENV{ID_CDROM}=="?*", ENV{DEVNAME}=="/dev/sr0", SYMLINK+="dvdrw", ENV{GENERATED}="1"
EOF

#    7.5. General Network Configuration
#    7.5.1. Creating Network Interface Configuration Files
# -----------------------------------------------------------
Il file proposto da LFS è modificato nel modo seguente

cd /etc/sysconfig/
cat > net_eth0 << "EOF"
# -------------------
#    eth0 generale
# -------------------
IFACE=eth0
SERVICE=ipv4
# SERVICE=dhcpcd

# eth0 IP statico
# ---------------
if [[ ${SERVICE} = 'ipv4' ]]; then
  # ONBOOT=yes
  LAN=192.168.1.0
  IP=192.168.1.130
  GATEWAY=                  # Lasciare in bianco nel caso di una sola rete locale
  PREFIX=24
  BROADCAST=192.168.1.255
  GATEWAY=192.168.1.254
fi

# eth0 IP dinamico dhcp
# ---------------------
if [[ ${SERVICE} = 'dhcpcd' ]]; then
#  ONBOOT=yes
  DHCP_START="-b -q"
  DHCP_STOP="-k"
fi
EOF


cat > net_eth1 << "EOF"
# -------------------
#    eth1 generale
# -------------------
IFACE=eth1
# SERVICE=ipv4-static
SERVICE=dhcpcd

# eth1 IP statico
# ---------------
if [[ ${SERVICE} = 'ipv4-static' ]]; then
  LAN=
  IP=
  GATEWAY=                  # Lasciare in bianco nel caso di una sola rete locale
  PREFIX=
  BROADCAST=
  GATEWAY=
fi

# eth1 IP dinamico dhcp
# ---------------------
if [[ ${SERVICE} = 'dhcpcd' ]]; then
#  ONBOOT=yes
  DHCP_START="-b -q"
  DHCP_STOP="-k"
fi
EOF


cat > net_wlan0 << "EOF"
# wlan0 IP dinamico dhcp
# ----------------------
# ONBOOT=yes
IFACE=wlan0
# SERVICE=wpa
WPA_ARGS=""
DHCP_START="-b -q"
DHCP_STOP="-k"
EOF

#    7.5.2. Creating the /etc/resolv.conf File 
# -----------------------------------------------

cat > /etc/resolv.conf << "EOF"
# Begin /etc/resolv.conf

domain <Your Domain Name>
nameserver <IP address of your primary nameserver>
nameserver <IP address of your secondary nameserver>

# End /etc/resolv.conf
EOF


cat > /etc/resolv.conf << "EOF"
# Begin /etc/resolv.conf

domain fastwebnet.it
nameserver 62.101.93.101
nameserver 83.103.25.250

# Comando per impedire a dhcpcd di sovrascrivere
# In alternativa creare un file aggiuntivo "resolv.conf.head"
# nohook resolv.conf

# The Google Public IPv4 DNS addresses: 8.8.8.8 and 8.8.4.4
# OpenDNS servers addresses: 208.67.222.222 and 208.67.220.220

# End /etc/resolv.conf
EOF


cat > /etc/resolv.conf.head << "EOF"
# Begin /etc/resolv.conf

domain fastwebnet.it
nameserver 62.101.93.101
nameserver 83.103.25.250

# The Google Public IPv4 DNS addresses: 8.8.8.8 and 8.8.4.4
# OpenDNS servers addresses: 208.67.222.222 and 208.67.220.220

# End /etc/resolv.conf
EOF

#    7.5.3. Configuring the system hostname
# --------------------------------------------

echo "<lfs>" > /etc/hostname

echo "diwan" > /etc/hostname

#    7.5.4. Customizing the /etc/hosts File
# --------------------------------------------

cat > /etc/hosts << "EOF"
# Begin /etc/hosts (network card version)

127.0.0.1 localhost
127.0.0.1 diwan.fastwebnet.it diwan
192.168.1.130 diwan.fastwebnet.it diwan

# End /etc/hosts (network card version)
EOF

#    7.6. System V Bootscript Usage and Configuration
#    7.6.2. Configuring Sysvinit 
# ------------------------------------------------------

cat > /etc/inittab << "EOF"
id:5:initdefault:

si:S:sysinit:/etc/rc.d/rc.sysinit

l0:0:wait:/etc/rc.d/rc.0
l1:1:wait:/etc/rc.d/rc.1
l2:2:wait:/etc/rc.d/rc.2
l3:3:wait:/etc/rc.d/rc.3
l4:4:wait:/etc/rc.d/rc.4
l5:5:wait:/etc/rc.d/rc.5
l6:6:wait:/etc/rc.d/rc.6

ca:12345:ctrlaltdel:/sbin/shutdown -t1 -r now

su:S016:once:/sbin/sulogin

c1:2345:respawn:/sbin/agetty --noclear tty1 38400 linux
c2:2345:respawn:/sbin/agetty tty2 38400 linux
c3:2345:respawn:/sbin/agetty tty3 38400 linux
c4:2345:respawn:/sbin/agetty tty4 38400 linux
c5:2345:respawn:/sbin/agetty tty5 38400 linux
c6:2345:respawn:/sbin/agetty tty6 38400 linux

# x:5:respawn:/usr/bin/slim >& /dev/null
EOF

#    7.6.4. Configuring the System Clock
# -----------------------------------------

cat > /etc/sysconfig/clock << "EOF"
# Begin /etc/sysconfig/clock

UTC=1

# Set this to any options you might need to give to hwclock,
# such as machine hardware clock type for Alphas.
CLOCKPARAMS=

# End /etc/sysconfig/clock
EOF

#    7.6.5. Configuring the Linux Console
# ------------------------------------------

cat > /etc/sysconfig/console << "EOF"
# Begin /etc/sysconfig/console

# UNICODE="1"
# KEYMAP="it_IT.UTF-8"
# KEYMAP_CORRECTIONS="euro2"
KEYMAP="it"
FONT="lat0-16"

# End /etc/sysconfig/console
EOF

#    7.6.7. Configuring the sysklogd Script
# --------------------------------------------
SYSKLOGD_PARMS=

#    7.6.8. The rc.site File
# -----------------------------

cat > /etc/sysconfig/rc.site << "EOF"
# rc.site
# Optional parameters for boot scripts.

# Distro Information
# These values, if specified here, override the defaults
#DISTRO="Linux From Scratch" # The distro name
#DISTRO_CONTACT="lfs-dev@linuxfromscratch.org" # Bug report address
#DISTRO_MINI="LFS" # Short name used in filenames for distro config

# Define custom colors used in messages printed to the screen

# Please consult `man console_codes` for more information
# under the "ECMA-48 Set Graphics Rendition" section
#
# Warning: when switching from a 8bit to a 9bit font,
# the linux console will reinterpret the bold (1;) to
# the top 256 glyphs of the 9bit font.  This does
# not affect framebuffer consoles

# These values, if specified here, override the defaults
#BRACKET="\\033[1;34m" # Blue
#FAILURE="\\033[1;31m" # Red
#INFO="\\033[1;36m"    # Cyan
#NORMAL="\\033[0;39m"  # Grey
#SUCCESS="\\033[1;32m" # Green
#WARNING="\\033[1;33m" # Yellow

# Use a colored prefix
# These values, if specified here, override the defaults
#BMPREFIX="     "
#SUCCESS_PREFIX="${SUCCESS}  *  ${NORMAL}"
#FAILURE_PREFIX="${FAILURE}*****${NORMAL}"
#WARNING_PREFIX="${WARNING} *** ${NORMAL}"

# Manually seet the right edge of message output (characters)
# Useful when resetting console font during boot to override
# automatic screen width detection
#COLUMNS=120

# Interactive startup
#IPROMPT="yes" # Whether to display the interactive boot prompt
#itime="3"    # The amount of time (in seconds) to display the prompt

# The total length of the distro welcome string, without escape codes
#wlen=$(echo "Welcome to ${DISTRO}" | wc -c )
#welcome_message="Welcome to ${INFO}${DISTRO}${NORMAL}"

# The total length of the interactive string, without escape codes
#ilen=$(echo "Press 'I' to enter interactive startup" | wc -c )
#i_message="Press '${FAILURE}I${NORMAL}' to enter interactive startup"

# Set scripts to skip the file system check on reboot
#FASTBOOT=yes

# Skip reading from the console
#HEADLESS=yes

# Write out fsck progress if yes
#VERBOSE_FSCK=no

# Speed up boot without waiting for settle in udev
#OMIT_UDEV_SETTLE=y

# Speed up boot without waiting for settle in udev_retry
#OMIT_UDEV_RETRY_SETTLE=yes

# Skip cleaning /tmp if yes
#SKIPTMPCLEAN=no

# For setclock
#UTC=1
#CLOCKPARAMS=

# For consolelog (Note that the default, 7=debug, is noisy)
#LOGLEVEL=7

# For network
#HOSTNAME=mylfs

# Delay between TERM and KILL signals at shutdown
#KILLDELAY=3

# Optional sysklogd parameters
#SYSKLOGD_PARMS="-m 0"

# Console parameters
#UNICODE=1
#KEYMAP="de-latin1"
#KEYMAP_CORRECTIONS="euro2"
#FONT="lat0-16 -m 8859-15"
#LEGACY_CHARSET=
EOF

#    7.8. Creazione del file /etc/inputrc
# ------------------------------------------

cat > /etc/inputrc << "EOF"
# Begin /etc/inputrc
# Modified by Chris Lynn <roryo@roryo.dynup.net>

# Allow the command prompt to wrap to the next line
set horizontal-scroll-mode Off

# Enable 8bit input
set meta-flag On
set input-meta On

# Turns off 8th bit stripping
set convert-meta Off

# Keep the 8th bit for display
set output-meta On

# none, visible or audible
set bell-style none

# All of the following map the escape sequence of the
# value contained inside the 1st argument to the 
# readline specific functions

"\eOd": backward-word
"\eOc": forward-word

# for linux console
"\e[1~": beginning-of-line
"\e[4~": end-of-line
"\e[5~": beginning-of-history
"\e[6~": end-of-history
"\e[3~": delete-char
"\e[2~": quoted-insert

# for xterm
"\eOH": beginning-of-line
"\eOF": end-of-line

# for Konsole
"\e[H": beginning-of-line
"\e[F": end-of-line

# End /etc/inputrc
EOF

#    7.9. Creating the /etc/shells File
# ----------------------------------------

cat > /etc/shells << "EOF"
# Begin /etc/shells

/bin/sh
/bin/bash

# End /etc/shells
EOF


#    Chapter 8. Making the LFS System Bootable
#    8.2. Creating the /etc/fstab File
# -----------------------------------------------

cat > /etc/fstab << "EOF"
# Begin /etc/fstab

# file system  mount-point  type     options             dump  fsck
#                                                              order

/dev/<xxx>     /            <fff>    defaults            1     1
/dev/<yyy>     swap         swap     pri=1               0     0
proc           /proc        proc     nosuid,noexec,nodev 0     0
sysfs          /sys         sysfs    nosuid,noexec,nodev 0     0
devpts         /dev/pts     devpts   gid=5,mode=620      0     0
tmpfs          /run         tmpfs    defaults            0     0
devtmpfs       /dev         devtmpfs mode=0755,nosuid    0     0

# End /etc/fstab
EOF


cat > /etc/fstab << "EOF"
# Begin /etc/fstab

# file system  mount-point  type     options             dump  fsck
#                                                              order

/dev/sda1      /                ext4     defaults            1     1
/dev/sda2      swap             swap     pri=1               0     0
proc           /proc            proc     nosuid,noexec,nodev 0     0
sysfs          /sys             sysfs    nosuid,noexec,nodev 0     0
devpts         /dev/pts         devpts   gid=5,mode=620      0     0
tmpfs          /run             tmpfs    defaults            0     0
devtmpfs       /dev             devtmpfs mode=0755,nosuid    0     0

# End /etc/fstab
EOF

#    Chapter 9. The End
#    9.1. The End
# ------------------------

echo 7.10 > /etc/lfs-release
echo 7.10 > /etc/sl-release


#    Beyond Linux® From Scratch - Version 7.10
# -----------------------------------------------

#    Chapter 3. After LFS Configuration Issues
#    About Console Fonts
# -----------------------------------------------
??? VEDERE

#    About Firmware
# --------------------
??? VEDERE

#     Configuring for Adding Users
# -----------------------------------
useradd -m <newuser>

#     About System Users and Groups
# ------------------------------------
cat > /etc/group << "EOF"
root:x:0:
bin:x:1:daemon
sys:x:2:
kmem:x:3:
tape:x:4:
tty:x:5:
daemon:x:6:
floppy:x:7:
disk:x:8:
lp:x:9:
dialout:x:10:
audio:x:11:
video:x:12:
utmp:x:13:
usb:x:14:
cdrom:x:15:
adm:x:16:
atd:x:17:
messagebus:x:18:
lpadmin:x:19:
fcron:x:22:
input:x:24:
apache:x:25:
mail:x:34:
mysql:x:40:
rsyncd:x:48:
sshd:x:50:
stunnel:x:51:
kvm:x:61:
wireshark:x:62:
scanner:x:70:
avahi:x:84:
netdev:x:86:
ntp:x:87:
davfs2:x:88:
plugdev:x:90:
nogroup:x:99:
users:x:999:
EOF

cat > /etc/passwd << "EOF"
root:x:0:0:root:/root:/bin/bash
bin:x:1:1:bin:/dev/null:/bin/false
daemon:x:6:6:Daemon User:/dev/null:/bin/false
lp:x:9:9:Print Service User:/var/spool/cups:/bin/false
atd:x:17:17:atd daemon:/dev/null:/bin/false
messagebus:x:18:18:D-Bus Message Daemon User:/var/run/dbus:/bin/false
fcron:x:22:22:Fcron User:/dev/null:/bin/false
apache:x:25:25:Apache Server:/srv/www:/bin/false
mysql:x:40:40:MySQL Server:/srv/mysql:/bin/false
rsyncd:x:48:48:rsyncd Daemon:/home/rsync:/bin/false
sshd:x:50:50:sshd PrivSep:/var/lib/sshd:/bin/false
stunnel:x:51:51:stunnel Daemon:/var/lib/stunnel:/bin/false
davfs2:x:88:88::/var/cache/davfs2:/bin/false
avahi:x:84:84:Avahi Daemon Owner:/var/run/avahi-daemon:/bin/false
ntp:x:87:87:Network Time Protocol:/var/lib/ntp:/bin/false
nobody:x:99:99:Unprivileged User:/dev/null:/bin/false
EOF

install /etc/group /etc/group-
install /etc/passwd /etc/passwd-


#    The Bash Shell Startup Files
# ----------------------------------

#    /etc/profile
# ------------------
cat > /etc/profile << "EOF"
# Begin /etc/profile
# Written for Beyond Linux From Scratch
# by James Robertson <jameswrobertson@earthlink.net>
# modifications by Dagmar d'Surreal <rivyqntzne@pbzpnfg.arg>

# System wide environment variables and startup programs.

# System wide aliases and functions should go in /etc/bashrc.  Personal
# environment variables and startup programs should go into
# ~/.bash_profile.  Personal aliases and functions should go into
# ~/.bashrc.

# Functions to help us manage paths.  Second argument is the name of the
# path variable to be modified (default: PATH)
pathremove () {
        local IFS=':'
        local NEWPATH
        local DIR
        local PATHVARIABLE=${2:-PATH}
        for DIR in ${!PATHVARIABLE} ; do
                if [ "$DIR" != "$1" ] ; then
                  NEWPATH=${NEWPATH:+$NEWPATH:}$DIR
                fi
        done
        export $PATHVARIABLE="$NEWPATH"
}

pathprepend () {
        pathremove $1 $2
        local PATHVARIABLE=${2:-PATH}
        export $PATHVARIABLE="$1${!PATHVARIABLE:+:${!PATHVARIABLE}}"
}

pathappend () {
        pathremove $1 $2
        local PATHVARIABLE=${2:-PATH}
        export $PATHVARIABLE="${!PATHVARIABLE:+${!PATHVARIABLE}:}$1"
}

export -f pathremove pathprepend pathappend

# Set the initial path
export PATH=/bin:/usr/bin

if [ $EUID -eq 0 ] ; then
        pathappend /sbin:/usr/sbin
        unset HISTFILE
fi

# Setup some environment variables.
export HISTSIZE=20000
export HISTIGNORE="&:[bf]g:exit"

# Set some defaults for graphical systems
export XDG_DATA_DIRS=/usr/share/
export XDG_CONFIG_DIRS=/etc/xdg/

# Setup a red prompt for root and a green one for users.
NORMAL="\[\e[0m\]"
RED="\[\e[1;31m\]"
GREEN="\[\e[1;32m\]"
if [[ $EUID == 0 ]] ; then
  PS1="$RED\u [ $NORMAL\w$RED ]# $NORMAL"
else
  PS1="$GREEN\u [ $NORMAL\w$GREEN ]\$ $NORMAL"
fi

for script in /etc/profile.d/*.sh ; do
        if [ -r $script ] ; then
                . $script
        fi
done

unset script RED GREEN NORMAL

# End /etc/profile
EOF

#    The /etc/profile.d Directory
# ----------------------------------

install --directory --mode=0755 --owner=root --group=root /etc/profile.d

#    /etc/profile.d/dircolors.sh
# ---------------------------------

cat > /etc/profile.d/dircolors.sh << "EOF"
# Setup for /bin/ls and /bin/grep to support color, the alias is in /etc/bashrc.
if [ -f "/etc/dircolors" ] ; then
        eval $(dircolors -b /etc/dircolors)
fi

if [ -f "$HOME/.dircolors" ] ; then
        eval $(dircolors -b $HOME/.dircolors)
fi

alias ls='ls --color=auto'
alias grep='grep --color=auto'
EOF

#    /etc/profile.d/extrapaths.sh
# ----------------------------------

cat > /etc/profile.d/extrapaths.sh << "EOF"
if [ -d /usr/local/lib/pkgconfig ] ; then
        pathappend /usr/local/lib/pkgconfig PKG_CONFIG_PATH
fi
if [ -d /usr/local/bin ]; then
        pathprepend /usr/local/bin
fi
if [ -d /usr/local/sbin -a $EUID -eq 0 ]; then
        pathprepend /usr/local/sbin
fi

# Set some defaults before other applications add to these paths.
pathappend /usr/share/man  MANPATH
pathappend /usr/share/info INFOPATH
EOF

#    /etc/profile.d/readline.sh
# --------------------------------

cat > /etc/profile.d/readline.sh << "EOF"
# Setup the INPUTRC environment variable.
if [ -z "$INPUTRC" -a ! -f "$HOME/.inputrc" ] ; then
        INPUTRC=/etc/inputrc
fi
export INPUTRC
EOF

#    /etc/profile.d/umask.sh
# -----------------------------

cat > /etc/profile.d/umask.sh << "EOF"
# By default, the umask should be set.
if [ "$(id -gn)" = "$(id -un)" -a $EUID -gt 99 ] ; then
  umask 002
else
  umask 022
fi
EOF

#    /etc/profile.d/i18n.sh
# ----------------------------

cat > /etc/profile.d/i18n.sh << "EOF"
# Set up i18n variables
export LANG=it_IT
# export LANG=it_IT.UTF-8
EOF

#    /etc/bashrc
# -----------------

cat > /etc/bashrc << "EOF"
# Begin /etc/bashrc
# Written for Beyond Linux From Scratch
# by James Robertson <jameswrobertson@earthlink.net>
# updated by Bruce Dubbs <bdubbs@linuxfromscratch.org>

# System wide aliases and functions.

# System wide environment variables and startup programs should go into
# /etc/profile.  Personal environment variables and startup programs
# should go into ~/.bash_profile.  Personal aliases and functions should
# go into ~/.bashrc

# Provides colored /bin/ls and /bin/grep commands.  Used in conjunction
# with code in /etc/profile.

alias ls='ls --color=auto'
alias grep='grep --color=auto'

# Provides prompt for non-login shells, specifically shells started
# in the X environment. [Review the LFS archive thread titled
# PS1 Environment Variable for a great case study behind this script
# addendum.]

NORMAL="\[\e[0m\]"
RED="\[\e[1;31m\]"
GREEN="\[\e[1;32m\]"
if [[ $EUID == 0 ]] ; then
  PS1="$RED\u [ $NORMAL\w$RED ]# $NORMAL"
else
  PS1="$GREEN\u [ $NORMAL\w$GREEN ]\$ $NORMAL"
fi

unset RED GREEN NORMAL

# End /etc/bashrc
EOF


#    ~/.bash_profile
# ---------------------

cat > /etc/skel/.bash_profile << "EOF"
# Begin ~/.bash_profile
# Written for Beyond Linux From Scratch
# by James Robertson <jameswrobertson@earthlink.net>
# updated by Bruce Dubbs <bdubbs@linuxfromscratch.org>

# Personal environment variables and startup programs.

# Personal aliases and functions should go in ~/.bashrc.  System wide
# environment variables and startup programs are in /etc/profile.
# System wide aliases and functions are in /etc/bashrc.

if [ -f "$HOME/.bashrc" ] ; then
  source $HOME/.bashrc
fi

if [ -d "$HOME/bin" ] ; then
  pathprepend $HOME/bin
fi

# Having . in the PATH is dangerous
#if [ $EUID -gt 99 ]; then
#  pathappend .
#fi

# End ~/.bash_profile
EOF

install /etc/skel/.bash_profile /root

#    ~/.bashrc
# ---------------

cat > /etc/skel/.bashrc << "EOF"
# Begin ~/.bashrc
# Written for Beyond Linux From Scratch
# by James Robertson <jameswrobertson@earthlink.net>

# Personal aliases and functions.

# Personal environment variables and startup programs should go in
# ~/.bash_profile.  System wide environment variables and startup
# programs are in /etc/profile.  System wide aliases and functions are
# in /etc/bashrc.

if [ -f "/etc/bashrc" ] ; then
  source /etc/bashrc
fi

# End ~/.bashrc
EOF

install /etc/skel/.bashrc  /root

#    ~/.bash_logout
# --------------------

cat > /etc/skel/.bash_logout << "EOF"
# Begin ~/.bash_logout
# Written for Beyond Linux From Scratch
# by James Robertson <jameswrobertson@earthlink.net>

# Personal items to perform on logout.

# End ~/.bash_logout
EOF

install /etc/skel/.bash_logout /root

#    /etc/dircolors
# --------------------

dircolors -p > /etc/dircolors
dircolors -p > /etc/skel/.dircolors
dircolors -p > /root/.dircolors

#    The /etc/vimrc and ~/.vimrc Files
# ---------------------------------------

cat > /etc/vimrc << "EOF"
" Begin /etc/vimrc

set nocompatible
set backspace=2
# set spelllang=it,en
# set spell

syntax on
if (&term == "iterm") || (&term == "putty")
  set background=dark
endif

set columns=80
set wrapmargin=8
set ruler

" End /etc/vimrc
EOF

install /etc/vimrc /etc/skel/.vimrc
install /etc/vimrc /root/.vimrc

#    Customizing your Logon with /etc/issue
# --------------------------------------------

touch /etc/issue

#    /etc/skel/.Xresources
# ---------------------------
cat > /etc/skel/.Xresources << "EOF"
! ~/.Xresources

! -----------
!    URxvt
! -----------
URxvt*loginShell: true
URxvt.geometry: 180x60
URxvt.scrollstyle: xterm
URxvt.secondaryScreen: 1
URxvt.secondaryScroll: 0
!URxvt.pointerColor: 
!URxvt*perl-ext: matcher
!URxvt*urlLauncher: firefox
URxvt.saveLines: 10000
URxvt.background: black
!URxvt.foreground: yellow
!URxvt.foreground: grey40
URxvt.foreground: grey40
URxvt.iconFile:/usr/share/icons/nouveGnome/48x48/apps/utilities-terminal.png

!URxvt*font: xft:Monospace:pixelsize=10,5
!URxvt*font: xft:Free Mono:size=8
!URxvt*font: xft:Cantarell Regular:size=8
!URxvt.letterSpace: -4
!URxvt*font: xft:DejaVu Sans Mono:size=8
URxvt.font: 7x13bold
!URxvt.letterSpace: +1

URxvt.scrollBar: false

URxvt*.transparent: true
! URxvt*.shading: 0 to 99 darkens, 101 to 200 lightens
URxvt*.shading: 30

URxvt.cursorColor:  #dc74d1
URxvt.pointerColor: #dc74d1
!URxvt.background:   #0e0e0e
!URxvt.foreground:   #4ad5e1

!black
URxvt.color0:       #000000
URxvt.color8:       #8b8f93

!red
!URxvt.color1:       #FF5E5E
!URxvt.color9:       #FF7878
URxvt.color1:       #990000
URxvt.color9:       #993333

!green
!URxvt.color2:       #9CE82B
!URxvt.color10:      #9ACD32
URxvt.color2:       #4C9900
URxvt.color10:      #336600

!yellow
URxvt.color3:       #F0E68C
URxvt.color11:      #EEE8AA

!blue
!URxvt.color4:       #008AFF
!URxvt.color12:      #4F98FF
URxvt.color4:       #0000CC
URxvt.color12:      #0066CC

!magenta
!URxvt.color5:       #E88CFF
!URxvt.color13:      #EDA6FF
URxvt.color5:       #FF33FF
URxvt.color13:      #9933FF

!cyan
!URxvt.color6:       #87CEFA
URxvt.color6:       #1A84A4
URxvt.color14:      #B0E2FF

!white
URxvt.color7:       #DCDCCC
URxvt.color15:      #FFFFFF

!Corlored Manpage
URxvt.colorIT:      #87af5f
URxvt.colorBD:      #d7d7d7
URxvt.colorUL:      #87afd7

! -----------
!    XTerm
! -----------
!colore di sfondo
XTerm*background: grey2

!colore del testo
 XTerm*foreground: grey40

!colore del cursore
!XTerm*cursorColor: darkorange1

!niente barra di scorrimento
 XTerm*scrollBar: false

! http://invisible-island.net/xterm/xterm.faq.html#tiny_menus
!dimensione predefinita
 XTerm.VT100.geometry: 180x60

!modalità UTF-8 permanente
 XTterm*utf8: 2

!256 colori
 XTerm*termName: xterm-256color

!font TrueType con antialiasing
XTerm*faceName: xft:Dejavu Sans Mono:size=8
!XTerm*faceName: xft:Cantarell Regular:size=8
!XTerm*faceName:          Cantarell Regular
!XTerm*faceName:          DejaVu Sans Mono
!XTerm*faceSize:          8

!xfont:
!XTerm*font: -misc-fixed-bold-r-normal--13-120-75-75-c-70-iso8859-1
!XTerm*font: -misc-fixed-bold-r-semicondensed--13-120-75-75-c-60-iso8859-1
!XTerm*font: -misc-fixed-medium-r-normal--10-100-75-75-c-60-iso8859-1

!numero di linee da mantenere nello scrollbuffer
 XTerm*saveLines: 10000

!le combinazioni di tasti con Meta (Alt) vengono convertite in una sequenza ad 8-bit,
!necessario affinché ad esempio si possa usare alt-numero per spostarsi tra le finestre in irssi
 XTerm*metaSendsEscape: true

!il triplo click per selezionare una riga non include il Newline
!(\n, la sequenza che manda a capo la riga, si veda man echo) alla fine
 XTerm*cutNewline: false

!abilita e specifica un attributo colore per il testo in grassetto
 XTerm*colorBDMode: true
 XTerm*colorBD: khaki

!abilita e specifica un attributo colore per il testo sottolineato
 XTerm*colorULMode: true
 XTerm*colorUL: tomato

!i caratteri da includere nella selezione del testo con il doppio click
!sono gruppi di numeri nella forma codice:valore e divisi da una virgola,
!il 48 è arbitrario ma il manuale lo usa come esempio e ci affidiamo a questo valore
!per aggiungere e modificare usare quindi la forma codice:48,
!vedere man xterm | less -p 'CHARACTER CLASSES' per la tabella di riferimento
!prendendo ad esempio il primo gruppo 33:48, 33 equivale al punto esclamativo
 XTerm*charClass: 33:48,35:48,37:48,43:48,45-47:48,64:48,95:48,126:48,35:48,58:48,63:48,61:48,44:48,38:48,59:48

!colori personalizzati per il testo usati in vari programmi
!da 0 a 7 per il testo normale, da 8 a 15 per il grassetto

!black
 XTerm*color0:	#171717
 XTerm*color8:	#737373
!red
!XTerm*color1:	#FF5E5E
!XTerm*color9:	#FF7878
XTerm*color1:   #990000
XTerm*color9:   #993333
!green
!XTerm*color2:	#9CE82B
!XTerm*color10:	#9ACD32
XTerm*color2:   #4C9900
XTerm*color10:  #336600
!yellow
 XTerm*color3:	#F0E68C
 XTerm*color11:	#EEE8AA
!blue
!XTerm*color4:	#008AFF
!XTerm*color12:	#4F98FF
XTerm*color4:   #0000CC
XTerm*color12:  #0066CC
!magenta
!XTerm*color5:	#E88CFF
!XTerm*color13:	#EDA6FF
XTerm*color5:   #FF33FF
XTerm*color13:  #9933FF
!cyan
!XTerm*color6:	#87CEFA
!XTerm*color14:	#B0E2FF
XTerm*color6:   #1A84A4
XTerm*color14:  #B0E2FF
!white
 XTerm*color7:	#DCDCCC
 XTerm*color15:	#FFFFFF


! ------------------
!    xscreensaver
! ------------------
!font settings
xscreensaver.Dialog.headingFont:        -*-georgia-bold-r-*-*-18-*-*-*-*-*-*-*
xscreensaver.Dialog.bodyFont:           -*-georgia-medium-r-*-*-18-*-*-*-*-*-*-*
xscreensaver.Dialog.labelFont:          -*-georgia-medium-r-*-*-18-*-*-*-*-*-*-*
xscreensaver.Dialog.unameFont:          -*-georgia-medium-r-*-*-18-*-*-*-*-*-*-*
xscreensaver.Dialog.buttonFont:         -*-georgia-bold-r-*-*-18-*-*-*-*-*-*-*
xscreensaver.Dialog.dateFont:           -*-georgia-medium-r-*-*-18-*-*-*-*-*-*-*
xscreensaver.passwd.passwdFont:         -*-georgia-bold-r-*-*-18-*-*-*-*-*-*-*

!general dialog box (affects main hostname, username, password text)
xscreensaver.Dialog.foreground:         #00efef
xscreensaver.Dialog.background:         #111111
xscreensaver.Dialog.topShadowColor:     #111111
xscreensaver.Dialog.bottomShadowColor:  #111111
xscreensaver.Dialog.Button.foreground:  #111111
xscreensaver.Dialog.Button.background:  #2040e0

!username/password input box and date text colour
xscreensaver.Dialog.text.foreground:    #2040e0
xscreensaver.Dialog.text.background:    #efefef
xscreensaver.Dialog.internalBorderWidth:36
xscreensaver.Dialog.borderWidth:        0
xscreensaver.Dialog.shadowThickness:    2

!timeout bar (background is actually determined by Dialog.text.background)
xscreensaver.passwd.thermometer.foreground:  #2040e0
xscreensaver.passwd.thermometer.background:  #2040e0
xscreensaver.passwd.thermometer.width:       0

!datestamp format--see the strftime(3) manual page for details
xscreensaver.dateFormat:    %I:%M%p - %a %b %d, %Y
EOF

install /etc/skel/.Xresources /root


#    /etc/sysconfig/modules
# ----------------------------

cat > /etc/sysconfig/modules << "EOF"
########################################################################
# Begin /etc/sysconfig/modules
#
# Description : Module auto-loading configuration
#
# Authors     :
#
# Version     : 00.00
#
# Notes       : The syntax of this file is as follows:
#               <module> [<arg1> <arg2> ...]
#
# Each module should be on it's own line, and any options that you want
# passed to the module should follow it.  The line deliminator is either
# a space or a tab.
########################################################################

# End /etc/sysconfig/modules
EOF

#    /etc/sysconfig/createfiles
# --------------------------------

cat > /etc/sysconfig/createfiles << "EOF"
########################################################################
# Begin /etc/sysconfig/createfiles
#
# Description : Createfiles script config file
#
# Authors     :
#
# Version     : 00.00
#
# Notes       : The syntax of this file is as follows:
#               if type is equal to "file" or "dir"
#               <filename> <type> <permissions> <user> <group>
#               if type is equal to "dev"
#               <filename> <type> <permissions> <user> <group> <devtype> 
#             <major> <minor>
#
#               <filename> is the name of the file which is to be created
#               <type> is either file, dir, or dev.
#                       file creates a new file
#                       dir creates a new directory
#                       dev creates a new device
#               <devtype> is either block, char or pipe
#                       block creates a block device
#                       char creates a character deivce
#                       pipe creates a pipe, this will ignore the <major> and 
#           <minor> fields
#               <major> and <minor> are the major and minor numbers used for 
#     the device.
########################################################################

/tmp/.ICE-unix dir 1777 root root
/tmp/.X11-unix dir 1777 root root

# End /etc/sysconfig/createfiles
EOF

#    /etc/sysconfig/mouse
# --------------------------

cat > /etc/sysconfig/mouse << "EOF"
# Begin /etc/sysconfig/mouse

MDEVICE="/dev/input/mice"
PROTOCOL="imps2"
GPMOPTS=""

# End /etc/sysconfig/mouse
EOF

#    /etc/sysconfig/wpa_supplicant.conf
# ----------------------------------------

cat > /etc/sysconfig/wpa_supplicant.conf << "EOF"
network={
        ssid="gallucciflavio"
        scan_ssid=1
        key_mgmt=WPA-PSK
        #psk="giorgia2004"
        psk=df71dd22baa1841736a6fbf358674836eeb7eb54f11edf3254fe9c1e6cc09036
}
EOF

#    /etc/sysconfig/mouse
# --------------------------

cat > /etc/sysconfig/udev_retry << "EOF"
########################################################################
# Begin /etc/sysconfig/udev_retry
#
# Description : udev_retry script configuration
#
# Authors     :
#
# Version     : 00.00
#
# Notes       : Each subsystem that may need to be re-triggered after mountfs
#               runs should be listed in this file.  Probable subsystems to be
#               listed here are rtc (due to /var/lib/hwclock/adjtime) and sound
#               (due to both /var/lib/alsa/asound.state and /usr/sbin/alsactl).
#               Entries are whitespace-separated.
########################################################################

rtc

# End /etc/sysconfig/udev_retry
EOF

#    /usr/lib/services/dhcp
# ----------------------------

cat > /usr/lib/services/dhcp << "EOF"
#!/bin/sh

IFACE="$1"

HELP () {
  echo "Usage: $0 [interface] {up|down}"
}

if [[ ! -n "$IFACE" ]]; then
  HELP && exit
fi

. /etc/rc.d/rc.functions
. /etc/sysconfig/net_${IFACE}

case "$2" in
  up)
    log_info_msg "Bringing up the ${IFACE} network interface dhcpcd..."
    pidfile="/var/run/dhcpcd-${IFACE}.pid"
    if [ -f "$pidfile" ]; then
      ps `cat "$pidfile"` | grep dhcpcd > /dev/null
      if [ "$?" != 0 ]; then
        rm -f /var/run/dhcpcd-${IFACE}.pid > /dev/null
      else
        log_warning_msg "dhcpcd is already running!"
        exit 2
      fi
    fi
    /sbin/dhcpcd ${IFACE} ${DHCP_START}
    evaluate_retval
    ;;

  down)
    log_info_msg "Stopping ${IFACE} network interface dhcpcd..."
    /sbin/dhcpcd ${IFACE} ${DHCP_STOP} &> /dev/null
    if [ "$?" -eq 1 ]; then
      log_warning_msg "dhcpcd not running!"
      exit 2
    fi
    evaluate_retval
    ;;

  *)
    HELP
    exit 1
    ;;
esac
EOF

#    /usr/lib/services/ipv4
# ----------------------------

cat > /usr/lib/services/ipv4 << "EOF"
#!/bin/sh

IFACE="$1"

. /etc/rc.d/rc.functions
. /etc/sysconfig/net_${IFACE}

case "$2" in
  up)
    log_info_msg "Bringing up the ${IFACE} network interface ipv4-static..."
    if [[ $(ip link | grep -q ${IFACE} | grep -q 'state UP') ]]; then
      log_warning_msg "Service already up..."
      exit 0
    fi
    /sbin/ip addr flush dev ${IFACE}
    /sbin/ip addr add ${IP}/${PREFIX} broadcast ${BROADCAST} dev ${IFACE}
    /sbin/ip link set ${IFACE} up
    if [[ -n "$GATEWAY" ]]; then
      /sbin/ip route add default via ${GATEWAY}
    fi
    evaluate_retval
    ;;

  down)
    log_info_msg "Stopping ${IFACE} network interface ipv4-static..."
    if [[ $(ip link | grep -q ${IFACE} | grep -q 'state DOWN') ]]; then
      log_warning_msg "Service already down..."
      exit 0
    fi
    /sbin/ip link set ${IFACE} down
    evaluate_retval
    ;;

  *)
    echo "Usage: $0 [interface] {up|down}"
    exit 1
    ;;
esac
EOF

#    /usr/lib/services/wpa
# ---------------------------

cat > /usr/lib/services/wpa << "EOF"
#!/bin/sh

IFACE="$1"
HELP () {
  echo "Usage: $0 [interface] {up|down}"
}

if [[ ! -n "$IFACE" ]]; then
  HELP && exit
fi

. /etc/rc.d/rc.functions
. /etc/sysconfig/net_${IFACE}

CFGFILE=/etc/sysconfig/wpa_supplicant.conf
PIDFILE=/run/wpa_supplicant/wlan0.pid
CONTROL_IFACE=/run/wpa_supplicant/wlan0

case "$2" in
  up)
    if [[ -e ${PIDFILE} ]]; then
      ps $(cat ${PIDFILE}) | grep wpa_supplicant >/dev/null
      if [[ "$?" = "0" ]]; then
        log_warning_msg "wpa_supplicant already running on ${IFACE}"
        exit 0
      else
        rm ${PIDFILE}
      fi
    fi
    if [ ! -e ${CFGFILE} ]; then
      log_info_msg "wpa_supplicant configuration file ${CFGFILE} not present"
      log_failure_msg2
      exit 1
    fi
    log_info_msg "Starting wpa_supplicant on the wlan0 interface..."
    mkdir -p /run/wpa_supplicant
    /sbin/wpa_supplicant -q -B -Dnl80211,wext -P${PIDFILE} -C/run/wpa_supplicant -c${CFGFILE} -i${IFACE} ${WPA_ARGS}
    if [[ "$?" != "0" ]]; then
      log_failure_msg2
      exit 1
    fi
    log_success_msg2
    ;;

  down)
    log_info_msg "Stopping wpa_supplicant on the $1 interface..."
    if [[ -e ${PIDFILE} ]]; then
      kill -9 $(cat ${PIDFILE})
      rm -f ${PIDFILE} ${CONTROL_IFACE}
      evaluate_retval
    else
      log_warning_msg "wpa_supplicant already stopped on $1"
      exit 0
    fi
    ;;

  *)
    HELP
    exit 1
    ;;
esac
EOF


#  .............


#    Setting up the Xorg Build Environment
# -------------------------------------------
Modifiche ai file di configurazione interessati
in /usr/src/base/01_SLconf/ e creazione del pacchetto
xorg-set_7.7 per le ultime istruzione


export XORG_PREFIX="<PREFIX>"

export XORG_CONFIG="--prefix=$XORG_PREFIX --sysconfdir=/etc \
    --localstatedir=/var --disable-static"

cat > /etc/profile.d/xorg.sh << EOF
XORG_PREFIX="$XORG_PREFIX"
XORG_CONFIG="--prefix=\$XORG_PREFIX --sysconfdir=/etc --localstatedir=/var --disable-static"
export XORG_PREFIX XORG_CONFIG
EOF
chmod 644 /etc/profile.d/xorg.sh


cat >> /etc/profile.d/xorg.sh << "EOF"

pathappend $XORG_PREFIX/bin             PATH
pathappend $XORG_PREFIX/lib/pkgconfig   PKG_CONFIG_PATH
pathappend $XORG_PREFIX/share/pkgconfig PKG_CONFIG_PATH

pathappend $XORG_PREFIX/lib             LIBRARY_PATH
pathappend $XORG_PREFIX/include         C_INCLUDE_PATH
pathappend $XORG_PREFIX/include         CPLUS_INCLUDE_PATH

ACLOCAL='aclocal -I $XORG_PREFIX/share/aclocal'

export PATH PKG_CONFIG_PATH ACLOCAL LIBRARY_PATH C_INCLUDE_PATH CPLUS_INCLUDE_PATH
EOF


echo "$XORG_PREFIX/lib" >> /etc/ld.so.conf

sed "s@/usr/X11R6@$XORG_PREFIX@g" -i /etc/man_db.conf

ln -sf $XORG_PREFIX/share/X11 /usr/share/X11

case $(uname -m) in
  x86_64)
    install -v -m755 -d $XORG_PREFIX &&
    install -v -m755 -d $XORG_PREFIX/lib &&
    ln -sf lib $XORG_PREFIX/lib64
    ;;
esac


# .............


#    Chapter 8. Making the LFS System Bootable
#    8.4. Using GRUB to Set Up the Boot Process
# ------------------------------------------------
Installare grub e creare il file grub.cfg a seconda delle proprie esigenze.

grub-install /dev/sda

cat > /boot/grub/grub.cfg << "EOF"
# Begin /boot/grub/grub.cfg
set default=0
set timeout=5

insmod ext2
set root=(hd0,2)

menuentry "GNU/Linux, Linux 4.7.2-lfs-7.10" {
        linux   /boot/vmlinuz-4.7.2-lfs-7.10 root=/dev/sda2 ro
}
EOF

#    8.3. Linux-4.7.2
# ----------------------

make mrproper

make menuconfig

make

make modules_install


cp -v arch/x86/boot/bzImage /boot/vmlinuz-4.7.2-lfs-7.10
cp -v System.map /boot/System.map-4.7.2
cp -v .config /boot/config-4.7.2

install -d /usr/share/doc/linux-4.7.2
cp -r Documentation/* /usr/share/doc/linux-4.7.2
