Beyond Linux^® From Scratch (System V Edition) - Version 9.1

     * [1]Prev
       LXTerminal-0.3.2
     * [2]Next
       Office Programs
     * .
     * [3]Home

X Software

Table of Contents

     * [4]39. Office Programs
          + [5]AbiWord-3.0.4
          + [6]Gnumeric-1.12.46
          + [7]LibreOffice-6.4.0
     * [8]40. Graphical Web Browsers
          + [9]Epiphany-3.34.4
          + [10]Falkon-3.1.0
          + [11]Firefox-68.5.0
          + [12]SeaMonkey-2.53.1
     * [13]41. Other X-based Programs
          + [14]Balsa-2.5.9
          + [15]feh-3.3
          + [16]FontForge-20170731
          + [17]Gimp-2.10.18
          + [18]Gparted-1.1.0
          + [19]HexChat-2.14.3
          + [20]Inkscape-0.92.4
          + [21]Pidgin-2.13.0
          + [22]Rox-Filer-2.11
          + [23]rxvt-unicode-9.22
          + [24]Thunderbird-68.5.0
          + [25]Tigervnc-1.10.1
          + [26]Transmission-2.94
          + [27]xarchiver-0.5.4
          + [28]xdg-utils-1.1.3
          + [29]XScreenSaver-5.43

     * [30]Prev
       LXTerminal-0.3.2
     * [31]Next
       Office Programs
     * .
     * [32]Home

Riferimenti

   1. file:///mnt/sdc1/pack/06-slbook/9.1/PROVA/lxde/lxterminal.html
   2. file:///mnt/sdc1/pack/06-slbook/9.1/PROVA/00-ALL/office.html
   3. file:///mnt/sdc1/pack/06-slbook/9.1/PROVA/index.html
   4. file:///mnt/sdc1/pack/06-slbook/9.1/PROVA/00-ALL/office.html
   5. file:///mnt/sdc1/pack/06-slbook/9.1/PROVA/00-ALL/AbiWord.html
   6. file:///mnt/sdc1/pack/06-slbook/9.1/PROVA/00-ALL/gnumeric.html
   7. file:///mnt/sdc1/pack/06-slbook/9.1/PROVA/00-ALL/libreoffice.html
   8. file:///mnt/sdc1/pack/06-slbook/9.1/PROVA/00-ALL/graphweb.html
   9. file:///mnt/sdc1/pack/06-slbook/9.1/PROVA/00-ALL/epiphany.html
  10. file:///mnt/sdc1/pack/06-slbook/9.1/PROVA/00-ALL/falkon.html
  11. file:///mnt/sdc1/pack/06-slbook/9.1/PROVA/00-ALL/firefox.html
  12. file:///mnt/sdc1/pack/06-slbook/9.1/PROVA/00-ALL/seamonkey.html
  13. file:///mnt/sdc1/pack/06-slbook/9.1/PROVA/00-ALL/other.html
  14. file:///mnt/sdc1/pack/06-slbook/9.1/PROVA/00-ALL/balsa.html
  15. file:///mnt/sdc1/pack/06-slbook/9.1/PROVA/00-ALL/feh.html
  16. file:///mnt/sdc1/pack/06-slbook/9.1/PROVA/00-ALL/fontforge.html
  17. file:///mnt/sdc1/pack/06-slbook/9.1/PROVA/00-ALL/gimp.html
  18. file:///mnt/sdc1/pack/06-slbook/9.1/PROVA/00-ALL/gparted.html
  19. file:///mnt/sdc1/pack/06-slbook/9.1/PROVA/00-ALL/hexchat.html
  20. file:///mnt/sdc1/pack/06-slbook/9.1/PROVA/00-ALL/inkscape.html
  21. file:///mnt/sdc1/pack/06-slbook/9.1/PROVA/00-ALL/pidgin.html
  22. file:///mnt/sdc1/pack/06-slbook/9.1/PROVA/00-ALL/rox-filer.html
  23. file:///mnt/sdc1/pack/06-slbook/9.1/PROVA/00-ALL/rxvt-unicode.html
  24. file:///mnt/sdc1/pack/06-slbook/9.1/PROVA/00-ALL/thunderbird.html
  25. file:///mnt/sdc1/pack/06-slbook/9.1/PROVA/00-ALL/tigervnc.html
  26. file:///mnt/sdc1/pack/06-slbook/9.1/PROVA/00-ALL/transmission.html
  27. file:///mnt/sdc1/pack/06-slbook/9.1/PROVA/00-ALL/xarchiver.html
  28. file:///mnt/sdc1/pack/06-slbook/9.1/PROVA/00-ALL/xdg-utils.html
  29. file:///mnt/sdc1/pack/06-slbook/9.1/PROVA/00-ALL/xscreensaver.html
  30. file:///mnt/sdc1/pack/06-slbook/9.1/PROVA/lxde/lxterminal.html
  31. file:///mnt/sdc1/pack/06-slbook/9.1/PROVA/00-ALL/office.html
  32. file:///mnt/sdc1/pack/06-slbook/9.1/PROVA/index.html
