Beyond Linux^® From Scratch (System V Edition) - Version 9.1

Part XI. X Software

     * [1]Prev
       SeaMonkey-2.53.1
     * [2]Next
       Balsa-2.5.9
     * [3]Up
     * [4]Home

Other X-based Programs

   These programs use the X Window System and don't fit easily into any of
   the other chapters.

Table of Contents

     * [5]Balsa-2.5.9
     * [6]feh-3.3
     * [7]FontForge-20170731
     * [8]Gimp-2.10.18
     * [9]Gparted-1.1.0
     * [10]HexChat-2.14.3
     * [11]Inkscape-0.92.4
     * [12]Pidgin-2.13.0
     * [13]Rox-Filer-2.11
     * [14]rxvt-unicode-9.22
     * [15]Thunderbird-68.5.0
     * [16]Tigervnc-1.10.1
     * [17]Transmission-2.94
     * [18]xarchiver-0.5.4
     * [19]xdg-utils-1.1.3
     * [20]XScreenSaver-5.43

     * [21]Prev
       SeaMonkey-2.53.1
     * [22]Next
       Balsa-2.5.9
     * [23]Up
     * [24]Home

Riferimenti

   1. file:///mnt/sdc1/pack/06-slbook/9.1/PROVA/00-ALL/seamonkey.html
   2. file:///mnt/sdc1/pack/06-slbook/9.1/PROVA/00-ALL/balsa.html
   3. file:///mnt/sdc1/pack/06-slbook/9.1/PROVA/00-ALL/xsoft.html
   4. file:///mnt/sdc1/pack/06-slbook/9.1/PROVA/index.html
   5. file:///mnt/sdc1/pack/06-slbook/9.1/PROVA/00-ALL/balsa.html
   6. file:///mnt/sdc1/pack/06-slbook/9.1/PROVA/00-ALL/feh.html
   7. file:///mnt/sdc1/pack/06-slbook/9.1/PROVA/00-ALL/fontforge.html
   8. file:///mnt/sdc1/pack/06-slbook/9.1/PROVA/00-ALL/gimp.html
   9. file:///mnt/sdc1/pack/06-slbook/9.1/PROVA/00-ALL/gparted.html
  10. file:///mnt/sdc1/pack/06-slbook/9.1/PROVA/00-ALL/hexchat.html
  11. file:///mnt/sdc1/pack/06-slbook/9.1/PROVA/00-ALL/inkscape.html
  12. file:///mnt/sdc1/pack/06-slbook/9.1/PROVA/00-ALL/pidgin.html
  13. file:///mnt/sdc1/pack/06-slbook/9.1/PROVA/00-ALL/rox-filer.html
  14. file:///mnt/sdc1/pack/06-slbook/9.1/PROVA/00-ALL/rxvt-unicode.html
  15. file:///mnt/sdc1/pack/06-slbook/9.1/PROVA/00-ALL/thunderbird.html
  16. file:///mnt/sdc1/pack/06-slbook/9.1/PROVA/00-ALL/tigervnc.html
  17. file:///mnt/sdc1/pack/06-slbook/9.1/PROVA/00-ALL/transmission.html
  18. file:///mnt/sdc1/pack/06-slbook/9.1/PROVA/00-ALL/xarchiver.html
  19. file:///mnt/sdc1/pack/06-slbook/9.1/PROVA/00-ALL/xdg-utils.html
  20. file:///mnt/sdc1/pack/06-slbook/9.1/PROVA/00-ALL/xscreensaver.html
  21. file:///mnt/sdc1/pack/06-slbook/9.1/PROVA/00-ALL/seamonkey.html
  22. file:///mnt/sdc1/pack/06-slbook/9.1/PROVA/00-ALL/balsa.html
  23. file:///mnt/sdc1/pack/06-slbook/9.1/PROVA/00-ALL/xsoft.html
  24. file:///mnt/sdc1/pack/06-slbook/9.1/PROVA/index.html
