<?xml version="1.0" encoding="UTF-8" standalone="no"?>
<!DOCTYPE svg PUBLIC "-//W3C//DTD SVG 1.1//EN" "http://www.w3.org/Graphics/SVG/1.1/DTD/svg11.dtd">
<svg width="100%" height="100%" viewBox="0 0 331 330" version="1.1" xmlns="http://www.w3.org/2000/svg" xmlns:xlink="http://www.w3.org/1999/xlink" xml:space="preserve" xmlns:serif="http://www.serif.com/" style="fill-rule:evenodd;clip-rule:evenodd;stroke-linejoin:round;stroke-miterlimit:2;">
    <g transform="matrix(1,0,0,1,-159,-704)">
        <g id="Logo-courbe-seul" serif:id="Logo courbe seul" transform="matrix(0.528553,0,0,1.1,159.059,704)">
            <rect x="0" y="0" width="624.346" height="300" style="fill:none;"/>
            <g transform="matrix(1.89196,0,0,0.909091,2.7819,-306.36)">
                <path d="M163.579,370.001L163.78,370.009C164.351,370.044 164.917,370.201 165.435,370.482L165.592,370.572C165.827,370.713 166.05,370.88 166.256,371.073C166.867,371.636 205.713,407.219 258.484,402.657L258.933,402.637C259.258,402.64 259.576,402.682 259.881,402.761L260.034,402.803C260.631,402.98 261.167,403.292 261.608,403.701L261.829,403.922C262.238,404.363 262.55,404.899 262.727,405.496L262.769,405.649C262.847,405.954 262.89,406.272 262.893,406.597L262.872,407.046C258.311,459.817 293.894,498.663 294.457,499.273C294.65,499.48 294.817,499.703 294.958,499.938L295.048,500.095C295.329,500.613 295.486,501.179 295.521,501.75L295.521,502.25C295.486,502.821 295.329,503.387 295.048,503.905L294.958,504.062C294.817,504.297 294.65,504.52 294.457,504.727C293.894,505.337 258.311,544.183 262.872,596.954L262.893,597.403C262.89,597.728 262.848,598.046 262.769,598.351L262.727,598.504C262.55,599.101 262.238,599.637 261.829,600.078L261.608,600.299C261.167,600.708 260.631,601.02 260.034,601.197L259.881,601.239C259.576,601.318 259.258,601.36 258.933,601.363L258.484,601.343C205.713,596.781 166.867,632.364 166.256,632.927C166.05,633.12 165.827,633.287 165.592,633.428L165.435,633.518C164.917,633.799 164.351,633.956 163.78,633.991L163.28,633.991C162.709,633.956 162.143,633.799 161.625,633.518L161.467,633.428C161.233,633.287 161.01,633.12 160.803,632.927C160.193,632.364 121.347,596.781 68.576,601.343L68.127,601.363C67.802,601.36 67.484,601.318 67.179,601.239L67.026,601.197C66.429,601.02 65.893,600.708 65.452,600.299L65.231,600.078C64.822,599.637 64.51,599.101 64.332,598.504L64.29,598.351C64.212,598.046 64.17,597.728 64.167,597.403L64.187,596.954C68.749,544.183 33.166,505.337 32.603,504.727C32.41,504.52 32.243,504.297 32.102,504.062L32.012,503.905C31.731,503.387 31.574,502.821 31.539,502.25L31.539,501.75C31.574,501.179 31.731,500.613 32.012,500.095L32.102,499.938C32.243,499.703 32.41,499.48 32.603,499.273C33.166,498.663 68.749,459.817 64.187,407.046L64.167,406.597C64.17,406.272 64.212,405.954 64.29,405.649L64.332,405.496C64.51,404.899 64.822,404.363 65.231,403.922L65.452,403.701C65.893,403.292 66.429,402.98 67.026,402.803L67.179,402.761C67.484,402.682 67.802,402.64 68.127,402.637L68.576,402.657C121.347,407.219 160.193,371.636 160.803,371.073C161.01,370.88 161.233,370.713 161.467,370.572L161.625,370.482C162.143,370.201 162.708,370.044 163.28,370.009L163.579,370.001ZM163.53,379.26C153.744,387.268 118.455,413.078 72.462,410.932C74.606,456.93 48.795,492.218 40.79,502C48.798,511.786 74.608,547.075 72.462,593.068C118.46,590.924 153.748,616.735 163.53,624.74C173.316,616.732 208.604,590.922 254.598,593.068C252.454,547.07 278.265,511.782 286.27,502C278.262,492.214 252.452,456.925 254.598,410.932C208.6,413.076 173.312,387.265 163.53,379.26ZM287.453,406.293C287.443,406.349 287.435,406.406 287.43,406.464C283.084,456.399 312.993,494.471 319.401,502C312.993,509.529 283.084,547.601 287.43,597.536C287.435,597.595 287.443,597.652 287.453,597.709C287.443,599.318 287.064,607.912 280.256,613.076C276.965,615.572 272.187,617.223 265.3,617.019C264.196,616.986 263.274,617.855 263.241,618.959C263.209,620.062 264.078,620.984 265.181,621.017C273.253,621.256 278.816,619.188 282.673,616.263C291.816,609.328 291.449,597.316 291.449,597.316C291.444,597.171 291.424,597.03 291.39,596.894C286.859,543.184 323.197,503.717 323.524,503.362C323.631,503.248 323.721,503.124 323.796,502.994L323.841,502.91C323.968,502.662 324.039,502.395 324.056,502.125L324.056,501.875C324.039,501.605 323.968,501.338 323.841,501.09L323.796,501.006C323.721,500.876 323.631,500.752 323.524,500.638C323.197,500.284 286.881,460.841 291.386,407.159C291.422,407.018 291.444,406.871 291.449,406.719C291.449,406.719 291.816,394.708 282.673,387.773C278.816,384.847 273.253,382.78 265.181,383.019C264.078,383.051 263.209,383.974 263.241,385.077C263.274,386.18 264.196,387.05 265.3,387.017C272.187,386.813 276.965,388.463 280.256,390.96C287.018,396.088 287.438,404.6 287.453,406.293ZM35.637,406.649L35.65,406.864C41.806,460.781 3.557,500.615 3.557,500.615L3.335,500.892L3.157,501.222L3.091,501.404L3.016,501.753L3.004,502.116L3.045,502.422L3.155,502.773L3.325,503.093L3.533,503.36C3.533,503.36 40.353,543.083 35.645,597.19L35.637,597.349C35.624,598.204 35.618,609.574 44.414,616.245C48.271,619.171 53.834,621.238 61.905,620.999C63.009,620.966 63.878,620.044 63.845,618.941C63.813,617.838 62.891,616.968 61.787,617.001C54.9,617.205 50.122,615.554 46.831,613.058C39.59,607.566 39.622,598.194 39.635,597.472C43.947,547.621 14.124,509.603 7.678,502.023C14.323,494.47 45.274,456.304 39.635,406.504C39.622,405.617 39.663,396.379 46.831,390.942C50.122,388.446 54.9,386.795 61.787,386.999C62.891,387.032 63.813,386.162 63.845,385.059C63.878,383.956 63.009,383.034 61.905,383.001C53.834,382.762 48.271,384.829 44.414,387.755C35.623,394.422 35.624,405.782 35.637,406.649ZM129.662,423.807L143.178,473.984C143.316,474.496 143.651,474.933 144.11,475.198L149.917,478.55C148.442,479.914 147.104,481.46 145.936,483.178L128.84,473.308L121,444.486C121.514,444.101 121.942,443.612 122.283,443.021C122.946,441.872 123.12,440.619 122.79,439.26C122.456,437.885 121.692,436.859 120.508,436.175C119.331,435.496 118.055,435.338 116.678,435.717L116.678,435.717C115.303,436.096 114.29,436.87 113.625,438.022C112.957,439.178 112.793,440.425 113.143,441.763C113.492,443.097 114.278,444.123 115.509,444.833C116.029,445.133 116.563,445.332 117.112,445.43L125.193,475.146C125.331,475.657 125.666,476.093 126.124,476.358L143.936,486.642C143.036,488.504 142.369,490.427 141.925,492.377L131.779,486.549C131.321,486.286 130.776,486.215 130.266,486.351L83.546,498.941C83.166,498.446 82.685,498.031 82.103,497.696C80.872,496.985 79.591,496.817 78.262,497.182C76.928,497.547 75.93,498.313 75.262,499.469C74.597,500.621 74.434,501.886 74.793,503.265L74.793,503.265C75.153,504.648 75.928,505.674 77.105,506.354C78.289,507.037 79.559,507.186 80.917,506.788C82.259,506.394 83.257,505.617 83.92,504.468C84.227,503.938 84.427,503.389 84.52,502.82L130.503,490.428L141.31,496.635C140.682,506.551 145.572,516.446 154.753,521.747C164.008,527.09 175.125,526.322 183.421,520.699C183.586,520.951 183.81,521.169 184.088,521.33L195.972,528.226L208.29,574.198C207.819,574.571 207.424,575.035 207.104,575.588C206.441,576.737 206.267,577.99 206.597,579.349C206.931,580.724 207.695,581.75 208.879,582.434C210.056,583.113 211.332,583.271 212.71,582.892L212.71,582.892C214.084,582.513 215.097,581.739 215.762,580.587C216.43,579.431 216.594,578.184 216.244,576.846C215.895,575.512 215.109,574.487 213.878,573.776C213.32,573.454 212.745,573.248 212.152,573.159L199.621,526.394C199.484,525.883 199.151,525.447 198.693,525.182L186.606,518.168C188.078,516.802 189.414,515.256 190.58,513.536C190.668,513.61 190.764,513.677 190.866,513.737L210.347,524.984C210.805,525.248 211.35,525.32 211.862,525.184L241.586,517.262C241.954,517.716 242.411,518.1 242.955,518.414C244.186,519.125 245.467,519.293 246.797,518.928C248.131,518.562 249.128,517.797 249.796,516.64C250.461,515.488 250.625,514.224 250.266,512.844L250.266,512.844C249.906,511.462 249.131,510.436 247.954,509.756C246.77,509.072 245.499,508.924 244.141,509.322C242.799,509.716 241.801,510.493 241.138,511.642C240.811,512.208 240.605,512.797 240.52,513.407L211.631,521.107C211.631,521.107 192.866,510.273 192.866,510.273C192.763,510.214 192.657,510.165 192.549,510.126C193.461,508.246 194.135,506.304 194.58,504.337L202.359,508.828C202.818,509.093 203.364,509.165 203.876,509.027L254.041,495.586C254.411,496.045 254.871,496.434 255.42,496.751C256.651,497.462 257.932,497.63 259.262,497.265C260.596,496.899 261.594,496.133 262.261,494.977C262.926,493.825 263.09,492.561 262.731,491.181L262.731,491.181C262.371,489.798 261.596,488.772 260.419,488.093C259.235,487.409 257.964,487.261 256.607,487.659C255.264,488.052 254.266,488.83 253.603,489.978C253.279,490.54 253.073,491.123 252.988,491.728L203.641,504.95C203.641,504.95 196.061,500.574 196.061,500.574C195.781,500.412 195.478,500.326 195.176,500.309C195.261,499.109 195.265,497.908 195.19,496.716C195.218,496.709 195.246,496.703 195.273,496.695L203.631,494.456C203.968,494.365 204.275,494.188 204.523,493.942L231.776,466.865C232.319,467.072 232.904,467.175 233.529,467.175C234.95,467.175 236.144,466.68 237.113,465.699C238.085,464.716 238.566,463.554 238.566,462.218C238.566,460.888 238.076,459.711 237.075,458.696L237.075,458.696C236.072,457.679 234.888,457.178 233.529,457.178C232.161,457.178 230.987,457.684 230.01,458.708C229.044,459.72 228.569,460.892 228.569,462.218C228.569,462.876 228.686,463.492 228.921,464.065L202.081,490.731L194.641,492.725C193.934,489.426 192.614,486.265 190.731,483.426L193.373,480.993C193.537,481.055 193.707,481.11 193.882,481.158C195.218,481.524 196.476,481.364 197.657,480.683C198.888,479.972 199.674,478.947 200.023,477.613C200.373,476.274 200.209,475.028 199.541,473.871C198.876,472.719 197.863,471.945 196.489,471.567L196.489,471.567C195.111,471.187 193.835,471.345 192.658,472.025C191.474,472.708 190.71,473.734 190.376,475.109C190.112,476.195 190.171,477.213 190.542,478.164L188.264,480.25C186.426,478.219 184.245,476.436 181.746,474.993C179.909,473.933 177.998,473.113 176.052,472.524L176.644,470.088C177.626,469.924 178.512,469.469 179.302,468.716C180.326,467.739 180.832,466.564 180.832,465.197C180.832,463.838 180.331,462.654 179.314,461.651L179.314,461.651C178.299,460.65 177.122,460.159 175.792,460.159C174.456,460.159 173.294,460.64 172.311,461.613C171.33,462.582 170.835,463.775 170.835,465.197C170.835,466.56 171.325,467.73 172.311,468.703C172.459,468.85 172.611,468.985 172.767,469.109L172.147,471.655C168.563,471.135 164.938,471.35 161.489,472.243L159.921,466.39L169.668,429.803C170.256,429.713 170.823,429.51 171.369,429.194C172.518,428.531 173.295,427.533 173.689,426.191C174.087,424.833 173.939,423.563 173.255,422.378C172.575,421.202 171.549,420.427 170.167,420.067L170.167,420.067C168.787,419.708 167.523,419.871 166.371,420.536C165.214,421.204 164.449,422.201 164.083,423.535C163.718,424.865 163.886,426.146 164.597,427.377C164.923,427.942 165.324,428.412 165.8,428.787L155.919,465.881C155.829,466.218 155.83,466.573 155.92,466.91L157.694,473.53C156.168,474.177 154.697,474.965 153.305,475.889L146.827,472.149L133.545,422.847C134.052,422.463 134.474,421.979 134.812,421.394C135.475,420.245 135.649,418.993 135.319,417.633C134.985,416.258 134.221,415.232 133.037,414.549C131.86,413.869 130.584,413.711 129.206,414.091L129.206,414.091C127.832,414.469 126.819,415.243 126.154,416.395C125.486,417.552 125.322,418.798 125.672,420.137C126.021,421.47 126.807,422.496 128.038,423.207C128.564,423.51 129.105,423.711 129.662,423.807ZM212.179,580.964C211.352,581.192 210.585,581.11 209.879,580.702C209.181,580.299 208.737,579.688 208.54,578.877C208.339,578.05 208.433,577.287 208.836,576.588C209.235,575.898 209.836,575.447 210.633,575.229C211.427,575.011 212.176,575.102 212.878,575.507C213.62,575.936 214.1,576.548 214.31,577.352C214.519,578.151 214.43,578.897 214.031,579.587C213.63,580.282 213.008,580.736 212.179,580.964L212.179,580.964ZM136.746,500.783C136.86,502.116 137.059,503.438 137.341,504.742C127.764,506.72 119.04,512.622 113.77,521.75C103.976,538.714 109.797,560.438 126.76,570.232C143.724,580.026 165.448,574.205 175.242,557.241C180.627,547.913 181.291,537.145 177.976,527.711C179.239,527.281 180.475,526.769 181.675,526.18C185.446,536.723 184.737,548.793 178.705,559.241C167.807,578.116 143.636,584.592 124.761,573.695C105.886,562.797 99.409,538.626 110.306,519.751C116.208,509.528 126.004,502.942 136.746,500.783ZM140.519,513.243C140.711,513.592 140.91,513.939 141.117,514.283C137.712,514.766 134.419,515.931 131.457,517.72C131.467,517.774 131.474,517.829 131.478,517.883C133.842,518.608 136.157,519.409 138.427,520.285C139.105,519.35 140.385,519.066 141.388,519.645C141.463,519.688 141.535,519.735 141.603,519.786C142.365,519.204 143.133,518.673 143.902,518.197C144.143,518.485 144.39,518.77 144.643,519.051C143.86,519.528 143.079,520.063 142.304,520.652C142.488,521.055 142.554,521.509 142.484,521.956C145.109,523.105 147.669,524.361 150.161,525.724C150.639,525.233 151.309,524.991 151.971,525.045C152.066,525.101 152.16,525.156 152.254,525.21C152.693,525.463 153.135,525.705 153.581,525.934C153.996,526.489 154.14,527.22 153.948,527.907C156.384,529.386 158.754,530.973 161.058,532.667C161.408,532.387 161.83,532.22 162.266,532.178C162.408,531.064 162.483,529.98 162.49,528.934C162.862,528.999 163.234,529.057 163.605,529.107C163.59,530.155 163.511,531.239 163.367,532.352C163.445,532.386 163.522,532.424 163.598,532.468C164.597,533.044 164.991,534.288 164.529,535.341C166.427,536.873 168.278,538.481 170.08,540.167C170.129,540.143 170.179,540.123 170.23,540.105C170.303,536.418 169.574,532.76 168.115,529.395C168.515,529.391 168.915,529.38 169.315,529.361C170.724,532.765 171.423,536.441 171.347,540.145C171.394,540.166 171.441,540.19 171.486,540.216C172.206,540.632 172.454,541.564 172.029,542.299C171.823,542.657 171.497,542.9 171.134,543.008C170.754,545.94 169.878,548.849 168.472,551.614C168.864,552.088 168.942,552.782 168.611,553.355C168.28,553.929 167.64,554.208 167.034,554.106C165.342,556.705 163.262,558.918 160.911,560.713C161,561.082 160.953,561.486 160.746,561.844C160.322,562.58 159.39,562.831 158.671,562.416C158.625,562.389 158.581,562.361 158.539,562.33C150.873,566.967 141.081,567.599 132.634,563.297C132.155,563.703 131.461,563.787 130.897,563.461C130.333,563.136 130.059,562.492 130.171,561.875L130.157,561.866C129.322,561.322 128.516,560.732 127.747,560.099C126.559,559.121 125.457,558.04 124.457,556.871C123.239,555.448 122.173,553.895 121.281,552.248C120.36,550.547 119.625,548.746 119.091,546.886C118.62,545.247 118.306,543.563 118.155,541.864C118.07,540.904 118.037,539.941 118.055,538.978L118.056,538.957C118.008,538.936 117.961,538.912 117.916,538.886C117.196,538.47 116.948,537.538 117.373,536.803C117.579,536.445 117.906,536.202 118.269,536.094C118.649,533.162 119.525,530.253 120.93,527.489C120.538,527.014 120.46,526.32 120.791,525.746C121.122,525.173 121.762,524.893 122.369,524.996L122.378,524.983C122.655,524.558 122.944,524.141 123.245,523.732C123.813,522.96 124.423,522.218 125.072,521.512C125.747,520.776 126.465,520.079 127.219,519.425C127.629,519.07 128.049,518.728 128.48,518.398L128.491,518.389C128.403,518.02 128.45,517.616 128.657,517.258C129.081,516.523 130.012,516.271 130.732,516.687L130.864,516.772C133.83,514.978 137.115,513.783 140.519,513.243ZM150.947,558.84C150.253,559.706 149.023,559.954 148.052,559.394C147.985,559.355 147.921,559.314 147.86,559.27C145.923,560.755 143.948,561.912 142.015,562.695C140.291,563.393 138.597,563.796 136.985,563.879C144.088,566.14 151.741,565.129 157.945,561.382C157.936,561.332 157.929,561.28 157.925,561.229C155.562,560.52 153.236,559.724 150.947,558.84ZM139.239,553.382C138.659,553.974 137.801,554.202 137.014,553.984L132.859,561.18C133.091,561.477 133.204,561.853 133.176,562.23C134.18,562.604 135.256,562.782 136.382,562.78L136.459,562.779C138.09,562.765 139.825,562.375 141.595,561.659C143.434,560.914 145.309,559.817 147.148,558.412C146.969,558.035 146.896,557.611 146.942,557.189C144.324,556.039 141.755,554.77 139.239,553.382ZM128.351,546.396C127.999,546.668 127.578,546.828 127.144,546.863C126.846,549.159 126.834,551.33 127.108,553.295C127.559,556.524 128.786,559.188 130.824,560.872C131.137,560.659 131.519,560.569 131.891,560.621L136.046,553.425C135.459,552.849 135.229,551.985 135.458,551.183C133.04,549.703 130.671,548.108 128.351,546.396ZM159.231,548.586C158.639,549.199 157.75,549.428 156.944,549.183C155.198,551.899 153.245,554.306 151.192,556.346C151.427,556.793 151.51,557.314 151.415,557.822C153.656,558.686 155.933,559.464 158.245,560.158C158.708,559.56 159.544,559.381 160.203,559.761C160.225,559.774 160.245,559.786 160.266,559.799C162.495,558.091 164.471,555.988 166.081,553.52C165.842,553.196 165.74,552.784 165.803,552.38L159.231,548.586ZM119.331,538.931C119.28,538.956 119.227,538.978 119.173,538.997C119.03,546.243 121.981,553.376 127.49,558.397C126.756,556.96 126.258,555.292 126.001,553.449C125.712,551.383 125.726,549.095 126.045,546.675C125.976,546.644 125.908,546.609 125.842,546.571C124.854,546.001 124.457,544.778 124.896,543.733C123.007,542.213 121.152,540.612 119.331,538.931ZM146.813,541.416C146.06,542.276 144.862,542.595 143.795,542.239L139.221,550.161C139.811,550.74 140.04,551.611 139.804,552.416C142.265,553.773 144.775,555.014 147.333,556.14C148.002,555.164 149.31,554.859 150.33,555.448C150.369,555.471 150.407,555.494 150.444,555.519C152.422,553.546 154.304,551.221 155.989,548.6C155.432,548.025 155.216,547.182 155.441,546.397L146.813,541.416ZM163.845,536.226C163.459,536.529 162.989,536.697 162.508,536.712C161.768,539.53 160.654,542.446 159.164,545.338C159.779,545.913 160.025,546.798 159.79,547.617L166.362,551.412C166.681,551.155 167.088,551.037 167.489,551.082C168.82,548.454 169.654,545.69 170.019,542.906C169.997,542.895 169.975,542.883 169.954,542.871C169.297,542.491 169.033,541.68 169.316,540.982C167.539,539.321 165.715,537.735 163.845,536.226ZM133.402,533.673C132.835,534.26 131.997,534.495 131.22,534.3C129.793,537.07 128.72,539.863 128.001,542.562C128.041,542.581 128.081,542.603 128.12,542.625C129.124,543.205 129.518,544.46 129.043,545.517C131.32,547.195 133.645,548.761 136.017,550.214C136.598,549.614 137.461,549.382 138.253,549.602L142.827,541.68C141.984,540.934 141.662,539.737 142.03,538.654L133.402,533.673ZM153.394,528.879C152.814,529.485 151.945,529.722 151.15,529.5L146.576,537.423C147.418,538.168 147.74,539.365 147.372,540.448L156,545.429C156.567,544.842 157.405,544.607 158.182,544.802C159.621,542.007 160.701,539.19 161.42,536.468C161.386,536.45 161.353,536.432 161.32,536.413C160.327,535.84 159.931,534.607 160.381,533.557C158.118,531.893 155.789,530.334 153.394,528.879ZM123.04,527.69C122.721,527.947 122.314,528.065 121.914,528.02C120.583,530.648 119.749,533.411 119.384,536.196C119.406,536.207 119.427,536.219 119.448,536.231C120.102,536.609 120.367,537.414 120.09,538.11C121.882,539.764 123.707,541.34 125.565,542.836C125.95,542.523 126.425,542.347 126.91,542.328C127.65,539.529 128.759,536.634 130.238,533.764C129.623,533.189 129.377,532.304 129.612,531.485L123.04,527.69ZM144.835,540.439L144.906,540.315L145.035,540.389C144.971,540.413 144.903,540.43 144.835,540.439ZM143.808,539.681L143.938,539.756L143.866,539.88C143.839,539.816 143.819,539.749 143.808,539.681ZM145.465,539.347L145.536,539.223C145.563,539.287 145.583,539.353 145.594,539.421L145.465,539.347ZM144.569,538.663L144.497,538.788L144.367,538.712C144.432,538.688 144.5,538.672 144.569,538.663ZM142.045,522.984C141.36,523.892 140.1,524.162 139.11,523.59C139.076,523.571 139.044,523.551 139.012,523.53C137.014,525.514 135.113,527.858 133.412,530.502C133.97,531.077 134.186,531.92 133.961,532.705L142.589,537.686C143.342,536.826 144.541,536.507 145.608,536.864L150.182,528.941C149.593,528.364 149.363,527.495 149.597,526.69C147.145,525.351 144.628,524.115 142.045,522.984ZM131.151,518.952C130.688,519.544 129.856,519.72 129.199,519.341C129.178,519.329 129.157,519.316 129.137,519.303C126.908,521.012 124.931,523.115 123.322,525.583C123.56,525.907 123.661,526.318 123.599,526.722L130.171,530.516C130.763,529.903 131.652,529.674 132.458,529.919C134.217,527.183 136.186,524.76 138.257,522.709C138.032,522.29 137.941,521.803 138.008,521.322C135.77,520.458 133.484,519.668 131.151,518.952ZM160.707,476.652C155.667,478.4 151.209,481.896 148.336,486.873C141.991,497.863 145.762,511.938 156.753,518.283C167.743,524.629 181.818,520.858 188.163,509.867C194.508,498.876 190.737,484.802 179.747,478.456C173.758,474.999 166.853,474.545 160.781,476.627C160.757,476.636 160.732,476.644 160.707,476.652ZM248.331,513.348C248.547,514.181 248.466,514.946 248.064,515.641C247.666,516.331 247.065,516.782 246.268,517C245.467,517.22 244.696,517.111 243.955,516.683C243.253,516.277 242.799,515.674 242.591,514.877C242.382,514.078 242.471,513.332 242.87,512.641C243.273,511.943 243.888,511.48 244.704,511.241C245.505,511.006 246.255,511.084 246.954,511.488C247.66,511.895 248.115,512.519 248.331,513.348L248.331,513.348ZM177.087,483.062C168.639,478.185 157.82,481.084 152.942,489.532C148.064,497.981 150.963,508.8 159.412,513.677C167.86,518.555 178.679,515.656 183.557,507.208C188.435,498.759 185.536,487.94 177.087,483.062ZM175.088,486.526C181.625,490.3 183.868,498.671 180.094,505.208C176.32,511.745 167.948,513.988 161.411,510.214C154.874,506.44 152.631,498.069 156.405,491.532C160.179,484.995 168.551,482.752 175.088,486.526ZM76.728,502.762C76.511,501.929 76.593,501.164 76.994,500.469C77.393,499.779 77.994,499.328 78.79,499.11C79.591,498.89 80.362,498.999 81.104,499.427C81.806,499.833 82.259,500.436 82.468,501.233C82.677,502.032 82.588,502.778 82.189,503.468C81.786,504.167 81.171,504.63 80.354,504.869C79.553,505.104 78.803,505.025 78.104,504.622C77.398,504.214 76.944,503.591 76.728,502.762L76.728,502.762ZM260.796,491.685C261.013,492.517 260.931,493.282 260.53,493.977C260.131,494.668 259.53,495.118 258.733,495.337C257.932,495.556 257.162,495.447 256.42,495.019C255.718,494.614 255.264,494.011 255.056,493.214C254.847,492.414 254.936,491.669 255.335,490.978C255.738,490.28 256.353,489.817 257.169,489.577C257.97,489.343 258.721,489.421 259.419,489.824C260.125,490.232 260.58,490.855 260.796,491.685L260.796,491.685ZM195.958,473.494C196.787,473.723 197.408,474.176 197.81,474.871C198.209,475.562 198.298,476.307 198.089,477.107C197.879,477.91 197.399,478.523 196.657,478.951C195.955,479.357 195.206,479.448 194.411,479.23C193.615,479.011 193.014,478.561 192.615,477.87C192.212,477.172 192.118,476.408 192.319,475.581C192.516,474.77 192.959,474.16 193.658,473.756C194.364,473.349 195.131,473.267 195.957,473.494L195.958,473.494ZM177.91,463.075C178.52,463.676 178.833,464.382 178.833,465.197C178.833,466.004 178.526,466.693 177.922,467.269C177.306,467.856 176.598,468.157 175.792,468.157C174.994,468.157 174.304,467.862 173.716,467.281C173.13,466.702 172.834,466.008 172.834,465.197C172.834,464.341 173.125,463.619 173.716,463.035C174.304,462.454 174.994,462.159 175.792,462.159C176.594,462.159 177.297,462.471 177.91,463.075L177.91,463.075ZM235.651,460.1C236.255,460.713 236.567,461.416 236.567,462.218C236.567,463.016 236.272,463.706 235.691,464.294C235.107,464.885 234.385,465.176 233.529,465.176C232.718,465.176 232.024,464.88 231.445,464.294C230.864,463.706 230.568,463.016 230.568,462.218C230.568,461.412 230.869,460.704 231.457,460.088C232.033,459.484 232.722,459.177 233.529,459.177C234.344,459.177 235.049,459.49 235.651,460.1L235.651,460.1ZM117.209,437.645C118.035,437.417 118.802,437.499 119.508,437.907C120.207,438.31 120.65,438.921 120.847,439.732C121.048,440.559 120.955,441.322 120.551,442.021C120.153,442.712 119.552,443.162 118.755,443.38C117.96,443.598 117.211,443.507 116.509,443.102C115.768,442.674 115.288,442.061 115.078,441.257C114.869,440.458 114.958,439.712 115.357,439.022C115.758,438.327 116.38,437.874 117.209,437.645L117.209,437.645ZM169.663,422.002C170.492,422.218 171.116,422.672 171.523,423.378C171.927,424.077 172.005,424.827 171.77,425.628C171.531,426.445 171.068,427.059 170.37,427.463C169.679,427.861 168.933,427.951 168.134,427.742C167.337,427.533 166.734,427.08 166.329,426.377C165.9,425.636 165.791,424.865 166.011,424.064C166.23,423.268 166.68,422.667 167.37,422.268C168.066,421.867 168.831,421.785 169.663,422.002L169.663,422.002ZM129.737,416.018C130.564,415.791 131.331,415.873 132.037,416.28C132.735,416.684 133.179,417.294 133.376,418.105C133.577,418.932 133.483,419.696 133.08,420.394C132.681,421.085 132.08,421.535 131.283,421.754C130.489,421.972 129.74,421.88 129.038,421.475C128.296,421.047 127.816,420.434 127.606,419.63C127.397,418.831 127.486,418.086 127.885,417.395C128.286,416.7 128.908,416.247 129.737,416.018L129.737,416.018Z" style="fill:rgb(24,45,35);"/>
            </g>
        </g>
    </g>
</svg>
