<?xml version="1.0" encoding="UTF-8" standalone="no"?>
<!DOCTYPE svg PUBLIC "-//W3C//DTD SVG 1.1//EN" "http://www.w3.org/Graphics/SVG/1.1/DTD/svg11.dtd">
<svg width="100%" height="100%" viewBox="0 0 776 652" version="1.1" xmlns="http://www.w3.org/2000/svg" xmlns:xlink="http://www.w3.org/1999/xlink" xml:space="preserve" xmlns:serif="http://www.serif.com/" style="fill-rule:evenodd;clip-rule:evenodd;stroke-linejoin:round;stroke-miterlimit:2;">
    <g id="Plan-de-travail1" serif:id="Plan de travail1" transform="matrix(1.12791,0,0,1.52693,-49.6279,-142.005)">
        <rect x="44" y="93" width="688" height="427" style="fill:none;"/>
        <clipPath id="_clip1">
            <rect x="44" y="93" width="688" height="427"/>
        </clipPath>
        <g clip-path="url(#_clip1)">
            <g transform="matrix(15.572,6.64107,-8.99052,11.5027,104.95,277.964)">
                <path d="M0,-12.477C-0.095,-11.701 -0.185,-11.313 -0.183,-10.926C-0.171,-7.49 -0.146,-4.054 -0.11,-0.618C-0.108,-0.49 0.049,-0.364 0.153,-0.206C0.37,-0.249 0.633,-0.238 0.825,-0.349C3.877,-2.097 6.922,-3.854 9.955,-5.633C10.188,-5.769 10.318,-6.082 10.598,-6.446C7.093,-8.449 3.779,-10.496 0,-12.477M-1.206,-14.237C-1.016,-14.237 -0.827,-14.295 -0.709,-14.228C3.648,-11.741 8,-9.244 12.346,-6.736C12.528,-6.631 12.644,-6.409 12.79,-6.242C11.411,-5.024 1.479,0.788 -0.967,1.818C-1.446,1.621 -1.352,1.17 -1.353,0.804C-1.364,-3.98 -1.362,-8.764 -1.354,-13.548C-1.353,-13.775 -1.259,-14.001 -1.206,-14.237" style="fill:rgba(24,45,35,0.04);fill-rule:nonzero;"/>
            </g>
            <g transform="matrix(15.572,6.64107,-8.99052,11.5027,448.95,277.964)">
                <path d="M0,-12.477C-0.095,-11.701 -0.185,-11.313 -0.183,-10.926C-0.171,-7.49 -0.146,-4.054 -0.11,-0.618C-0.108,-0.49 0.049,-0.364 0.153,-0.206C0.37,-0.249 0.633,-0.238 0.825,-0.349C3.877,-2.097 6.922,-3.854 9.955,-5.633C10.188,-5.769 10.318,-6.082 10.598,-6.446C7.093,-8.449 3.779,-10.496 0,-12.477M-1.206,-14.237C-1.016,-14.237 -0.827,-14.295 -0.709,-14.228C3.648,-11.741 8,-9.244 12.346,-6.736C12.528,-6.631 12.644,-6.409 12.79,-6.242C11.411,-5.024 1.479,0.788 -0.967,1.818C-1.446,1.621 -1.352,1.17 -1.353,0.804C-1.364,-3.98 -1.362,-8.764 -1.354,-13.548C-1.353,-13.775 -1.259,-14.001 -1.206,-14.237" style="fill:rgba(24,45,35,0.04);fill-rule:nonzero;"/>
            </g>
            <g transform="matrix(3.14983e-15,13.2821,-17.981,3.33884e-15,275.798,111.342)">
                <path d="M0,-12.477C-0.095,-11.701 -0.185,-11.313 -0.183,-10.926C-0.171,-7.49 -0.146,-4.054 -0.11,-0.618C-0.108,-0.49 0.049,-0.364 0.153,-0.206C0.37,-0.249 0.633,-0.238 0.825,-0.349C3.877,-2.097 6.922,-3.854 9.955,-5.633C10.188,-5.769 10.318,-6.082 10.598,-6.446C7.093,-8.449 3.779,-10.496 0,-12.477M-1.206,-14.237C-1.016,-14.237 -0.827,-14.295 -0.709,-14.228C3.648,-11.741 8,-9.244 12.346,-6.736C12.528,-6.631 12.644,-6.409 12.79,-6.242C11.411,-5.024 1.479,0.788 -0.967,1.818C-1.446,1.621 -1.352,1.17 -1.353,0.804C-1.364,-3.98 -1.362,-8.764 -1.354,-13.548C-1.353,-13.775 -1.259,-14.001 -1.206,-14.237" style="fill:rgba(24,45,35,0.04);fill-rule:nonzero;"/>
            </g>
            <g transform="matrix(3.14983e-15,13.2821,-17.981,3.33884e-15,619.798,111.342)">
                <path d="M0,-12.477C-0.095,-11.701 -0.185,-11.313 -0.183,-10.926C-0.171,-7.49 -0.146,-4.054 -0.11,-0.618C-0.108,-0.49 0.049,-0.364 0.153,-0.206C0.37,-0.249 0.633,-0.238 0.825,-0.349C3.877,-2.097 6.922,-3.854 9.955,-5.633C10.188,-5.769 10.318,-6.082 10.598,-6.446C7.093,-8.449 3.779,-10.496 0,-12.477M-1.206,-14.237C-1.016,-14.237 -0.827,-14.295 -0.709,-14.228C3.648,-11.741 8,-9.244 12.346,-6.736C12.528,-6.631 12.644,-6.409 12.79,-6.242C11.411,-5.024 1.479,0.788 -0.967,1.818C-1.446,1.621 -1.352,1.17 -1.353,0.804C-1.364,-3.98 -1.362,-8.764 -1.354,-13.548C-1.353,-13.775 -1.259,-14.001 -1.206,-14.237" style="fill:rgba(24,45,35,0.04);fill-rule:nonzero;"/>
            </g>
            <g transform="matrix(3.14983e-15,13.2821,-17.981,3.33884e-15,-68.2015,111.342)">
                <path d="M0,-12.477C-0.095,-11.701 -0.185,-11.313 -0.183,-10.926C-0.171,-7.49 -0.146,-4.054 -0.11,-0.618C-0.108,-0.49 0.049,-0.364 0.153,-0.206C0.37,-0.249 0.633,-0.238 0.825,-0.349C3.877,-2.097 6.922,-3.854 9.955,-5.633C10.188,-5.769 10.318,-6.082 10.598,-6.446C7.093,-8.449 3.779,-10.496 0,-12.477M-1.206,-14.237C-1.016,-14.237 -0.827,-14.295 -0.709,-14.228C3.648,-11.741 8,-9.244 12.346,-6.736C12.528,-6.631 12.644,-6.409 12.79,-6.242C11.411,-5.024 1.479,0.788 -0.967,1.818C-1.446,1.621 -1.352,1.17 -1.353,0.804C-1.364,-3.98 -1.362,-8.764 -1.354,-13.548C-1.353,-13.775 -1.259,-14.001 -1.206,-14.237" style="fill:rgba(24,45,35,0.04);fill-rule:nonzero;"/>
            </g>
            <g transform="matrix(15.572,-6.64107,-8.99052,-11.5027,104.95,323.449)">
                <path d="M0,-12.477C-0.095,-11.701 -0.185,-11.313 -0.183,-10.926C-0.171,-7.49 -0.146,-4.054 -0.11,-0.618C-0.108,-0.49 0.049,-0.364 0.153,-0.206C0.37,-0.249 0.633,-0.238 0.825,-0.349C3.877,-2.097 6.922,-3.854 9.955,-5.633C10.188,-5.769 10.318,-6.082 10.598,-6.446C7.093,-8.449 3.779,-10.496 0,-12.477M-1.206,-14.237C-1.016,-14.237 -0.827,-14.295 -0.709,-14.228C3.648,-11.741 8,-9.244 12.346,-6.736C12.528,-6.631 12.644,-6.409 12.79,-6.242C11.411,-5.024 1.479,0.788 -0.967,1.818C-1.446,1.621 -1.352,1.17 -1.353,0.804C-1.364,-3.98 -1.362,-8.764 -1.354,-13.548C-1.353,-13.775 -1.259,-14.001 -1.206,-14.237" style="fill:rgba(24,45,35,0.04);fill-rule:nonzero;"/>
            </g>
            <g transform="matrix(15.572,-6.64107,-8.99052,-11.5027,448.95,323.449)">
                <path d="M0,-12.477C-0.095,-11.701 -0.185,-11.313 -0.183,-10.926C-0.171,-7.49 -0.146,-4.054 -0.11,-0.618C-0.108,-0.49 0.049,-0.364 0.153,-0.206C0.37,-0.249 0.633,-0.238 0.825,-0.349C3.877,-2.097 6.922,-3.854 9.955,-5.633C10.188,-5.769 10.318,-6.082 10.598,-6.446C7.093,-8.449 3.779,-10.496 0,-12.477M-1.206,-14.237C-1.016,-14.237 -0.827,-14.295 -0.709,-14.228C3.648,-11.741 8,-9.244 12.346,-6.736C12.528,-6.631 12.644,-6.409 12.79,-6.242C11.411,-5.024 1.479,0.788 -0.967,1.818C-1.446,1.621 -1.352,1.17 -1.353,0.804C-1.364,-3.98 -1.362,-8.764 -1.354,-13.548C-1.353,-13.775 -1.259,-14.001 -1.206,-14.237" style="fill:rgba(24,45,35,0.04);fill-rule:nonzero;"/>
            </g>
            <g transform="matrix(3.14983e-15,-13.2821,-17.981,-3.33884e-15,275.798,490.07)">
                <path d="M0,-12.477C-0.095,-11.701 -0.185,-11.313 -0.183,-10.926C-0.171,-7.49 -0.146,-4.054 -0.11,-0.618C-0.108,-0.49 0.049,-0.364 0.153,-0.206C0.37,-0.249 0.633,-0.238 0.825,-0.349C3.877,-2.097 6.922,-3.854 9.955,-5.633C10.188,-5.769 10.318,-6.082 10.598,-6.446C7.093,-8.449 3.779,-10.496 0,-12.477M-1.206,-14.237C-1.016,-14.237 -0.827,-14.295 -0.709,-14.228C3.648,-11.741 8,-9.244 12.346,-6.736C12.528,-6.631 12.644,-6.409 12.79,-6.242C11.411,-5.024 1.479,0.788 -0.967,1.818C-1.446,1.621 -1.352,1.17 -1.353,0.804C-1.364,-3.98 -1.362,-8.764 -1.354,-13.548C-1.353,-13.775 -1.259,-14.001 -1.206,-14.237" style="fill:rgba(24,45,35,0.04);fill-rule:nonzero;"/>
            </g>
            <g transform="matrix(3.14983e-15,-13.2821,-17.981,-3.33884e-15,619.798,490.07)">
                <path d="M0,-12.477C-0.095,-11.701 -0.185,-11.313 -0.183,-10.926C-0.171,-7.49 -0.146,-4.054 -0.11,-0.618C-0.108,-0.49 0.049,-0.364 0.153,-0.206C0.37,-0.249 0.633,-0.238 0.825,-0.349C3.877,-2.097 6.922,-3.854 9.955,-5.633C10.188,-5.769 10.318,-6.082 10.598,-6.446C7.093,-8.449 3.779,-10.496 0,-12.477M-1.206,-14.237C-1.016,-14.237 -0.827,-14.295 -0.709,-14.228C3.648,-11.741 8,-9.244 12.346,-6.736C12.528,-6.631 12.644,-6.409 12.79,-6.242C11.411,-5.024 1.479,0.788 -0.967,1.818C-1.446,1.621 -1.352,1.17 -1.353,0.804C-1.364,-3.98 -1.362,-8.764 -1.354,-13.548C-1.353,-13.775 -1.259,-14.001 -1.206,-14.237" style="fill:rgba(24,45,35,0.04);fill-rule:nonzero;"/>
            </g>
            <g transform="matrix(3.14983e-15,-13.2821,-17.981,-3.33884e-15,-68.2015,490.07)">
                <path d="M0,-12.477C-0.095,-11.701 -0.185,-11.313 -0.183,-10.926C-0.171,-7.49 -0.146,-4.054 -0.11,-0.618C-0.108,-0.49 0.049,-0.364 0.153,-0.206C0.37,-0.249 0.633,-0.238 0.825,-0.349C3.877,-2.097 6.922,-3.854 9.955,-5.633C10.188,-5.769 10.318,-6.082 10.598,-6.446C7.093,-8.449 3.779,-10.496 0,-12.477M-1.206,-14.237C-1.016,-14.237 -0.827,-14.295 -0.709,-14.228C3.648,-11.741 8,-9.244 12.346,-6.736C12.528,-6.631 12.644,-6.409 12.79,-6.242C11.411,-5.024 1.479,0.788 -0.967,1.818C-1.446,1.621 -1.352,1.17 -1.353,0.804C-1.364,-3.98 -1.362,-8.764 -1.354,-13.548C-1.353,-13.775 -1.259,-14.001 -1.206,-14.237" style="fill:rgba(24,45,35,0.04);fill-rule:nonzero;"/>
            </g>
        </g>
    </g>
</svg>
