<?xml version="1.0" encoding="utf-8"?>
<!-- Generator: Adobe Illustrator 22.1.0, SVG Export Plug-In . SVG Version: 6.00 Build 0)  -->
<svg version="1.1" id="Calque_1" xmlns="http://www.w3.org/2000/svg" xmlns:xlink="http://www.w3.org/1999/xlink" x="0px" y="0px"
	 viewBox="0 0 50 82" style="enable-background:new 0 0 50 82;" xml:space="preserve">
<style type="text/css">
	.st0{fill:#4C4C4C;}
	.st1{fill:#575757;}
	.st2{fill:#515151;}
	.st3{fill:#404040;}
	.st4{fill:#4B4B4B;}
	.st5{fill:#FFFFFF;}
</style>
<g>
	<path class="st0" d="M40,43c-0.3,1-0.7,2-1,3c-1.7,6.1-5,11.5-7.9,17c-1.5,2.9-3.1,5.9-4,9c-0.3,1.4-0.4,3.4-2,3.4
		c-1.6,0-1.8-2-2-3.4c-3.2-8.3-7.9-15.9-11.7-23.9c-0.9-2-2.5-3.8-1.1-6.2c3.6-2.6,24.6-3.5,28.1-1.3C39.2,41.2,39.6,42.1,40,43z"/>
	<path class="st1" d="M10,43c0.7,1.7,1.3,3.3,2,5c-0.1,0.6-0.5,0.9-1,1c-4.6-7.8-9.5-15.4-9-25c0.8-0.4,1-1.2,1-2
		c0.8-0.6,1.5-0.5,2.3,0c1.9,3.2,0.5,6.9,1.7,10.2C7.6,35.9,10.2,39.1,10,43z"/>
	<path class="st1" d="M27,72.1c-0.5-3.2,1.3-5.7,2.6-8.3c3.2-5.9,5.5-12.3,9.3-17.8c0,0.8,0.2,1.5,1,2C36,56.2,31.9,64.3,27,72.1z"
		/>
	<path class="st1" d="M11,49c0.3-0.3,0.7-0.7,1-1c4.1,7.8,9.5,15,11,24C18.3,64.7,14.1,57.2,11,49z"/>
	<path class="st1" d="M5,22c-0.6,0-1.3,0-1.9,0C4.5,11.5,14.4,4.8,21.2,4c11-1.3,20.9,4.2,24.5,13.7c0.5,1.4,0.8,2.9,1.2,4.3
		c-2.7-0.4-2.8-3-3.8-4.7C38.8,9.1,31.9,5.2,22.9,6.1C16.3,6.8,8.2,11.2,6,20C6,20.8,5.7,21.5,5,22z"/>
	<path class="st2" d="M10,43c-1.9-3.1-3.2-6.5-4-10c2.2-4.3,5-3.4,8-1c3.1,4.5,6.9,7.6,12.8,6.6c6.7-1.2,9.6-5.8,10.9-12
		c0.5-2.3,0-5.7,3.8-5.2c3.7,0.5,3.7,3.6,3.6,6.6c-0.1,5.5-3,10.1-5,15c-1.9-1.5-3.9-2.1-6.4-2.1c-5.8,0.2-11.5,0.2-17.3,0
		C13.9,40.9,11.9,41.5,10,43z"/>
	<path class="st2" d="M14,32c-2.8-1.1-5.6-1.4-8,1c-1.9-3.5-0.7-7.3-1-11c0-0.8,0.2-1.6,1-2c6.5-0.9,7-0.5,7,6.2
		C13,28.2,12.9,30.2,14,32z"/>
	<path class="st1" d="M47,22c-1.6-1.5-2.1-3.7-3.1-5.6c-6.8-12.8-23.8-15.5-34-5.1c-2.3,2.4-5.1,4.9-4.1,8.9c4.6,0.5,6.6,3,6,7.7
		c-0.2,1.6,0.3,3.3,1.2,4.8c3.3,5.1,7.8,8.3,14.1,7.1c6.7-1.2,10.1-5.7,11.6-12.1c0.1-0.6,0.3-1.3,0.5-1.9c0.3-1.1,0.8-2.4,2.2-2.3
		c1.6,0.1,2.1,1.5,2.2,2.8c0.2,1.8,0.1,3.6-0.4,5.4c-1.1,3.6-2.6,7.1-4.2,10.6c-0.5,1.2-1,2.4-0.9,3.7c0.2,1,0.3,2.1,1.9,1.9
		c3.4-7.8,8.3-15,8.1-23.9C47.2,23.6,47,22.8,47,22z M24.9,34.2c-4.4-0.1-7.8-3.5-7.8-8c0-4.4,3.9-8.3,8.3-8.2
		c4.3,0.1,7.8,3.8,7.8,8.1C33.1,30.8,29.5,34.3,24.9,34.2z"/>
</g>
<path class="st3" d="M47,38.1c0,0,3-7.7,2.2-15.9C49,22.1,48.8,22,48.4,22c-0.8,0-1.2,1-1.4,1.8c-0.4,8.6-4.6,15.9-8,23.4
	c-3.7,8.3-8.4,16.1-12.6,24.2c-1,2.3-1.9,2.4-2.9,0c-4-7.6-8.4-15-11.9-22.9C7.8,40.6,3,33,3,23.7C2.8,22.9,2.4,22,1.6,22
	c-0.8,0-1,0.5-1,1.2c0,0.3,0,0.7,0,1c0,0.2,0,0.3,0,0.5c0,4.9,0.9,9.8,0.9,10C8,50.6,16.8,65.6,25,81.8c2.7-5.1,4.9-9.3,7-13.5
	C37,58.2,42,48.2,47,38.1L47,38.1z"/>
<path class="st4" d="M47.3,15.5C42.8,6.9,34,1.1,24.8,1.5C14.8,1.9,7.5,6.7,2.9,15.3c0,0.1-0.1,0.2-0.1,0.3
	c-0.3,0.5-0.6,1.1-0.8,1.6c-0.1,0.3-0.2,0.6-0.3,0.9c-0.5,2.1-0.8,4.9-0.9,7.2c0.2-0.5,0.3-1,0.3-1.6c0-0.4,0.1-0.9,0.7-0.5
	C2,23.3,1.9,23.7,2,24c1.4,0.3,1.7-0.8,2.1-1.7C7,11,14.6,5.1,26,5.3c9.7,0.1,16.5,6,19.9,17.1c0.4,0.9,0.7,2,2.1,1.7
	c0.1-0.3,0-0.7,0.2-0.9c0.6-0.5,0.7,0.1,0.7,0.5c0,0.4,0.1,0.8,0.1,1.1C49,21.8,48.6,18,47.3,15.5z"/>
<path class="st3" d="M25,16c-5.5,0-10,4.5-10,10s4.5,10,10,10s10-4.5,10-10S30.5,16,25,16z M25,33.3c-4,0-7.3-3.3-7.3-7.3
	s3.3-7.3,7.3-7.3s7.3,3.3,7.3,7.3S29,33.3,25,33.3z"/>
<circle class="st5" cx="25" cy="26" r="8"/>
</svg>
