<?xml version="1.0" encoding="UTF-8"?>
<svg xmlns="http://www.w3.org/2000/svg" width="20" height="20" viewBox="0 0 20 20">
  <title>
    heart
  </title>
  <path d="M14.75 1A5.24 5.24 0 0 0 10 4 5.24 5.24 0 0 0 0 6.25C0 11.75 10 19 10 19s10-7.25 10-12.75A5.25 5.25 0 0 0 14.75 1z" fill="#fec5bb"/>
</svg>
