﻿Creo Parametric IGES Präprozessor-Protokolldatei
IGES Ausgabe für Teil SCREWM14V2, in Datei screwm14v2igs_to_print.igs.

Inhalt der IGES Start Section:
 PTC IGES file: screwm14v2igs_to_print.igs

Inhalt von IGES Global Section:
Parameter-Trennzeichen                  ,
Datensatz-Trennzeichen                  ;
Produkt-ID des Absenders                SCREWM14V2
Dateiname                               screwm14v2igs_to_print.igs
System-ID                               Creo Parametric by PTC Inc.
Präprozessor-Version                    2023014
Anzahl der Bits/Ganzzahl                32
Maximaler Exponent von 10 für Gleitkommazahlen 38
Anzahl der Stellen pro Gleitkommazahl   7
Maximaler Exponent von 10 für doppeltgenaue Gleitkommazahlen 38
Anzahl der Stellen pro doppeltgenauer Gleitkommazahl 15
Produkt-ID des Empfängers               SCREWM14V2
Skalierung des Modellbereichs           1.
Einheiten                               MM
Anzahl der Abstufungen der Linienbreite 32768
Maximale Linienbreite                   0.5
Datum und Uhrzeit erzeugt.              21-Jan-24 16:53:36
Minimale Auflösung                      0.009906
Maximaler Koordinatenwert                 99.06
Benutzername                            MASTER
IGES Version                            5.2
Zeichnungsstandard                      None/unknown

Typen und Mengen der erzeugten IGES Elemente:
Typ   Form   Anzahl Name
------------------------
 100      0    132   Kreisförmiger Bogen
 102      0    192   Kurvenzug
 104      1     10   Konischer Bogen
 110      0    550   Linie
 120      0     44   Drehfläche
 124      0    142   Transformationsmatrix
 126      0     82   Rationale B-Spline-Kurve
 128      0     30   Rationale B-Spline-Fläche
 142      0     96   Kurve auf parametrischer Fläche
 144      0     74   Getrimmte parametrische Fläche
 314      0      9   Farbdefinition
              ----
      Gesamt = 1361

IGES Verarbeitung beendet bei 21-Jan-24 16:53:36.
