ISO-10303-21;
HEADER;
FILE_DESCRIPTION(('STEP AP242'),'1');
FILE_NAME('din_en_24016_m6x60.stp','2024-01-23T23:05:42',('TraceParts'),('TraceParts S.A.'),'Spatial InterOp 3D',' ',' ');
FILE_SCHEMA(('AP242_MANAGED_MODEL_BASED_3D_ENGINEERING_MIM_LF  {1 0 10303 442 1 1 4}'));
ENDSEC;
DATA;
#1=PRODUCT_DEFINITION_CONTEXT('',#9,'design');
#2=APPLICATION_PROTOCOL_DEFINITION('INTERNATIONAL STANDARD','ap242_managed_model_based_3d_engineering',2014,#9);
#3=PRODUCT_CATEGORY_RELATIONSHIP('NONE','NONE',#10,#11);
#4=SHAPE_DEFINITION_REPRESENTATION(#12,#13);
#5= (GEOMETRIC_REPRESENTATION_CONTEXT(3)GLOBAL_UNCERTAINTY_ASSIGNED_CONTEXT((#16))GLOBAL_UNIT_ASSIGNED_CONTEXT((#18,#19,#20))REPRESENTATION_CONTEXT('NONE','WORKSPACE'));
#9=APPLICATION_CONTEXT('managed model based 3d engineering');
#10=PRODUCT_CATEGORY('part','NONE');
#11=PRODUCT_RELATED_PRODUCT_CATEGORY('detail',' ',(#22));
#12=PRODUCT_DEFINITION_SHAPE('NONE','NONE',#23);
#13=ADVANCED_BREP_SHAPE_REPRESENTATION('din_en_24016_m6x60',(#24,#25),#5);
#16=UNCERTAINTY_MEASURE_WITH_UNIT(LENGTH_MEASURE(1.0E-06),#18,'','');
#18= (CONVERSION_BASED_UNIT('MILLIMETRE',#28)LENGTH_UNIT()NAMED_UNIT(#31));
#19= (NAMED_UNIT(#33)PLANE_ANGLE_UNIT()SI_UNIT($,.RADIAN.));
#20= (NAMED_UNIT(#33)SOLID_ANGLE_UNIT()SI_UNIT($,.STERADIAN.));
#22=PRODUCT('din_en_24016_m6x60','din_en_24016_m6x60','PART-din_en_24016_m6x60-DESC',(#39));
#23=PRODUCT_DEFINITION('','NONE',#40,#1);
#24=MANIFOLD_SOLID_BREP('din_en_24016_m6x60',#41);
#25=AXIS2_PLACEMENT_3D('',#42,#43,#44);
#28=LENGTH_MEASURE_WITH_UNIT(LENGTH_MEASURE(1.0),#45);
#31=DIMENSIONAL_EXPONENTS(1.0,0.0,0.0,0.0,0.0,0.0,0.0);
#33=DIMENSIONAL_EXPONENTS(0.0,0.0,0.0,0.0,0.0,0.0,0.0);
#39=PRODUCT_CONTEXT('',#9,'mechanical');
#40=PRODUCT_DEFINITION_FORMATION_WITH_SPECIFIED_SOURCE(' ','NONE',#22,.NOT_KNOWN.);
#41=CLOSED_SHELL('',(#46,#47,#48,#49,#50,#51,#52,#53,#54,#55,#56,#57,#58,#59,#60,#61,#62,#63,#64,#65,#66,#67,#68,#69,#70,#71,#72,#73,#74,#75,#76));
#42=CARTESIAN_POINT('',(0.0,0.0,0.0));
#43=DIRECTION('',(0.0,0.0,1.0));
#44=DIRECTION('',(1.0,0.0,0.0));
#45= (NAMED_UNIT(#31)LENGTH_UNIT()SI_UNIT(.MILLI.,.METRE.));
#46=ADVANCED_FACE('',(#78),#79,.T.);
#47=ADVANCED_FACE('',(#80),#81,.T.);
#48=ADVANCED_FACE('',(#82),#83,.T.);
#49=ADVANCED_FACE('',(#84),#85,.T.);
#50=ADVANCED_FACE('',(#86),#87,.F.);
#51=ADVANCED_FACE('',(#88),#89,.T.);
#52=ADVANCED_FACE('',(#90),#91,.T.);
#53=ADVANCED_FACE('',(#92),#93,.T.);
#54=ADVANCED_FACE('',(#94,#95),#96,.T.);
#55=ADVANCED_FACE('',(#97),#98,.T.);
#56=ADVANCED_FACE('',(#99),#100,.T.);
#57=ADVANCED_FACE('',(#101),#102,.T.);
#58=ADVANCED_FACE('',(#103),#104,.T.);
#59=ADVANCED_FACE('',(#105),#106,.T.);
#60=ADVANCED_FACE('',(#107),#108,.T.);
#61=ADVANCED_FACE('',(#109),#110,.T.);
#62=ADVANCED_FACE('',(#111),#112,.T.);
#63=ADVANCED_FACE('',(#113),#114,.T.);
#64=ADVANCED_FACE('',(#115),#116,.T.);
#65=ADVANCED_FACE('',(#117),#118,.T.);
#66=ADVANCED_FACE('',(#119),#120,.T.);
#67=ADVANCED_FACE('',(#121),#122,.T.);
#68=ADVANCED_FACE('',(#123),#124,.T.);
#69=ADVANCED_FACE('',(#125,#126),#127,.T.);
#70=ADVANCED_FACE('',(#128),#129,.F.);
#71=ADVANCED_FACE('',(#130),#131,.T.);
#72=ADVANCED_FACE('',(#132),#133,.T.);
#73=ADVANCED_FACE('',(#134,#135),#136,.T.);
#74=ADVANCED_FACE('',(#137),#138,.T.);
#75=ADVANCED_FACE('',(#139),#140,.T.);
#76=ADVANCED_FACE('',(#141),#142,.T.);
#78=FACE_OUTER_BOUND('',#143,.T.);
#79=CONICAL_SURFACE('',#144,2.729375,0.78539816339745);
#80=FACE_OUTER_BOUND('',#145,.T.);
#81=CYLINDRICAL_SURFACE('',#146,3.0);
#82=FACE_OUTER_BOUND('',#147,.T.);
#83=CONICAL_SURFACE('',#148,2.729375,0.78539816339745);
#84=FACE_OUTER_BOUND('',#149,.T.);
#85=CYLINDRICAL_SURFACE('',#150,3.0);
#86=FACE_OUTER_BOUND('',#151,.T.);
#87=TOROIDAL_SURFACE('',#152,3.25,0.25);
#88=FACE_OUTER_BOUND('',#153,.T.);
#89=CYLINDRICAL_SURFACE('',#154,4.37);
#90=FACE_OUTER_BOUND('',#155,.T.);
#91=CONICAL_SURFACE('',#156,5.3875,1.0471975511966);
#92=FACE_OUTER_BOUND('',#157,.T.);
#93=CONICAL_SURFACE('',#158,5.3875,1.0471975511966);
#94=FACE_OUTER_BOUND('',#159,.T.);
#95=FACE_BOUND('',#160,.T.);
#96=PLANE('',#161);
#97=FACE_OUTER_BOUND('',#162,.T.);
#98=CONICAL_SURFACE('',#163,5.3875,1.0471975511966);
#99=FACE_OUTER_BOUND('',#164,.T.);
#100=CONICAL_SURFACE('',#165,5.3875,1.0471975511966);
#101=FACE_OUTER_BOUND('',#166,.T.);
#102=CONICAL_SURFACE('',#167,5.3875,1.0471975511966);
#103=FACE_OUTER_BOUND('',#168,.T.);
#104=CONICAL_SURFACE('',#169,5.3875,1.0471975511966);
#105=FACE_OUTER_BOUND('',#170,.T.);
#106=CONICAL_SURFACE('',#171,5.3875,1.0471975511966);
#107=FACE_OUTER_BOUND('',#172,.T.);
#108=CONICAL_SURFACE('',#173,5.3875,1.0471975511966);
#109=FACE_OUTER_BOUND('',#174,.T.);
#110=PLANE('',#175);
#111=FACE_OUTER_BOUND('',#176,.T.);
#112=PLANE('',#177);
#113=FACE_OUTER_BOUND('',#178,.T.);
#114=PLANE('',#179);
#115=FACE_OUTER_BOUND('',#180,.T.);
#116=PLANE('',#181);
#117=FACE_OUTER_BOUND('',#182,.T.);
#118=PLANE('',#183);
#119=FACE_OUTER_BOUND('',#184,.T.);
#120=PLANE('',#185);
#121=FACE_OUTER_BOUND('',#186,.T.);
#122=PLANE('',#187);
#123=FACE_OUTER_BOUND('',#188,.T.);
#124=CYLINDRICAL_SURFACE('',#189,4.37);
#125=FACE_BOUND('',#190,.T.);
#126=FACE_OUTER_BOUND('',#191,.T.);
#127=PLANE('',#192);
#128=FACE_OUTER_BOUND('',#193,.T.);
#129=TOROIDAL_SURFACE('',#194,3.25,0.25);
#130=FACE_OUTER_BOUND('',#195,.T.);
#131=CYLINDRICAL_SURFACE('',#196,3.0);
#132=FACE_OUTER_BOUND('',#197,.T.);
#133=CONICAL_SURFACE('',#198,2.729375,0.78539816339745);
#134=FACE_OUTER_BOUND('',#199,.T.);
#135=FACE_BOUND('',#200,.T.);
#136=PLANE('',#201);
#137=FACE_OUTER_BOUND('',#202,.T.);
#138=CYLINDRICAL_SURFACE('',#203,3.0);
#139=FACE_OUTER_BOUND('',#204,.T.);
#140=CONICAL_SURFACE('',#205,2.729375,0.78539816339745);
#141=FACE_OUTER_BOUND('',#206,.T.);
#142=PLANE('',#207);
#143=EDGE_LOOP('',(#208,#209,#210,#211));
#144=AXIS2_PLACEMENT_3D('',#212,#213,#214);
#145=EDGE_LOOP('',(#215,#216,#217,#218));
#146=AXIS2_PLACEMENT_3D('',#219,#220,#221);
#147=EDGE_LOOP('',(#222,#223,#224,#225));
#148=AXIS2_PLACEMENT_3D('',#226,#227,#228);
#149=EDGE_LOOP('',(#229,#230,#231,#232,#233));
#150=AXIS2_PLACEMENT_3D('',#234,#235,#236);
#151=EDGE_LOOP('',(#237,#238,#239,#240,#241));
#152=AXIS2_PLACEMENT_3D('',#242,#243,#244);
#153=EDGE_LOOP('',(#245,#246,#247,#248));
#154=AXIS2_PLACEMENT_3D('',#249,#250,#251);
#155=EDGE_LOOP('',(#252,#253,#254));
#156=AXIS2_PLACEMENT_3D('',#255,#256,#257);
#157=EDGE_LOOP('',(#258,#259,#260));
#158=AXIS2_PLACEMENT_3D('',#261,#262,#263);
#159=EDGE_LOOP('',(#264,#265,#266,#267,#268,#269));
#160=EDGE_LOOP('',(#270,#271));
#161=AXIS2_PLACEMENT_3D('',#272,#273,#274);
#162=EDGE_LOOP('',(#275,#276,#277));
#163=AXIS2_PLACEMENT_3D('',#278,#279,#280);
#164=EDGE_LOOP('',(#281,#282,#283));
#165=AXIS2_PLACEMENT_3D('',#284,#285,#286);
#166=EDGE_LOOP('',(#287,#288,#289));
#167=AXIS2_PLACEMENT_3D('',#290,#291,#292);
#168=EDGE_LOOP('',(#293,#294,#295));
#169=AXIS2_PLACEMENT_3D('',#296,#297,#298);
#170=EDGE_LOOP('',(#299,#300,#301));
#171=AXIS2_PLACEMENT_3D('',#302,#303,#304);
#172=EDGE_LOOP('',(#305,#306,#307));
#173=AXIS2_PLACEMENT_3D('',#308,#309,#310);
#174=EDGE_LOOP('',(#311,#312,#313,#314,#315,#316,#317,#318));
#175=AXIS2_PLACEMENT_3D('',#319,#320,#321);
#176=EDGE_LOOP('',(#322,#323,#324,#325,#326));
#177=AXIS2_PLACEMENT_3D('',#327,#328,#329);
#178=EDGE_LOOP('',(#330,#331,#332,#333,#334));
#179=AXIS2_PLACEMENT_3D('',#335,#336,#337);
#180=EDGE_LOOP('',(#338,#339,#340,#341,#342));
#181=AXIS2_PLACEMENT_3D('',#343,#344,#345);
#182=EDGE_LOOP('',(#346,#347,#348,#349,#350));
#183=AXIS2_PLACEMENT_3D('',#351,#352,#353);
#184=EDGE_LOOP('',(#354,#355,#356,#357,#358));
#185=AXIS2_PLACEMENT_3D('',#359,#360,#361);
#186=EDGE_LOOP('',(#362,#363,#364,#365,#366));
#187=AXIS2_PLACEMENT_3D('',#367,#368,#369);
#188=EDGE_LOOP('',(#370,#371,#372,#373));
#189=AXIS2_PLACEMENT_3D('',#374,#375,#376);
#190=EDGE_LOOP('',(#377,#378,#379));
#191=EDGE_LOOP('',(#380,#381));
#192=AXIS2_PLACEMENT_3D('',#382,#383,#384);
#193=EDGE_LOOP('',(#385,#386,#387,#388,#389,#390));
#194=AXIS2_PLACEMENT_3D('',#391,#392,#393);
#195=EDGE_LOOP('',(#394,#395,#396,#397,#398));
#196=AXIS2_PLACEMENT_3D('',#399,#400,#401);
#197=EDGE_LOOP('',(#402,#403,#404,#405));
#198=AXIS2_PLACEMENT_3D('',#406,#407,#408);
#199=EDGE_LOOP('',(#409,#410));
#200=EDGE_LOOP('',(#411,#412));
#201=AXIS2_PLACEMENT_3D('',#413,#414,#415);
#202=EDGE_LOOP('',(#416,#417,#418,#419));
#203=AXIS2_PLACEMENT_3D('',#420,#421,#422);
#204=EDGE_LOOP('',(#423,#424,#425,#426));
#205=AXIS2_PLACEMENT_3D('',#427,#428,#429);
#206=EDGE_LOOP('',(#430,#431));
#207=AXIS2_PLACEMENT_3D('',#432,#433,#434);
#208=ORIENTED_EDGE('',*,*,#435,.F.);
#209=ORIENTED_EDGE('',*,*,#436,.T.);
#210=ORIENTED_EDGE('',*,*,#437,.F.);
#211=ORIENTED_EDGE('',*,*,#438,.F.);
#212=CARTESIAN_POINT('',(3.65724860674197E-15,0.0,59.729375));
#213=DIRECTION('',(-6.12303176911189E-17,0.0,-1.0));
#214=DIRECTION('',(0.0,1.0,0.0));
#215=ORIENTED_EDGE('',*,*,#439,.F.);
#216=ORIENTED_EDGE('',*,*,#440,.T.);
#217=ORIENTED_EDGE('',*,*,#441,.F.);
#218=ORIENTED_EDGE('',*,*,#436,.F.);
#219=CARTESIAN_POINT('',(3.1061757475219E-15,0.0,50.729375));
#220=DIRECTION('',(6.12303176911189E-17,-0.0,1.0));
#221=DIRECTION('',(0.0,1.0,0.0));
#222=ORIENTED_EDGE('',*,*,#442,.F.);
#223=ORIENTED_EDGE('',*,*,#443,.T.);
#224=ORIENTED_EDGE('',*,*,#444,.F.);
#225=ORIENTED_EDGE('',*,*,#445,.F.);
#226=CARTESIAN_POINT('',(2.55510288830183E-15,0.0,41.729375));
#227=DIRECTION('',(-6.12303176911189E-17,0.0,-1.0));
#228=DIRECTION('',(0.0,1.0,0.0));
#229=ORIENTED_EDGE('',*,*,#446,.F.);
#230=ORIENTED_EDGE('',*,*,#447,.T.);
#231=ORIENTED_EDGE('',*,*,#448,.T.);
#232=ORIENTED_EDGE('',*,*,#449,.F.);
#233=ORIENTED_EDGE('',*,*,#443,.F.);
#234=CARTESIAN_POINT('',(1.27692000649973E-15,0.0,20.854375));
#235=DIRECTION('',(6.12303176911189E-17,-0.0,1.0));
#236=DIRECTION('',(0.0,1.0,0.0));
#237=ORIENTED_EDGE('',*,*,#450,.F.);
#238=ORIENTED_EDGE('',*,*,#451,.T.);
#239=ORIENTED_EDGE('',*,*,#452,.F.);
#240=ORIENTED_EDGE('',*,*,#453,.F.);
#241=ORIENTED_EDGE('',*,*,#448,.F.);
#242=CARTESIAN_POINT('',(1.53075794227797E-17,0.0,0.25));
#243=DIRECTION('',(6.12303176911189E-17,0.0,1.0));
#244=DIRECTION('',(1.0,0.0,-6.12303176911189E-17));
#245=ORIENTED_EDGE('',*,*,#454,.F.);
#246=ORIENTED_EDGE('',*,*,#455,.T.);
#247=ORIENTED_EDGE('',*,*,#456,.F.);
#248=ORIENTED_EDGE('',*,*,#457,.F.);
#249=CARTESIAN_POINT('',(-4.59227382683391E-17,0.0,-0.75));
#250=DIRECTION('',(6.12303176911189E-17,-0.0,1.0));
#251=DIRECTION('',(0.0,1.0,0.0));
#252=ORIENTED_EDGE('',*,*,#458,.F.);
#253=ORIENTED_EDGE('',*,*,#459,.T.);
#254=ORIENTED_EDGE('',*,*,#460,.F.);
#255=CARTESIAN_POINT('',(1.69992308667762E-16,2.00607467513322E-16,-3.77627677068902));
#256=DIRECTION('',(-6.12303176911189E-17,-6.12303176911189E-17,1.0));
#257=DIRECTION('',(3.74915180455534E-33,-1.0,-6.12303176911189E-17));
#258=ORIENTED_EDGE('',*,*,#461,.F.);
#259=ORIENTED_EDGE('',*,*,#462,.F.);
#260=ORIENTED_EDGE('',*,*,#463,.T.);
#261=CARTESIAN_POINT('',(1.69992308667762E-16,2.00607467513322E-16,-3.77627677068902));
#262=DIRECTION('',(-6.12303176911189E-17,-6.12303176911189E-17,1.0));
#263=DIRECTION('',(3.74915180455534E-33,-1.0,-6.12303176911189E-17));
#264=ORIENTED_EDGE('',*,*,#464,.T.);
#265=ORIENTED_EDGE('',*,*,#465,.T.);
#266=ORIENTED_EDGE('',*,*,#466,.T.);
#267=ORIENTED_EDGE('',*,*,#467,.T.);
#268=ORIENTED_EDGE('',*,*,#468,.T.);
#269=ORIENTED_EDGE('',*,*,#469,.T.);
#270=ORIENTED_EDGE('',*,*,#470,.F.);
#271=ORIENTED_EDGE('',*,*,#455,.F.);
#272=CARTESIAN_POINT('',(-3.06151588455594E-17,-2.8875,-0.5));
#273=DIRECTION('',(-6.12303176911189E-17,-6.12303176911189E-17,1.0));
#274=DIRECTION('',(-3.74915180455534E-33,1.0,6.12303176911189E-17));
#275=ORIENTED_EDGE('',*,*,#471,.T.);
#276=ORIENTED_EDGE('',*,*,#472,.F.);
#277=ORIENTED_EDGE('',*,*,#473,.T.);
#278=CARTESIAN_POINT('',(1.69992308667762E-16,2.00607467513322E-16,-3.77627677068902));
#279=DIRECTION('',(-6.12303176911189E-17,-6.12303176911189E-17,1.0));
#280=DIRECTION('',(3.74915180455534E-33,-1.0,-6.12303176911189E-17));
#281=ORIENTED_EDGE('',*,*,#461,.T.);
#282=ORIENTED_EDGE('',*,*,#474,.T.);
#283=ORIENTED_EDGE('',*,*,#475,.F.);
#284=CARTESIAN_POINT('',(1.69992308667762E-16,2.00607467513322E-16,-3.77627677068902));
#285=DIRECTION('',(-6.12303176911189E-17,-6.12303176911189E-17,1.0));
#286=DIRECTION('',(3.74915180455534E-33,-1.0,-6.12303176911189E-17));
#287=ORIENTED_EDGE('',*,*,#476,.T.);
#288=ORIENTED_EDGE('',*,*,#477,.F.);
#289=ORIENTED_EDGE('',*,*,#478,.T.);
#290=CARTESIAN_POINT('',(1.69992308667762E-16,2.00607467513322E-16,-3.77627677068902));
#291=DIRECTION('',(-6.12303176911189E-17,-6.12303176911189E-17,1.0));
#292=DIRECTION('',(3.74915180455534E-33,-1.0,-6.12303176911189E-17));
#293=ORIENTED_EDGE('',*,*,#479,.T.);
#294=ORIENTED_EDGE('',*,*,#480,.T.);
#295=ORIENTED_EDGE('',*,*,#481,.F.);
#296=CARTESIAN_POINT('',(1.69992308667762E-16,2.00607467513322E-16,-3.77627677068902));
#297=DIRECTION('',(-6.12303176911189E-17,-6.12303176911189E-17,1.0));
#298=DIRECTION('',(3.74915180455534E-33,-1.0,-6.12303176911189E-17));
#299=ORIENTED_EDGE('',*,*,#458,.T.);
#300=ORIENTED_EDGE('',*,*,#482,.F.);
#301=ORIENTED_EDGE('',*,*,#483,.T.);
#302=CARTESIAN_POINT('',(1.69992308667762E-16,2.00607467513322E-16,-3.77627677068902));
#303=DIRECTION('',(-6.12303176911189E-17,-6.12303176911189E-17,1.0));
#304=DIRECTION('',(3.74915180455534E-33,-1.0,-6.12303176911189E-17));
#305=ORIENTED_EDGE('',*,*,#484,.T.);
#306=ORIENTED_EDGE('',*,*,#485,.T.);
#307=ORIENTED_EDGE('',*,*,#486,.F.);
#308=CARTESIAN_POINT('',(1.69992308667762E-16,2.00607467513322E-16,-3.77627677068902));
#309=DIRECTION('',(-6.12303176911189E-17,-6.12303176911189E-17,1.0));
#310=DIRECTION('',(3.74915180455534E-33,-1.0,-6.12303176911189E-17));
#311=ORIENTED_EDGE('',*,*,#482,.T.);
#312=ORIENTED_EDGE('',*,*,#460,.T.);
#313=ORIENTED_EDGE('',*,*,#486,.T.);
#314=ORIENTED_EDGE('',*,*,#472,.T.);
#315=ORIENTED_EDGE('',*,*,#462,.T.);
#316=ORIENTED_EDGE('',*,*,#475,.T.);
#317=ORIENTED_EDGE('',*,*,#477,.T.);
#318=ORIENTED_EDGE('',*,*,#481,.T.);
#319=CARTESIAN_POINT('',(1.83690953073357E-16,-2.5,-4.0));
#320=DIRECTION('',(6.12303176911189E-17,6.12303176911189E-17,-1.0));
#321=DIRECTION('',(3.74915180455534E-33,-1.0,-6.12303176911189E-17));
#322=ORIENTED_EDGE('',*,*,#463,.F.);
#323=ORIENTED_EDGE('',*,*,#471,.F.);
#324=ORIENTED_EDGE('',*,*,#487,.F.);
#325=ORIENTED_EDGE('',*,*,#467,.F.);
#326=ORIENTED_EDGE('',*,*,#488,.T.);
#327=CARTESIAN_POINT('',(-2.5,4.33012701892219,0.5));
#328=DIRECTION('',(-0.5,0.866025403784438,2.24118517567412E-17));
#329=DIRECTION('',(0.866025403784438,0.5,8.36421694478601E-17));
#330=ORIENTED_EDGE('',*,*,#478,.F.);
#331=ORIENTED_EDGE('',*,*,#474,.F.);
#332=ORIENTED_EDGE('',*,*,#488,.F.);
#333=ORIENTED_EDGE('',*,*,#466,.F.);
#334=ORIENTED_EDGE('',*,*,#489,.T.);
#335=CARTESIAN_POINT('',(2.5,4.33012701892219,0.5));
#336=DIRECTION('',(0.5,0.866025403784439,8.36421694478601E-17));
#337=DIRECTION('',(0.866025403784439,-0.5,2.24118517567413E-17));
#338=ORIENTED_EDGE('',*,*,#473,.F.);
#339=ORIENTED_EDGE('',*,*,#485,.F.);
#340=ORIENTED_EDGE('',*,*,#490,.F.);
#341=ORIENTED_EDGE('',*,*,#468,.F.);
#342=ORIENTED_EDGE('',*,*,#487,.T.);
#343=CARTESIAN_POINT('',(-5.0,-9.49408737391244E-16,0.5));
#344=DIRECTION('',(-1.0,0.0,-6.12303176911189E-17));
#345=DIRECTION('',(-3.74915180455534E-33,1.0,6.12303176911189E-17));
#346=ORIENTED_EDGE('',*,*,#480,.F.);
#347=ORIENTED_EDGE('',*,*,#491,.F.);
#348=ORIENTED_EDGE('',*,*,#464,.F.);
#349=ORIENTED_EDGE('',*,*,#492,.T.);
#350=ORIENTED_EDGE('',*,*,#483,.F.);
#351=CARTESIAN_POINT('',(2.5,-4.33012701892219,0.5));
#352=DIRECTION('',(0.5,-0.866025403784439,-2.24118517567412E-17));
#353=DIRECTION('',(-0.866025403784439,-0.5,-8.36421694478601E-17));
#354=ORIENTED_EDGE('',*,*,#476,.F.);
#355=ORIENTED_EDGE('',*,*,#489,.F.);
#356=ORIENTED_EDGE('',*,*,#465,.F.);
#357=ORIENTED_EDGE('',*,*,#491,.T.);
#358=ORIENTED_EDGE('',*,*,#479,.F.);
#359=CARTESIAN_POINT('',(5.0,1.71512652170913E-15,0.5));
#360=DIRECTION('',(1.0,1.53837014910685E-16,6.12303176911189E-17));
#361=DIRECTION('',(1.53837014910685E-16,-1.0,-6.12303176911189E-17));
#362=ORIENTED_EDGE('',*,*,#459,.F.);
#363=ORIENTED_EDGE('',*,*,#492,.F.);
#364=ORIENTED_EDGE('',*,*,#469,.F.);
#365=ORIENTED_EDGE('',*,*,#490,.T.);
#366=ORIENTED_EDGE('',*,*,#484,.F.);
#367=CARTESIAN_POINT('',(-2.5,-4.33012701892219,0.5));
#368=DIRECTION('',(-0.5,-0.866025403784439,-8.36421694478601E-17));
#369=DIRECTION('',(-0.866025403784439,0.5,-2.24118517567412E-17));
#370=ORIENTED_EDGE('',*,*,#454,.T.);
#371=ORIENTED_EDGE('',*,*,#493,.F.);
#372=ORIENTED_EDGE('',*,*,#456,.T.);
#373=ORIENTED_EDGE('',*,*,#470,.T.);
#374=CARTESIAN_POINT('',(-4.59227382683391E-17,0.0,-0.75));
#375=DIRECTION('',(6.12303176911189E-17,-0.0,1.0));
#376=DIRECTION('',(0.0,1.0,0.0));
#377=ORIENTED_EDGE('',*,*,#494,.F.);
#378=ORIENTED_EDGE('',*,*,#495,.F.);
#379=ORIENTED_EDGE('',*,*,#451,.F.);
#380=ORIENTED_EDGE('',*,*,#457,.T.);
#381=ORIENTED_EDGE('',*,*,#493,.T.);
#382=CARTESIAN_POINT('',(0.0,3.81,0.0));
#383=DIRECTION('',(6.12303176911189E-17,1.98254111540207E-16,1.0));
#384=DIRECTION('',(-1.21391622331774E-32,1.0,-1.98254111540207E-16));
#385=ORIENTED_EDGE('',*,*,#450,.T.);
#386=ORIENTED_EDGE('',*,*,#447,.F.);
#387=ORIENTED_EDGE('',*,*,#496,.F.);
#388=ORIENTED_EDGE('',*,*,#452,.T.);
#389=ORIENTED_EDGE('',*,*,#495,.T.);
#390=ORIENTED_EDGE('',*,*,#494,.T.);
#391=CARTESIAN_POINT('',(1.53075794227797E-17,0.0,0.25));
#392=DIRECTION('',(6.12303176911189E-17,0.0,1.0));
#393=DIRECTION('',(1.0,0.0,-6.12303176911189E-17));
#394=ORIENTED_EDGE('',*,*,#446,.T.);
#395=ORIENTED_EDGE('',*,*,#497,.F.);
#396=ORIENTED_EDGE('',*,*,#449,.T.);
#397=ORIENTED_EDGE('',*,*,#453,.T.);
#398=ORIENTED_EDGE('',*,*,#496,.T.);
#399=CARTESIAN_POINT('',(1.27692000649973E-15,0.0,20.854375));
#400=DIRECTION('',(6.12303176911189E-17,-0.0,1.0));
#401=DIRECTION('',(0.0,1.0,0.0));
#402=ORIENTED_EDGE('',*,*,#442,.T.);
#403=ORIENTED_EDGE('',*,*,#498,.F.);
#404=ORIENTED_EDGE('',*,*,#444,.T.);
#405=ORIENTED_EDGE('',*,*,#497,.T.);
#406=CARTESIAN_POINT('',(2.55510288830183E-15,0.0,41.729375));
#407=DIRECTION('',(-6.12303176911189E-17,0.0,-1.0));
#408=DIRECTION('',(0.0,1.0,0.0));
#409=ORIENTED_EDGE('',*,*,#440,.F.);
#410=ORIENTED_EDGE('',*,*,#499,.F.);
#411=ORIENTED_EDGE('',*,*,#445,.T.);
#412=ORIENTED_EDGE('',*,*,#498,.T.);
#413=CARTESIAN_POINT('',(2.57167334302699E-15,2.729375,42.0));
#414=DIRECTION('',(-6.12303176911189E-17,-0.0,-1.0));
#415=DIRECTION('',(0.0,-1.0,0.0));
#416=ORIENTED_EDGE('',*,*,#439,.T.);
#417=ORIENTED_EDGE('',*,*,#500,.F.);
#418=ORIENTED_EDGE('',*,*,#441,.T.);
#419=ORIENTED_EDGE('',*,*,#499,.T.);
#420=CARTESIAN_POINT('',(3.1061757475219E-15,0.0,50.729375));
#421=DIRECTION('',(6.12303176911189E-17,-0.0,1.0));
#422=DIRECTION('',(0.0,1.0,0.0));
#423=ORIENTED_EDGE('',*,*,#435,.T.);
#424=ORIENTED_EDGE('',*,*,#501,.F.);
#425=ORIENTED_EDGE('',*,*,#437,.T.);
#426=ORIENTED_EDGE('',*,*,#500,.T.);
#427=CARTESIAN_POINT('',(3.65724860674197E-15,0.0,59.729375));
#428=DIRECTION('',(-6.12303176911189E-17,0.0,-1.0));
#429=DIRECTION('',(0.0,1.0,0.0));
#430=ORIENTED_EDGE('',*,*,#438,.T.);
#431=ORIENTED_EDGE('',*,*,#501,.T.);
#432=CARTESIAN_POINT('',(3.67381906146713E-15,1.229375,60.0));
#433=DIRECTION('',(6.12303176911189E-17,-0.0,1.0));
#434=DIRECTION('',(0.0,1.0,0.0));
#435=EDGE_CURVE('',#502,#503,#504,.T.);
#436=EDGE_CURVE('',#502,#505,#506,.T.);
#437=EDGE_CURVE('',#507,#505,#508,.T.);
#438=EDGE_CURVE('',#503,#507,#509,.T.);
#439=EDGE_CURVE('',#510,#502,#511,.T.);
#440=EDGE_CURVE('',#510,#512,#513,.T.);
#441=EDGE_CURVE('',#505,#512,#514,.T.);
#442=EDGE_CURVE('',#515,#516,#517,.T.);
#443=EDGE_CURVE('',#515,#518,#519,.T.);
#444=EDGE_CURVE('',#520,#518,#521,.T.);
#445=EDGE_CURVE('',#516,#520,#522,.T.);
#446=EDGE_CURVE('',#523,#515,#524,.T.);
#447=EDGE_CURVE('',#523,#525,#526,.T.);
#448=EDGE_CURVE('',#525,#527,#528,.T.);
#449=EDGE_CURVE('',#518,#527,#529,.T.);
#450=EDGE_CURVE('',#530,#525,#531,.T.);
#451=EDGE_CURVE('',#530,#532,#533,.T.);
#452=EDGE_CURVE('',#534,#532,#535,.T.);
#453=EDGE_CURVE('',#527,#534,#536,.T.);
#454=EDGE_CURVE('',#537,#538,#539,.T.);
#455=EDGE_CURVE('',#537,#540,#541,.T.);
#456=EDGE_CURVE('',#542,#540,#543,.T.);
#457=EDGE_CURVE('',#538,#542,#544,.T.);
#458=EDGE_CURVE('',#545,#546,#547,.T.);
#459=EDGE_CURVE('',#545,#548,#549,.T.);
#460=EDGE_CURVE('',#546,#548,#550,.T.);
#461=EDGE_CURVE('',#551,#552,#553,.T.);
#462=EDGE_CURVE('',#554,#551,#555,.T.);
#463=EDGE_CURVE('',#554,#552,#556,.T.);
#464=EDGE_CURVE('',#557,#558,#559,.T.);
#465=EDGE_CURVE('',#558,#560,#561,.T.);
#466=EDGE_CURVE('',#560,#562,#563,.T.);
#467=EDGE_CURVE('',#562,#564,#565,.T.);
#468=EDGE_CURVE('',#564,#566,#567,.T.);
#469=EDGE_CURVE('',#566,#557,#568,.T.);
#470=EDGE_CURVE('',#540,#537,#569,.T.);
#471=EDGE_CURVE('',#570,#554,#571,.T.);
#472=EDGE_CURVE('',#572,#554,#573,.T.);
#473=EDGE_CURVE('',#572,#570,#574,.T.);
#474=EDGE_CURVE('',#552,#575,#576,.T.);
#475=EDGE_CURVE('',#551,#575,#577,.T.);
#476=EDGE_CURVE('',#578,#579,#580,.T.);
#477=EDGE_CURVE('',#575,#579,#581,.T.);
#478=EDGE_CURVE('',#575,#578,#582,.T.);
#479=EDGE_CURVE('',#579,#583,#584,.T.);
#480=EDGE_CURVE('',#583,#585,#586,.T.);
#481=EDGE_CURVE('',#579,#585,#587,.T.);
#482=EDGE_CURVE('',#585,#546,#588,.T.);
#483=EDGE_CURVE('',#585,#545,#589,.T.);
#484=EDGE_CURVE('',#548,#590,#591,.T.);
#485=EDGE_CURVE('',#590,#572,#592,.T.);
#486=EDGE_CURVE('',#548,#572,#593,.T.);
#487=EDGE_CURVE('',#564,#570,#594,.T.);
#488=EDGE_CURVE('',#562,#552,#595,.T.);
#489=EDGE_CURVE('',#560,#578,#596,.T.);
#490=EDGE_CURVE('',#566,#590,#597,.T.);
#491=EDGE_CURVE('',#558,#583,#598,.T.);
#492=EDGE_CURVE('',#557,#545,#599,.T.);
#493=EDGE_CURVE('',#542,#538,#600,.T.);
#494=EDGE_CURVE('',#601,#530,#602,.T.);
#495=EDGE_CURVE('',#532,#601,#603,.T.);
#496=EDGE_CURVE('',#534,#523,#604,.T.);
#497=EDGE_CURVE('',#518,#515,#605,.T.);
#498=EDGE_CURVE('',#520,#516,#606,.T.);
#499=EDGE_CURVE('',#512,#510,#607,.T.);
#500=EDGE_CURVE('',#505,#502,#608,.T.);
#501=EDGE_CURVE('',#507,#503,#609,.T.);
#502=VERTEX_POINT('',#610);
#503=VERTEX_POINT('',#611);
#504=LINE('',#612,#613);
#505=VERTEX_POINT('',#614);
#506=CIRCLE('',#615,3.0);
#507=VERTEX_POINT('',#616);
#508=LINE('',#617,#618);
#509=CIRCLE('',#619,2.45875);
#510=VERTEX_POINT('',#620);
#511=LINE('',#621,#622);
#512=VERTEX_POINT('',#623);
#513=CIRCLE('',#624,3.0);
#514=LINE('',#625,#626);
#515=VERTEX_POINT('',#627);
#516=VERTEX_POINT('',#628);
#517=LINE('',#629,#630);
#518=VERTEX_POINT('',#631);
#519=CIRCLE('',#632,3.0);
#520=VERTEX_POINT('',#633);
#521=LINE('',#634,#635);
#522=CIRCLE('',#636,2.45875);
#523=VERTEX_POINT('',#637);
#524=LINE('',#638,#639);
#525=VERTEX_POINT('',#640);
#526=CIRCLE('',#641,3.0);
#527=VERTEX_POINT('',#642);
#528=CIRCLE('',#643,3.0);
#529=LINE('',#644,#645);
#530=VERTEX_POINT('',#646);
#531=CIRCLE('',#647,0.25);
#532=VERTEX_POINT('',#648);
#533=CIRCLE('',#649,3.25);
#534=VERTEX_POINT('',#650);
#535=CIRCLE('',#651,0.25);
#536=CIRCLE('',#652,3.0);
#537=VERTEX_POINT('',#653);
#538=VERTEX_POINT('',#654);
#539=LINE('',#655,#656);
#540=VERTEX_POINT('',#657);
#541=CIRCLE('',#658,4.37);
#542=VERTEX_POINT('',#659);
#543=LINE('',#660,#661);
#544=CIRCLE('',#662,4.37);
#545=VERTEX_POINT('',#663);
#546=VERTEX_POINT('',#664);
#547=LINE('',#665,#666);
#548=VERTEX_POINT('',#667);
#549=(B_SPLINE_CURVE(2,(#669,#670,#671,#672,#673),.UNSPECIFIED.,.F.,.F.)B_SPLINE_CURVE_WITH_KNOTS((3,2,3),(0.0,2.9316581987571,5.86331639751421),.UNSPECIFIED.)RATIONAL_B_SPLINE_CURVE((1.0,1.03802697460133,1.0,1.03802697460133,1.0))BOUNDED_CURVE()REPRESENTATION_ITEM('')GEOMETRIC_REPRESENTATION_ITEM()CURVE());
#550=CIRCLE('',#680,5.0);
#551=VERTEX_POINT('',#681);
#552=VERTEX_POINT('',#682);
#553=LINE('',#683,#684);
#554=VERTEX_POINT('',#685);
#555=CIRCLE('',#686,5.0);
#556=(B_SPLINE_CURVE(2,(#688,#689,#690,#691,#692),.UNSPECIFIED.,.F.,.F.)B_SPLINE_CURVE_WITH_KNOTS((3,2,3),(0.0,2.9316581987571,5.86331639751421),.UNSPECIFIED.)RATIONAL_B_SPLINE_CURVE((1.0,1.03802697460133,1.0,1.03802697460134,1.0))BOUNDED_CURVE()REPRESENTATION_ITEM('')GEOMETRIC_REPRESENTATION_ITEM()CURVE());
#557=VERTEX_POINT('',#699);
#558=VERTEX_POINT('',#700);
#559=LINE('',#701,#702);
#560=VERTEX_POINT('',#703);
#561=LINE('',#704,#705);
#562=VERTEX_POINT('',#706);
#563=LINE('',#707,#708);
#564=VERTEX_POINT('',#709);
#565=LINE('',#710,#711);
#566=VERTEX_POINT('',#712);
#567=LINE('',#713,#714);
#568=LINE('',#715,#716);
#569=CIRCLE('',#717,4.37);
#570=VERTEX_POINT('',#718);
#571=(B_SPLINE_CURVE(2,(#720,#721,#722,#723,#724),.UNSPECIFIED.,.F.,.F.)B_SPLINE_CURVE_WITH_KNOTS((3,2,3),(0.0,2.9316581987571,5.86331639751421),.UNSPECIFIED.)RATIONAL_B_SPLINE_CURVE((1.0,1.03802697460133,1.0,1.03802697460134,1.0))BOUNDED_CURVE()REPRESENTATION_ITEM('')GEOMETRIC_REPRESENTATION_ITEM()CURVE());
#572=VERTEX_POINT('',#731);
#573=CIRCLE('',#732,5.0);
#574=(B_SPLINE_CURVE(2,(#734,#735,#736,#737,#738),.UNSPECIFIED.,.F.,.F.)B_SPLINE_CURVE_WITH_KNOTS((3,2,3),(0.0,2.9316581987571,5.8633163975142),.UNSPECIFIED.)RATIONAL_B_SPLINE_CURVE((1.0,1.03802697460134,1.0,1.03802697460134,1.0))BOUNDED_CURVE()REPRESENTATION_ITEM('')GEOMETRIC_REPRESENTATION_ITEM()CURVE());
#575=VERTEX_POINT('',#745);
#576=(B_SPLINE_CURVE(2,(#747,#748,#749,#750,#751),.UNSPECIFIED.,.F.,.F.)B_SPLINE_CURVE_WITH_KNOTS((3,2,3),(0.0,2.9316581987571,5.8633163975142),.UNSPECIFIED.)RATIONAL_B_SPLINE_CURVE((1.0,1.03802697460133,1.0,1.03802697460133,1.0))BOUNDED_CURVE()REPRESENTATION_ITEM('')GEOMETRIC_REPRESENTATION_ITEM()CURVE());
#577=CIRCLE('',#758,5.0);
#578=VERTEX_POINT('',#759);
#579=VERTEX_POINT('',#760);
#580=(B_SPLINE_CURVE(2,(#762,#763,#764,#765,#766),.UNSPECIFIED.,.F.,.F.)B_SPLINE_CURVE_WITH_KNOTS((3,2,3),(0.0,2.9316581987571,5.86331639751421),.UNSPECIFIED.)RATIONAL_B_SPLINE_CURVE((1.0,1.03802697460133,1.0,1.03802697460134,1.0))BOUNDED_CURVE()REPRESENTATION_ITEM('')GEOMETRIC_REPRESENTATION_ITEM()CURVE());
#581=CIRCLE('',#773,5.0);
#582=(B_SPLINE_CURVE(2,(#775,#776,#777,#778,#779),.UNSPECIFIED.,.F.,.F.)B_SPLINE_CURVE_WITH_KNOTS((3,2,3),(0.0,2.9316581987571,5.8633163975142),.UNSPECIFIED.)RATIONAL_B_SPLINE_CURVE((1.0,1.03802697460133,1.0,1.03802697460133,1.0))BOUNDED_CURVE()REPRESENTATION_ITEM('')GEOMETRIC_REPRESENTATION_ITEM()CURVE());
#583=VERTEX_POINT('',#786);
#584=(B_SPLINE_CURVE(2,(#788,#789,#790,#791,#792),.UNSPECIFIED.,.F.,.F.)B_SPLINE_CURVE_WITH_KNOTS((3,2,3),(0.0,2.9316581987571,5.86331639751421),.UNSPECIFIED.)RATIONAL_B_SPLINE_CURVE((1.0,1.03802697460133,1.0,1.03802697460134,1.0))BOUNDED_CURVE()REPRESENTATION_ITEM('')GEOMETRIC_REPRESENTATION_ITEM()CURVE());
#585=VERTEX_POINT('',#799);
#586=(B_SPLINE_CURVE(2,(#801,#802,#803,#804,#805),.UNSPECIFIED.,.F.,.F.)B_SPLINE_CURVE_WITH_KNOTS((3,2,3),(0.0,2.9316581987571,5.8633163975142),.UNSPECIFIED.)RATIONAL_B_SPLINE_CURVE((1.0,1.03802697460134,1.0,1.03802697460134,1.0))BOUNDED_CURVE()REPRESENTATION_ITEM('')GEOMETRIC_REPRESENTATION_ITEM()CURVE());
#587=CIRCLE('',#812,5.0);
#588=CIRCLE('',#813,5.0);
#589=(B_SPLINE_CURVE(2,(#815,#816,#817,#818,#819),.UNSPECIFIED.,.F.,.F.)B_SPLINE_CURVE_WITH_KNOTS((3,2,3),(0.0,2.9316581987571,5.8633163975142),.UNSPECIFIED.)RATIONAL_B_SPLINE_CURVE((1.0,1.03802697460134,1.0,1.03802697460134,1.0))BOUNDED_CURVE()REPRESENTATION_ITEM('')GEOMETRIC_REPRESENTATION_ITEM()CURVE());
#590=VERTEX_POINT('',#826);
#591=(B_SPLINE_CURVE(2,(#828,#829,#830,#831,#832),.UNSPECIFIED.,.F.,.F.)B_SPLINE_CURVE_WITH_KNOTS((3,2,3),(0.0,2.9316581987571,5.86331639751421),.UNSPECIFIED.)RATIONAL_B_SPLINE_CURVE((1.0,1.03802697460133,1.0,1.03802697460133,1.0))BOUNDED_CURVE()REPRESENTATION_ITEM('')GEOMETRIC_REPRESENTATION_ITEM()CURVE());
#592=(B_SPLINE_CURVE(2,(#840,#841,#842,#843,#844),.UNSPECIFIED.,.F.,.F.)B_SPLINE_CURVE_WITH_KNOTS((3,2,3),(0.0,2.9316581987571,5.8633163975142),.UNSPECIFIED.)RATIONAL_B_SPLINE_CURVE((1.0,1.03802697460134,1.0,1.03802697460134,1.0))BOUNDED_CURVE()REPRESENTATION_ITEM('')GEOMETRIC_REPRESENTATION_ITEM()CURVE());
#593=CIRCLE('',#851,5.0);
#594=LINE('',#852,#853);
#595=LINE('',#854,#855);
#596=LINE('',#856,#857);
#597=LINE('',#858,#859);
#598=LINE('',#860,#861);
#599=LINE('',#862,#863);
#600=CIRCLE('',#864,4.37);
#601=VERTEX_POINT('',#865);
#602=CIRCLE('',#866,3.25);
#603=CIRCLE('',#867,3.25);
#604=CIRCLE('',#868,3.0);
#605=CIRCLE('',#869,3.0);
#606=CIRCLE('',#870,2.45875);
#607=CIRCLE('',#871,3.0);
#608=CIRCLE('',#872,3.0);
#609=CIRCLE('',#873,2.45875);
#610=CARTESIAN_POINT('',(3.64067815201681E-15,3.0,59.45875));
#611=CARTESIAN_POINT('',(3.67381906146713E-15,2.45875,60.0));
#612=CARTESIAN_POINT('',(3.99148960343837E-15,2.729375,59.729375));
#613=VECTOR('',#874,1.0);
#614=CARTESIAN_POINT('',(3.2732962458701E-15,-3.0,59.45875));
#615=AXIS2_PLACEMENT_3D('',#875,#876,#877);
#616=CARTESIAN_POINT('',(3.37271897422105E-15,-2.45875,60.0));
#617=CARTESIAN_POINT('',(3.32300761004558E-15,-2.729375,59.729375));
#618=VECTOR('',#878,1.0);
#619=AXIS2_PLACEMENT_3D('',#879,#880,#881);
#620=CARTESIAN_POINT('',(2.57167334302699E-15,3.0,42.0));
#621=CARTESIAN_POINT('',(3.47355765366862E-15,3.0,50.729375));
#622=VECTOR('',#882,1.0);
#623=CARTESIAN_POINT('',(2.20429143688028E-15,-3.0,42.0));
#624=AXIS2_PLACEMENT_3D('',#883,#884,#885);
#625=CARTESIAN_POINT('',(2.73879384137519E-15,-3.0,50.729375));
#626=VECTOR('',#886,1.0);
#627=CARTESIAN_POINT('',(2.53853243357667E-15,3.0,41.45875));
#628=CARTESIAN_POINT('',(2.57167334302699E-15,2.45875,42.0));
#629=CARTESIAN_POINT('',(2.88934388499823E-15,2.729375,41.729375));
#630=VECTOR('',#887,1.0);
#631=CARTESIAN_POINT('',(2.17115052742996E-15,-3.0,41.45875));
#632=AXIS2_PLACEMENT_3D('',#888,#889,#890);
#633=CARTESIAN_POINT('',(2.27057325578092E-15,-2.45875,42.0));
#634=CARTESIAN_POINT('',(2.22086189160544E-15,-2.729375,41.729375));
#635=VECTOR('',#891,1.0);
#636=AXIS2_PLACEMENT_3D('',#892,#893,#894);
#637=CARTESIAN_POINT('',(1.53075794227797E-17,3.0,0.25));
#638=CARTESIAN_POINT('',(1.64430191264644E-15,3.0,20.854375));
#639=VECTOR('',#895,1.0);
#640=CARTESIAN_POINT('',(-3.0,3.67381906146713E-16,0.25));
#641=AXIS2_PLACEMENT_3D('',#896,#897,#898);
#642=CARTESIAN_POINT('',(-3.52074326723934E-16,-3.0,0.25));
#643=AXIS2_PLACEMENT_3D('',#899,#900,#901);
#644=CARTESIAN_POINT('',(9.09538100353014E-16,-3.0,20.854375));
#645=VECTOR('',#902,1.0);
#646=CARTESIAN_POINT('',(-3.25,3.97997064992273E-16,1.98998532496136E-16));
#647=AXIS2_PLACEMENT_3D('',#903,#904,#905);
#648=CARTESIAN_POINT('',(3.25,-3.97997064992273E-16,-1.98998532496136E-16));
#649=AXIS2_PLACEMENT_3D('',#906,#907,#908);
#650=CARTESIAN_POINT('',(3.0,-3.67381906146713E-16,0.25));
#651=AXIS2_PLACEMENT_3D('',#909,#910,#911);
#652=AXIS2_PLACEMENT_3D('',#912,#913,#914);
#653=CARTESIAN_POINT('',(5.04537817774819E-16,4.37,-0.5));
#654=CARTESIAN_POINT('',(-1.35958617011586E-32,4.37,-2.22044604925031E-16));
#655=CARTESIAN_POINT('',(5.19845397197599E-16,4.37,-0.25));
#656=VECTOR('',#915,1.0);
#657=CARTESIAN_POINT('',(5.04537817774819E-16,-4.37,-0.5));
#658=AXIS2_PLACEMENT_3D('',#916,#917,#918);
#659=CARTESIAN_POINT('',(-5.35152976620379E-16,-4.37,3.27675867718137E-32));
#660=CARTESIAN_POINT('',(-5.50460556043159E-16,-4.37,-0.25));
#661=VECTOR('',#919,1.0);
#662=AXIS2_PLACEMENT_3D('',#920,#921,#922);
#663=CARTESIAN_POINT('',(5.09871675685598E-16,-5.77350269189626,-3.5534180126148));
#664=CARTESIAN_POINT('',(7.95994129984545E-16,-5.0,-4.0));
#665=CARTESIAN_POINT('',(8.29748981789568E-16,-5.3875,-3.77627677068902));
#666=VECTOR('',#923,1.0);
#667=CARTESIAN_POINT('',(-2.5,-4.33012701892219,-4.0));
#669=CARTESIAN_POINT('',(0.00259240588634879,-5.77499941813259,-3.55255354137804));
#670=CARTESIAN_POINT('',(-1.33870422000633,-5.00060145011031,-4.0));
#671=CARTESIAN_POINT('',(-2.5,-4.33012701892219,-4.0));
#672=CARTESIAN_POINT('',(-3.66129577999367,-3.65965258773407,-4.0));
#673=CARTESIAN_POINT('',(-5.00259240588635,-2.8852546197118,-3.55255354137804));
#680=AXIS2_PLACEMENT_3D('',#924,#925,#926);
#681=CARTESIAN_POINT('',(-4.28612223837832E-16,5.0,-4.0));
#682=CARTESIAN_POINT('',(-9.04205291495015E-16,5.77350269189626,-3.55341801261479));
#683=CARTESIAN_POINT('',(-4.89764364454044E-16,5.3875,-3.77627677068902));
#684=VECTOR('',#927,1.0);
#685=CARTESIAN_POINT('',(-2.5,4.33012701892219,-4.0));
#686=AXIS2_PLACEMENT_3D('',#928,#929,#930);
#688=CARTESIAN_POINT('',(-5.00259240588635,2.88525461971179,-3.55255354137804));
#689=CARTESIAN_POINT('',(-3.66129577999367,3.65965258773407,-4.0));
#690=CARTESIAN_POINT('',(-2.5,4.33012701892219,-4.0));
#691=CARTESIAN_POINT('',(-1.33870422000633,5.00060145011031,-4.0));
#692=CARTESIAN_POINT('',(0.00259240588634784,5.77499941813259,-3.55255354137804));
#699=CARTESIAN_POINT('',(3.2290992072941E-16,-5.77350269189626,-0.5));
#700=CARTESIAN_POINT('',(5.0,-2.88675134594813,-0.5));
#701=CARTESIAN_POINT('',(1.87483791164311,-4.69106451892219,-0.5));
#702=VECTOR('',#931,1.0);
#703=CARTESIAN_POINT('',(5.0,2.88675134594813,-0.5));
#704=CARTESIAN_POINT('',(5.0,-1.44375,-0.5));
#705=VECTOR('',#932,1.0);
#706=CARTESIAN_POINT('',(-1.0911670464512E-15,5.77350269189626,-0.5));
#707=CARTESIAN_POINT('',(3.12516208835689,3.96918951892219,-0.5));
#708=VECTOR('',#933,1.0);
#709=CARTESIAN_POINT('',(-5.0,2.88675134594813,-0.5));
#710=CARTESIAN_POINT('',(-3.12516208835689,3.96918951892219,-0.5));
#711=VECTOR('',#934,0.999999999999999);
#712=CARTESIAN_POINT('',(-5.0,-2.88675134594813,-0.5));
#713=CARTESIAN_POINT('',(-5.0,-1.44375,-0.5));
#714=VECTOR('',#935,1.0);
#715=CARTESIAN_POINT('',(-1.87483791164311,-4.69106451892219,-0.5));
#716=VECTOR('',#936,1.0);
#717=AXIS2_PLACEMENT_3D('',#937,#938,#939);
#718=CARTESIAN_POINT('',(-5.0,2.88675134594813,-3.5534180126148));
#720=CARTESIAN_POINT('',(-5.00259240588635,2.88525461971179,-3.55255354137804));
#721=CARTESIAN_POINT('',(-3.66129577999367,3.65965258773407,-4.0));
#722=CARTESIAN_POINT('',(-2.5,4.33012701892219,-4.0));
#723=CARTESIAN_POINT('',(-1.33870422000633,5.00060145011031,-4.0));
#724=CARTESIAN_POINT('',(0.00259240588634784,5.77499941813259,-3.55255354137804));
#731=CARTESIAN_POINT('',(-5.0,2.14306111918916E-16,-4.0));
#732=AXIS2_PLACEMENT_3D('',#940,#941,#942);
#734=CARTESIAN_POINT('',(-5.0,-2.88974479842079,-3.55255354137804));
#735=CARTESIAN_POINT('',(-5.0,-1.34094886237624,-4.0));
#736=CARTESIAN_POINT('',(-5.0,2.14306111918916E-16,-4.0));
#737=CARTESIAN_POINT('',(-5.0,1.34094886237624,-4.0));
#738=CARTESIAN_POINT('',(-5.0,2.88974479842079,-3.55255354137804));
#745=CARTESIAN_POINT('',(2.5,4.33012701892219,-4.0));
#747=CARTESIAN_POINT('',(-0.00259240588634848,5.77499941813259,-3.55255354137804));
#748=CARTESIAN_POINT('',(1.33870422000634,5.00060145011031,-4.0));
#749=CARTESIAN_POINT('',(2.5,4.33012701892219,-4.0));
#750=CARTESIAN_POINT('',(3.66129577999366,3.65965258773408,-4.0));
#751=CARTESIAN_POINT('',(5.00259240588634,2.8852546197118,-3.55255354137804));
#758=AXIS2_PLACEMENT_3D('',#943,#944,#945);
#759=CARTESIAN_POINT('',(5.0,2.88675134594813,-3.5534180126148));
#760=CARTESIAN_POINT('',(5.0,9.83491186472341E-16,-4.0));
#762=CARTESIAN_POINT('',(5.0,2.88974479842079,-3.55255354137804));
#763=CARTESIAN_POINT('',(5.0,1.34094886237624,-4.0));
#764=CARTESIAN_POINT('',(5.0,9.83491186472341E-16,-4.0));
#765=CARTESIAN_POINT('',(5.0,-1.34094886237624,-4.0));
#766=CARTESIAN_POINT('',(5.0,-2.88974479842079,-3.55255354137804));
#773=AXIS2_PLACEMENT_3D('',#946,#947,#948);
#775=CARTESIAN_POINT('',(-0.00259240588634848,5.77499941813259,-3.55255354137804));
#776=CARTESIAN_POINT('',(1.33870422000634,5.00060145011031,-4.0));
#777=CARTESIAN_POINT('',(2.5,4.33012701892219,-4.0));
#778=CARTESIAN_POINT('',(3.66129577999366,3.65965258773408,-4.0));
#779=CARTESIAN_POINT('',(5.00259240588634,2.8852546197118,-3.55255354137804));
#786=CARTESIAN_POINT('',(5.0,-2.88675134594813,-3.5534180126148));
#788=CARTESIAN_POINT('',(5.0,2.88974479842079,-3.55255354137804));
#789=CARTESIAN_POINT('',(5.0,1.34094886237624,-4.0));
#790=CARTESIAN_POINT('',(5.0,9.83491186472341E-16,-4.0));
#791=CARTESIAN_POINT('',(5.0,-1.34094886237624,-4.0));
#792=CARTESIAN_POINT('',(5.0,-2.88974479842079,-3.55255354137804));
#799=CARTESIAN_POINT('',(2.5,-4.33012701892219,-4.0));
#801=CARTESIAN_POINT('',(5.00259240588634,-2.8852546197118,-3.55255354137804));
#802=CARTESIAN_POINT('',(3.66129577999367,-3.65965258773407,-4.0));
#803=CARTESIAN_POINT('',(2.5,-4.33012701892219,-4.0));
#804=CARTESIAN_POINT('',(1.33870422000633,-5.00060145011031,-4.0));
#805=CARTESIAN_POINT('',(-0.00259240588634467,-5.77499941813259,-3.55255354137804));
#812=AXIS2_PLACEMENT_3D('',#949,#950,#951);
#813=AXIS2_PLACEMENT_3D('',#952,#953,#954);
#815=CARTESIAN_POINT('',(5.00259240588634,-2.8852546197118,-3.55255354137804));
#816=CARTESIAN_POINT('',(3.66129577999367,-3.65965258773407,-4.0));
#817=CARTESIAN_POINT('',(2.5,-4.33012701892219,-4.0));
#818=CARTESIAN_POINT('',(1.33870422000633,-5.00060145011031,-4.0));
#819=CARTESIAN_POINT('',(-0.00259240588634467,-5.77499941813259,-3.55255354137804));
#826=CARTESIAN_POINT('',(-5.0,-2.88675134594813,-3.5534180126148));
#828=CARTESIAN_POINT('',(0.00259240588634879,-5.77499941813259,-3.55255354137804));
#829=CARTESIAN_POINT('',(-1.33870422000633,-5.00060145011031,-4.0));
#830=CARTESIAN_POINT('',(-2.5,-4.33012701892219,-4.0));
#831=CARTESIAN_POINT('',(-3.66129577999367,-3.65965258773407,-4.0));
#832=CARTESIAN_POINT('',(-5.00259240588635,-2.8852546197118,-3.55255354137804));
#840=CARTESIAN_POINT('',(-5.0,-2.88974479842079,-3.55255354137804));
#841=CARTESIAN_POINT('',(-5.0,-1.34094886237624,-4.0));
#842=CARTESIAN_POINT('',(-5.0,2.14306111918916E-16,-4.0));
#843=CARTESIAN_POINT('',(-5.0,1.34094886237624,-4.0));
#844=CARTESIAN_POINT('',(-5.0,2.88974479842079,-3.55255354137804));
#851=AXIS2_PLACEMENT_3D('',#955,#956,#957);
#852=CARTESIAN_POINT('',(-5.0,2.88675134594813,0.5));
#853=VECTOR('',#958,1.0);
#854=CARTESIAN_POINT('',(-1.15239736414232E-15,5.77350269189626,0.5));
#855=VECTOR('',#959,1.0);
#856=CARTESIAN_POINT('',(5.0,2.88675134594813,0.500000000000001));
#857=VECTOR('',#960,1.0);
#858=CARTESIAN_POINT('',(-5.0,-2.88675134594813,0.499999999999999));
#859=VECTOR('',#961,1.0);
#860=CARTESIAN_POINT('',(5.0,-2.88675134594813,0.5));
#861=VECTOR('',#962,1.0);
#862=CARTESIAN_POINT('',(2.61679603038291E-16,-5.77350269189626,0.5));
#863=VECTOR('',#963,1.0);
#864=AXIS2_PLACEMENT_3D('',#964,#965,#966);
#865=CARTESIAN_POINT('',(0.0,3.25,0.0));
#866=AXIS2_PLACEMENT_3D('',#967,#968,#969);
#867=AXIS2_PLACEMENT_3D('',#970,#971,#972);
#868=AXIS2_PLACEMENT_3D('',#973,#974,#975);
#869=AXIS2_PLACEMENT_3D('',#976,#977,#978);
#870=AXIS2_PLACEMENT_3D('',#979,#980,#981);
#871=AXIS2_PLACEMENT_3D('',#982,#983,#984);
#872=AXIS2_PLACEMENT_3D('',#985,#986,#987);
#873=AXIS2_PLACEMENT_3D('',#988,#989,#990);
#874=DIRECTION('',(-4.3296372853597E-17,-0.707106781186549,0.707106781186546));
#875=CARTESIAN_POINT('',(3.64067815201681E-15,0.0,59.45875));
#876=DIRECTION('',(6.12303176911189E-17,-0.0,1.0));
#877=DIRECTION('',(0.0,1.0,0.0));
#878=DIRECTION('',(-1.2988911856079E-16,-0.707106781186549,-0.707106781186546));
#879=CARTESIAN_POINT('',(3.67381906146713E-15,0.0,60.0));
#880=DIRECTION('',(6.12303176911189E-17,-0.0,1.0));
#881=DIRECTION('',(0.0,1.0,0.0));
#882=DIRECTION('',(6.12303176911189E-17,0.0,1.0));
#883=CARTESIAN_POINT('',(2.57167334302699E-15,0.0,42.0));
#884=DIRECTION('',(6.12303176911189E-17,-0.0,1.0));
#885=DIRECTION('',(0.0,1.0,0.0));
#886=DIRECTION('',(-6.12303176911189E-17,-0.0,-1.0));
#887=DIRECTION('',(-4.32963728535969E-17,-0.707106781186549,0.707106781186546));
#888=CARTESIAN_POINT('',(2.53853243357667E-15,0.0,41.45875));
#889=DIRECTION('',(6.12303176911189E-17,-0.0,1.0));
#890=DIRECTION('',(0.0,1.0,0.0));
#891=DIRECTION('',(-1.2988911856079E-16,-0.707106781186549,-0.707106781186546));
#892=CARTESIAN_POINT('',(2.57167334302699E-15,0.0,42.0));
#893=DIRECTION('',(6.12303176911189E-17,-0.0,1.0));
#894=DIRECTION('',(0.0,1.0,0.0));
#895=DIRECTION('',(6.12303176911189E-17,0.0,1.0));
#896=CARTESIAN_POINT('',(1.53075794227797E-17,0.0,0.25));
#897=DIRECTION('',(6.12303176911189E-17,-0.0,1.0));
#898=DIRECTION('',(0.0,1.0,0.0));
#899=CARTESIAN_POINT('',(1.53075794227797E-17,0.0,0.25));
#900=DIRECTION('',(6.12303176911189E-17,-0.0,1.0));
#901=DIRECTION('',(0.0,1.0,0.0));
#902=DIRECTION('',(-6.12303176911189E-17,-0.0,-1.0));
#903=CARTESIAN_POINT('',(-3.25,3.97997064992273E-16,0.25));
#904=DIRECTION('',(-1.22460635382238E-16,-1.0,7.49830360911069E-33));
#905=DIRECTION('',(-1.0,1.22460635382238E-16,6.12303176911189E-17));
#906=CARTESIAN_POINT('',(0.0,0.0,0.0));
#907=DIRECTION('',(6.12303176911189E-17,-0.0,1.0));
#908=DIRECTION('',(0.0,1.0,0.0));
#909=CARTESIAN_POINT('',(3.25,-3.97997064992273E-16,0.25));
#910=DIRECTION('',(-1.22460635382238E-16,-1.0,7.49830360911069E-33));
#911=DIRECTION('',(1.0,-1.22460635382238E-16,-6.12303176911189E-17));
#912=CARTESIAN_POINT('',(1.53075794227797E-17,0.0,0.25));
#913=DIRECTION('',(6.12303176911189E-17,-0.0,1.0));
#914=DIRECTION('',(0.0,1.0,0.0));
#915=DIRECTION('',(6.12303176911189E-17,0.0,1.0));
#916=CARTESIAN_POINT('',(-3.06151588455594E-17,0.0,-0.5));
#917=DIRECTION('',(-6.12303176911189E-17,-6.12303176911189E-17,1.0));
#918=DIRECTION('',(-3.74915180455534E-33,1.0,6.12303176911189E-17));
#919=DIRECTION('',(-6.12303176911189E-17,-0.0,-1.0));
#920=CARTESIAN_POINT('',(0.0,0.0,0.0));
#921=DIRECTION('',(6.12303176911189E-17,-0.0,1.0));
#922=DIRECTION('',(0.0,1.0,0.0));
#923=DIRECTION('',(-7.54388623590419E-17,0.866025403784439,-0.5));
#924=CARTESIAN_POINT('',(1.83690953073357E-16,2.14306111918916E-16,-4.0));
#925=DIRECTION('',(6.12303176911189E-17,6.12303176911189E-17,-1.0));
#926=DIRECTION('',(3.74915180455534E-33,-1.0,-6.12303176911189E-17));
#927=DIRECTION('',(-1.36669180050161E-16,0.866025403784439,0.5));
#928=CARTESIAN_POINT('',(1.83690953073357E-16,2.14306111918916E-16,-4.0));
#929=DIRECTION('',(6.12303176911189E-17,6.12303176911189E-17,-1.0));
#930=DIRECTION('',(3.74915180455534E-33,-1.0,-6.12303176911189E-17));
#931=DIRECTION('',(0.866025403784439,0.5,8.36421694478601E-17));
#932=DIRECTION('',(-1.53837014910685E-16,1.0,6.12303176911189E-17));
#933=DIRECTION('',(-0.866025403784439,0.5,-2.24118517567413E-17));
#934=DIRECTION('',(-0.866025403784438,-0.5,-8.36421694478601E-17));
#935=DIRECTION('',(3.74915180455534E-33,-1.0,-6.12303176911189E-17));
#936=DIRECTION('',(0.866025403784439,-0.5,2.24118517567412E-17));
#937=CARTESIAN_POINT('',(-3.06151588455594E-17,0.0,-0.5));
#938=DIRECTION('',(-6.12303176911189E-17,-6.12303176911189E-17,1.0));
#939=DIRECTION('',(-3.74915180455534E-33,1.0,6.12303176911189E-17));
#940=CARTESIAN_POINT('',(1.83690953073357E-16,2.14306111918916E-16,-4.0));
#941=DIRECTION('',(6.12303176911189E-17,6.12303176911189E-17,-1.0));
#942=DIRECTION('',(3.74915180455534E-33,-1.0,-6.12303176911189E-17));
#943=CARTESIAN_POINT('',(1.83690953073357E-16,2.14306111918916E-16,-4.0));
#944=DIRECTION('',(6.12303176911189E-17,6.12303176911189E-17,-1.0));
#945=DIRECTION('',(3.74915180455534E-33,-1.0,-6.12303176911189E-17));
#946=CARTESIAN_POINT('',(1.83690953073357E-16,2.14306111918916E-16,-4.0));
#947=DIRECTION('',(6.12303176911189E-17,6.12303176911189E-17,-1.0));
#948=DIRECTION('',(3.74915180455534E-33,-1.0,-6.12303176911189E-17));
#949=CARTESIAN_POINT('',(1.83690953073357E-16,2.14306111918916E-16,-4.0));
#950=DIRECTION('',(6.12303176911189E-17,6.12303176911189E-17,-1.0));
#951=DIRECTION('',(3.74915180455534E-33,-1.0,-6.12303176911189E-17));
#952=CARTESIAN_POINT('',(1.83690953073357E-16,2.14306111918916E-16,-4.0));
#953=DIRECTION('',(6.12303176911189E-17,6.12303176911189E-17,-1.0));
#954=DIRECTION('',(3.74915180455534E-33,-1.0,-6.12303176911189E-17));
#955=CARTESIAN_POINT('',(1.83690953073357E-16,2.14306111918916E-16,-4.0));
#956=DIRECTION('',(6.12303176911189E-17,6.12303176911189E-17,-1.0));
#957=DIRECTION('',(3.74915180455534E-33,-1.0,-6.12303176911189E-17));
#958=DIRECTION('',(6.12303176911189E-17,6.12303176911189E-17,-1.0));
#959=DIRECTION('',(6.12303176911189E-17,6.12303176911189E-17,-1.0));
#960=DIRECTION('',(6.12303176911189E-17,6.12303176911189E-17,-1.0));
#961=DIRECTION('',(6.12303176911189E-17,6.12303176911189E-17,-1.0));
#962=DIRECTION('',(6.12303176911189E-17,6.12303176911189E-17,-1.0));
#963=DIRECTION('',(6.12303176911189E-17,6.12303176911189E-17,-1.0));
#964=CARTESIAN_POINT('',(0.0,0.0,0.0));
#965=DIRECTION('',(6.12303176911189E-17,-0.0,1.0));
#966=DIRECTION('',(0.0,1.0,0.0));
#967=CARTESIAN_POINT('',(0.0,0.0,0.0));
#968=DIRECTION('',(6.12303176911189E-17,-0.0,1.0));
#969=DIRECTION('',(0.0,1.0,0.0));
#970=CARTESIAN_POINT('',(0.0,0.0,0.0));
#971=DIRECTION('',(6.12303176911189E-17,-0.0,1.0));
#972=DIRECTION('',(0.0,1.0,0.0));
#973=CARTESIAN_POINT('',(1.53075794227797E-17,0.0,0.25));
#974=DIRECTION('',(6.12303176911189E-17,-0.0,1.0));
#975=DIRECTION('',(0.0,1.0,0.0));
#976=CARTESIAN_POINT('',(2.53853243357667E-15,0.0,41.45875));
#977=DIRECTION('',(6.12303176911189E-17,-0.0,1.0));
#978=DIRECTION('',(0.0,1.0,0.0));
#979=CARTESIAN_POINT('',(2.57167334302699E-15,0.0,42.0));
#980=DIRECTION('',(6.12303176911189E-17,-0.0,1.0));
#981=DIRECTION('',(0.0,1.0,0.0));
#982=CARTESIAN_POINT('',(2.57167334302699E-15,0.0,42.0));
#983=DIRECTION('',(6.12303176911189E-17,-0.0,1.0));
#984=DIRECTION('',(0.0,1.0,0.0));
#985=CARTESIAN_POINT('',(3.64067815201681E-15,0.0,59.45875));
#986=DIRECTION('',(6.12303176911189E-17,-0.0,1.0));
#987=DIRECTION('',(0.0,1.0,0.0));
#988=CARTESIAN_POINT('',(3.67381906146713E-15,0.0,60.0));
#989=DIRECTION('',(6.12303176911189E-17,-0.0,1.0));
#990=DIRECTION('',(0.0,1.0,0.0));
ENDSEC;
END-ISO-10303-21;
