﻿
Pro/ENGINEER INTERFACE EXPORT LOG FILE

STEP output for Teil GENZZZLOWERFRAME.



Option values used for this export.

step_export_format                           AP203_IS
export_3d_force_default_naming               NO
intf3d_out_extend_surface                    YES
intf3d_out_surface_deviation                 DEFAULT
intf_out_as_bezier                           NO
intf3d_out_force_surf_normals                NO
intf_out_max_bspl_degree                     16


Process began at: Sat Feb 24 15:09:55 2024

Process finished at: Sat Feb 24 15:09:56 2024

Total process time: 00:00:01.


MODEL:   GENZZZLOWERFRAME
OUTPUT FILE:  genzzzlowerframe_to_print.stp

ADVANCED_BREP_SHAPE_REPRESENTATION                     1
ADVANCED_FACE                                        102
APPLICATION_CONTEXT                                    1
APPLICATION_PROTOCOL_DEFINITION                        1
APPROVAL                                               1
APPROVAL_DATE_TIME                                     1
APPROVAL_PERSON_ORGANIZATION                           1
APPROVAL_ROLE                                          1
APPROVAL_STATUS                                        1
AXIS2_PLACEMENT_3D                                   186
CALENDAR_DATE                                          1
CARTESIAN_POINT                                      558
CC_DESIGN_APPROVAL                                     1
CC_DESIGN_DATE_AND_TIME_ASSIGNMENT                     2
CC_DESIGN_PERSON_AND_ORGANIZATION_ASSIGNMENT           4
CC_DESIGN_SECURITY_CLASSIFICATION                      1
CIRCLE                                                84
CLOSED_SHELL                                           1
CONICAL_SURFACE                                       12
CONVERSION_BASED_UNIT                                  1
COORDINATED_UNIVERSAL_TIME_OFFSET                      1
CYLINDRICAL_SURFACE                                   36
DATE_AND_TIME                                          1
DATE_TIME_ROLE                                         2
DESIGN_CONTEXT                                         1
DIMENSIONAL_EXPONENTS                                  1
DIRECTION                                            564
EDGE_CURVE                                           276
EDGE_LOOP                                            136
FACE_BOUND                                            34
FACE_OUTER_BOUND                                     102
FILE_DESCRIPTION                                       1
FILE_NAME                                              1
FILE_SCHEMA                                            1
GEOMETRIC_REPRESENTATION_CONTEXT                       1
GLOBAL_UNCERTAINTY_ASSIGNED_CONTEXT                    1
GLOBAL_UNIT_ASSIGNED_CONTEXT                           1
LENGTH_UNIT                                            1
LINE                                                 192
LOCAL_TIME                                             1
MANIFOLD_SOLID_BREP                                    1
MECHANICAL_CONTEXT                                     1
NAMED_UNIT                                             4
ORGANIZATION                                           1
ORIENTED_EDGE                                        552
PERSON                                                 1
PERSON_AND_ORGANIZATION                                1
PERSON_AND_ORGANIZATION_ROLE                           4
PLANE                                                 54
PLANE_ANGLE_MEASURE_WITH_UNIT                          1
PLANE_ANGLE_UNIT                                       2
PRODUCT                                                1
PRODUCT_CATEGORY                                       1
PRODUCT_CATEGORY_RELATIONSHIP                          1
PRODUCT_DEFINITION                                     1
PRODUCT_DEFINITION_FORMATION_WITH_SPECIFIED_SOURCE     1
PRODUCT_DEFINITION_SHAPE                               1
PRODUCT_RELATED_PRODUCT_CATEGORY                       1
REPRESENTATION_CONTEXT                                 1
SECURITY_CLASSIFICATION                                1
SECURITY_CLASSIFICATION_LEVEL                          1
SHAPE_DEFINITION_REPRESENTATION                        1
SI_UNIT                                                3
SOLID_ANGLE_UNIT                                       1
UNCERTAINTY_MEASURE_WITH_UNIT                          1
VECTOR                                               192
VERTEX_POINT                                         180

TOTAL                                               3325

