Werkstoff,Dichte [g/cm3] von,Dichte [g/cm3] bis,Bruchdehnung [%] von,Bruchdehnung [%] bis,Zugfestigkeit [MPa] von,Zugfestigkeit [MPa] bis,Zugmodul [GPa] von,Zugmodul [GPa] bis,Biegefestigkeit [MPa] von,Biegefestigkeit [MPa] bis,Biegemodul [GPa] von,Biegemodul [GPa] bis
Polyesterharze,1.12,1.25,1,3,50,70,3.5,4.7,60,120,4.0,5.0
Epoxydharze,1.1,1.25,6,8,70,90,2.8,3.6,140,160,4.5,6.0
Vinylesterharze,1.07,1.07,3.5,7,75,85,3.4,3.5,125,135,3.2,3.8
