{
    "version": 2,
    "functions": {
        "api/*.php": {
            "runtime": "vercel-php@0.6.0"
        }
    },
    "routes": [
        {
            "src": "/build/(.*)",
            "dest": "/public/build/"
        },
        {
            "src": "/(.*)",
            "dest": "/api/index.php"
        }
    ],
     "env": {
        "APP_NAME": "Craig Olson Sports - News Archives",
        "APP_ENV": "production",
        "PUBLICATIONS": "2,3,6,8",
        "APP_DEBUG": "false",
        "APP_URL": "https://archives-craigolsonsports-com.vercel.app",
        "APP_CONFIG_CACHE": "/tmp/config.php",
        "APP_EVENTS_CACHE": "/tmp/events.php",
        "APP_PACKAGES_CACHE": "/tmp/packages.php",
        "APP_ROUTES_CACHE": "/tmp/routes.php",
        "APP_SERVICES_CACHE": "/tmp/services.php",
        "CACHE_DRIVER": "array",
        "LOG_CHANNEL": "stderr",
        "SESSION_DRIVER": "array",
        "VIEW_COMPILED_PATH": "/tmp/views",
        "SSR_TEMP_PATH": "/tmp/ssr",
        "NODE_PATH": "node"
    }
}
