Library\Bee\artifacts\movedfrom\Unity.Timeline.ref.dll_8300757311124903736.movedfrom
Library\Bee\artifacts\movedfrom\UnityEditor.TestRunner.ref.dll_4390446533460773852.movedfrom
Library\Bee\artifacts\movedfrom\UnityEditor.UI.ref.dll_6750382132457868446.movedfrom
Library\Bee\artifacts\movedfrom\UnityEngine.TestRunner.ref.dll_651978004708829639.movedfrom
Library\Bee\artifacts\movedfrom\UnityEngine.UI.ref.dll_1879130396959814921.movedfrom
Library\Bee\artifacts\movedfrom\UnityEditor.Graphs.dll_15161843616239100402.movedfrom
Library\Bee\artifacts\movedfrom\UnityEditor.CoreModule.dll_17604240930708248512.movedfrom
Library\Bee\artifacts\movedfrom\UnityEditor.DeviceSimulatorModule.dll_624458663612727809.movedfrom
Library\Bee\artifacts\movedfrom\UnityEditor.dll_8865381933394380245.movedfrom
Library\Bee\artifacts\movedfrom\UnityEditor.GraphViewModule.dll_3029925299008652294.movedfrom
Library\Bee\artifacts\movedfrom\UnityEditor.PackageManagerUIModule.dll_3069683152153924892.movedfrom
Library\Bee\artifacts\movedfrom\UnityEditor.QuickSearchModule.dll_3861654267223246952.movedfrom
Library\Bee\artifacts\movedfrom\UnityEditor.SceneTemplateModule.dll_10734355996158878697.movedfrom
Library\Bee\artifacts\movedfrom\UnityEditor.UIBuilderModule.dll_9121234132722629946.movedfrom
Library\Bee\artifacts\movedfrom\UnityEditor.UIElementsModule.dll_17604377568881446652.movedfrom
Library\Bee\artifacts\movedfrom\UnityEditor.UIElementsSamplesModule.dll_12443954684472792625.movedfrom
Library\Bee\artifacts\movedfrom\UnityEditor.UIServiceModule.dll_13224595459727756628.movedfrom
Library\Bee\artifacts\movedfrom\UnityEditor.UnityConnectModule.dll_15830579472109823606.movedfrom
Library\Bee\artifacts\movedfrom\UnityEngine.AccessibilityModule.dll_14383797365504510854.movedfrom
Library\Bee\artifacts\movedfrom\UnityEngine.AIModule.dll_12472910990539107860.movedfrom
Library\Bee\artifacts\movedfrom\UnityEngine.AndroidJNIModule.dll_8257412536436522450.movedfrom
Library\Bee\artifacts\movedfrom\UnityEngine.AnimationModule.dll_17911362357628377260.movedfrom
Library\Bee\artifacts\movedfrom\UnityEngine.ARModule.dll_7389126579429018845.movedfrom
Library\Bee\artifacts\movedfrom\UnityEngine.AssetBundleModule.dll_8755152749657406810.movedfrom
Library\Bee\artifacts\movedfrom\UnityEngine.AudioModule.dll_14136424484700122782.movedfrom
Library\Bee\artifacts\movedfrom\UnityEngine.ClothModule.dll_3104959429926997378.movedfrom
Library\Bee\artifacts\movedfrom\UnityEngine.ClusterInputModule.dll_6579188673617213756.movedfrom
Library\Bee\artifacts\movedfrom\UnityEngine.ClusterRendererModule.dll_1033374122258222981.movedfrom
Library\Bee\artifacts\movedfrom\UnityEngine.CoreModule.dll_1688752199540622059.movedfrom
Library\Bee\artifacts\movedfrom\UnityEngine.CrashReportingModule.dll_17697050536653444963.movedfrom
Library\Bee\artifacts\movedfrom\UnityEngine.DirectorModule.dll_6493303629327332296.movedfrom
Library\Bee\artifacts\movedfrom\UnityEngine.dll_12514501426582835898.movedfrom
Library\Bee\artifacts\movedfrom\UnityEngine.DSPGraphModule.dll_6876498178148943081.movedfrom
Library\Bee\artifacts\movedfrom\UnityEngine.GameCenterModule.dll_11305586538091966147.movedfrom
Library\Bee\artifacts\movedfrom\UnityEngine.GIModule.dll_4995890031992575534.movedfrom
Library\Bee\artifacts\movedfrom\UnityEngine.GridModule.dll_17645317863715363042.movedfrom
Library\Bee\artifacts\movedfrom\UnityEngine.HotReloadModule.dll_8780523045496370222.movedfrom
Library\Bee\artifacts\movedfrom\UnityEngine.ImageConversionModule.dll_8811651088243296121.movedfrom
Library\Bee\artifacts\movedfrom\UnityEngine.IMGUIModule.dll_18198565137372217983.movedfrom
Library\Bee\artifacts\movedfrom\UnityEngine.InputLegacyModule.dll_776211403052610379.movedfrom
Library\Bee\artifacts\movedfrom\UnityEngine.InputModule.dll_3072707135845929794.movedfrom
Library\Bee\artifacts\movedfrom\UnityEngine.JSONSerializeModule.dll_2861207134678543376.movedfrom
Library\Bee\artifacts\movedfrom\UnityEngine.LocalizationModule.dll_11068374058276367413.movedfrom
Library\Bee\artifacts\movedfrom\UnityEngine.ParticleSystemModule.dll_5236233910285689585.movedfrom
Library\Bee\artifacts\movedfrom\UnityEngine.PerformanceReportingModule.dll_2646037560135418538.movedfrom
Library\Bee\artifacts\movedfrom\UnityEngine.Physics2DModule.dll_4987702618730729537.movedfrom
Library\Bee\artifacts\movedfrom\UnityEngine.PhysicsModule.dll_18125088174673377583.movedfrom
Library\Bee\artifacts\movedfrom\UnityEngine.ProfilerModule.dll_10115949486257273557.movedfrom
Library\Bee\artifacts\movedfrom\UnityEngine.RuntimeInitializeOnLoadManagerInitializerModule.dll_4513707642005127946.movedfrom
Library\Bee\artifacts\movedfrom\UnityEngine.ScreenCaptureModule.dll_4727858492331792498.movedfrom
Library\Bee\artifacts\movedfrom\UnityEngine.SharedInternalsModule.dll_18328107662402323145.movedfrom
Library\Bee\artifacts\movedfrom\UnityEngine.SpriteMaskModule.dll_9660772737556710461.movedfrom
Library\Bee\artifacts\movedfrom\UnityEngine.SpriteShapeModule.dll_10583945540964152676.movedfrom
Library\Bee\artifacts\movedfrom\UnityEngine.StreamingModule.dll_12476904436486492138.movedfrom
Library\Bee\artifacts\movedfrom\UnityEngine.SubstanceModule.dll_9930985577167506936.movedfrom
Library\Bee\artifacts\movedfrom\UnityEngine.SubsystemsModule.dll_17347685446806694992.movedfrom
Library\Bee\artifacts\movedfrom\UnityEngine.TerrainModule.dll_1571680510282334749.movedfrom
Library\Bee\artifacts\movedfrom\UnityEngine.TerrainPhysicsModule.dll_5270759482059775358.movedfrom
Library\Bee\artifacts\movedfrom\UnityEngine.TextCoreModule.dll_17498645272905769944.movedfrom
Library\Bee\artifacts\movedfrom\UnityEngine.TextRenderingModule.dll_7700078161768716391.movedfrom
Library\Bee\artifacts\movedfrom\UnityEngine.TilemapModule.dll_13027825866552730406.movedfrom
Library\Bee\artifacts\movedfrom\UnityEngine.TLSModule.dll_8620874795254818371.movedfrom
Library\Bee\artifacts\movedfrom\UnityEngine.UIElementsModule.dll_17653474370872191047.movedfrom
Library\Bee\artifacts\movedfrom\UnityEngine.UIElementsNativeModule.dll_8436202137089426750.movedfrom
Library\Bee\artifacts\movedfrom\UnityEngine.UIModule.dll_12145166560330068928.movedfrom
Library\Bee\artifacts\movedfrom\UnityEngine.UmbraModule.dll_4540568800127752721.movedfrom
Library\Bee\artifacts\movedfrom\UnityEngine.UNETModule.dll_12255964842557847652.movedfrom
Library\Bee\artifacts\movedfrom\UnityEngine.UnityAnalyticsModule.dll_7514897858237445357.movedfrom
Library\Bee\artifacts\movedfrom\UnityEngine.UnityConnectModule.dll_14488370508044330785.movedfrom
Library\Bee\artifacts\movedfrom\UnityEngine.UnityCurlModule.dll_3147614112906873497.movedfrom
Library\Bee\artifacts\movedfrom\UnityEngine.UnityTestProtocolModule.dll_7526786893833988999.movedfrom
Library\Bee\artifacts\movedfrom\UnityEngine.UnityWebRequestAssetBundleModule.dll_5052439134439522686.movedfrom
Library\Bee\artifacts\movedfrom\UnityEngine.UnityWebRequestAudioModule.dll_11291915159982918978.movedfrom
Library\Bee\artifacts\movedfrom\UnityEngine.UnityWebRequestModule.dll_10081393135094702584.movedfrom
Library\Bee\artifacts\movedfrom\UnityEngine.UnityWebRequestTextureModule.dll_13382970664834629463.movedfrom
Library\Bee\artifacts\movedfrom\UnityEngine.UnityWebRequestWWWModule.dll_15231079120616531347.movedfrom
Library\Bee\artifacts\movedfrom\UnityEngine.VehiclesModule.dll_15123037791228347235.movedfrom
Library\Bee\artifacts\movedfrom\UnityEngine.VFXModule.dll_17906901878750678960.movedfrom
Library\Bee\artifacts\movedfrom\UnityEngine.VideoModule.dll_16805234332959607363.movedfrom
Library\Bee\artifacts\movedfrom\UnityEngine.VirtualTexturingModule.dll_11069880407369041353.movedfrom
Library\Bee\artifacts\movedfrom\UnityEngine.VRModule.dll_18113041371935258936.movedfrom
Library\Bee\artifacts\movedfrom\UnityEngine.WindModule.dll_10213744311480992084.movedfrom
Library\Bee\artifacts\movedfrom\UnityEngine.XRModule.dll_3322871669946713750.movedfrom
Library\Bee\artifacts\movedfrom\UnityEditor.Android.Extensions.dll_16442025936965945064.movedfrom
Library\Bee\artifacts\movedfrom\UnityEditor.WindowsStandalone.Extensions.dll_16500584296230213088.movedfrom
Library\Bee\artifacts\movedfrom\Unity.Plastic.Antlr3.Runtime.dll_8510714253778538078.movedfrom
Library\Bee\artifacts\movedfrom\Unity.Plastic.Newtonsoft.Json.dll_13303145017881985527.movedfrom
Library\Bee\artifacts\movedfrom\Unity.VisualScripting.IonicZip.dll_666213381244538686.movedfrom
Library\Bee\artifacts\movedfrom\Unity.VisualScripting.YamlDotNet.dll_15499609852899501726.movedfrom
Library\Bee\artifacts\movedfrom\Unity.VisualScripting.Antlr3.Runtime.dll_9837783444992636605.movedfrom