%YAML 1.1
%TAG !u! tag:unity3d.com,2011:
--- !u!1045 &1
EditorBuildSettings:
  m_ObjectHideFlags: 0
  serializedVersion: 2
  m_Scenes:
  - enabled: 1
    path: Assets/Scenes/Menu.unity
    guid: 91d5bdba79322ab4f92bfdbffa3da10e
  - enabled: 1
    path: Assets/Scenes/Game.unity
    guid: c6dc4a952934b4649b7c5bdb55f44774
  m_configObjects: {}
