%YAML 1.1
%TAG !u! tag:unity3d.com,2011:
--- !u!114 &11400000
MonoBehaviour:
  m_ObjectHideFlags: 0
  m_CorrespondingSourceObject: {fileID: 0}
  m_PrefabInstance: {fileID: 0}
  m_PrefabAsset: {fileID: 0}
  m_GameObject: {fileID: 0}
  m_Enabled: 0
  m_EditorHideFlags: 0
  m_Script: {fileID: 11500000, guid: 9568fa2247ef31a4c86cfc36d7851e00, type: 3}
  m_Name: Stone
  m_EditorClassIdentifier: 
  _itemName: Rune Stone
  _type: 6
  _prefab: {fileID: 1673006611045665541, guid: 80f4e1147cb587d4b8ea1e9d1c5e83c2, type: 3}
  _bonuses:
  - _attributeName: 5
    _type: 0
    _applyType: 4
    _value: 20
