{
	"_questions" : [
		{
			"_questionText" : "How many stages of metamorphosis do most insects go through?",
			"_answers" : [
				"2",
				"3",
				"4",
				"5"
			],
			"_correctAnswerIndex" : 2
		},
		{
			"_questionText" : "What insect was the first living creature to be sent into space?",
			"_answers" : [
				"Fruit flies",
				"Ants",
				"Bees",
				"Mosquitoes"
			],
			"_correctAnswerIndex" : 0
		},
		{
			"_questionText" : "How many days does the average housefly live for?",
			"_answers" : [
				"1",
				"7",
				"20",
				"28"
			],
			"_correctAnswerIndex" : 3
		},
		{
			"_questionText" : "Which animal’s stripes are on their skin as well as their fur?",
			"_answers" : [
				"Zebra",
				"Tiger",
				"Cheetah",
				"Cat"
			],
			"_correctAnswerIndex" : 1
		},
		{
			"_questionText" : "How many compartments are in a cow’s stomach?",
			"_answers" : [
				"1",
				"2",
				"3",
				"4"
			],
			"_correctAnswerIndex" : 3
		},
		{
			"_questionText" : "What do snakes use to smell?",
			"_answers" : [
				"Tongue",
				"Eyes",
				"Nose",
				"Skin"
			],
			"_correctAnswerIndex" : 0
		},
		{
			"_questionText" : "What animal is said to have 9 lives?",
			"_answers" : [
				"Cat",
				"Dog",
				"Mouse",
				"Starfish"
			],
			"_correctAnswerIndex" : 0
		},
		{
			"_questionText" : "What animal is known to be man's best friend?",
			"_answers" : [
				"Cat",
				"Parrot",
				"Dog",
				"Hamster"
			],
			"_correctAnswerIndex" : 2
		},
		{
			"_questionText" : "Which animal can stand on its tail?",
			"_answers" : [
				"Mouse",
				"Cat",
				"Dog",
				"Kangaroo"
			],
			"_correctAnswerIndex" : 3
		},
		{
			"_questionText" : "Which animal is the tallest in the world?",
			"_answers" : [
				"Elephant",
				"Giraffe",
				"Ostrich ",
				"Bear"
			],
			"_correctAnswerIndex" : 1
		}
	]
}