%YAML 1.1
%TAG !u! tag:unity3d.com,2011:
--- !u!114 &11400000
MonoBehaviour:
  m_ObjectHideFlags: 0
  m_CorrespondingSourceObject: {fileID: 0}
  m_PrefabInstance: {fileID: 0}
  m_PrefabAsset: {fileID: 0}
  m_GameObject: {fileID: 0}
  m_Enabled: 1
  m_EditorHideFlags: 0
  m_Script: {fileID: 11500000, guid: bbb281ee3bf0b054c82ac2347e9e782c, type: 3}
  m_Name: Hrv Group
  m_EditorClassIdentifier: 
  m_GroupName: Hrv Group
  m_Data:
    m_SerializedData: []
  m_GUID: 74d82975658d61e4ab310753dcc09fec
  m_SerializeEntries:
  - m_GUID: c2a19d5ecb164224ea5b1cd308962cf6
    m_Address: Assets/Text/GreenIguanaShortInfo(Hrv).json
    m_ReadOnly: 0
    m_SerializedLabels:
    - Hrv
  - m_GUID: 9f2defc0f84b9624dbd9a0c70b087499
    m_Address: Assets/Text/Questions(Hrv).json
    m_ReadOnly: 0
    m_SerializedLabels:
    - Hrv
  - m_GUID: 0042bae2574a01745855b0bcc08ed5ed
    m_Address: Assets/Text/GreenIguanaDescription(Hrv).txt
    m_ReadOnly: 0
    m_SerializedLabels:
    - Hrv
  - m_GUID: baafabac7a0ebb34a911dda6946febe0
    m_Address: Assets/Text/WhaleDescription(Hrv).txt
    m_ReadOnly: 0
    m_SerializedLabels:
    - Hrv
  - m_GUID: 79384f16fbfde584d8891cef47b0a596
    m_Address: Assets/Text/WhaleShortInfo(Hrv).json
    m_ReadOnly: 0
    m_SerializedLabels:
    - Hrv
  m_ReadOnly: 0
  m_Settings: {fileID: 11400000, guid: 78b3b5937c75cae4d901ec6b18e9d26b, type: 2}
  m_SchemaSet:
    m_Schemas:
    - {fileID: 11400000, guid: 852c463c864593c4eb5d786460ab0699, type: 2}
    - {fileID: 11400000, guid: 50d704097b5483644b787f42f4115fa9, type: 2}
