[gd_scene load_steps=15 format=2]

[ext_resource path="res://Scenes/Player.tscn" type="PackedScene" id=1]
[ext_resource path="res://Scenes/Soldier.tscn" type="PackedScene" id=2]
[ext_resource path="res://Scenes/Battlefield.tscn" type="PackedScene" id=3]
[ext_resource path="res://Scenes/Bullet.tscn" type="PackedScene" id=4]
[ext_resource path="res://Scripts/Game.gd" type="Script" id=5]
[ext_resource path="res://Scenes/UI.tscn" type="PackedScene" id=6]
[ext_resource path="res://Scenes/SickBay.tscn" type="PackedScene" id=7]
[ext_resource path="res://Scenes/GameCam.tscn" type="PackedScene" id=8]
[ext_resource path="res://Resources/SoldierNames.tres" type="Resource" id=9]
[ext_resource path="res://Resources/Waves.tres" type="Resource" id=10]
[ext_resource path="res://Scenes/Gurney.tscn" type="PackedScene" id=11]

[sub_resource type="NavigationPolygon" id=1]
vertices = PoolVector2Array( 256, 184, 144, 184, 80, 160, 120, 160, 256, 208, 256, 384, 232, 296, 232, 280, 254.357, 52.9477, 240, 136, 240, 128, 232, 240, 232, 368, 0, 384, 208, 368, 56, 368, 208, 352, 32, 368, 224, 160, 224, 152, 232, 224, 144, 208, 208, 224, 224, 136, 0, 208, 32, 352, 0.97995, 51.5854, 224, 128, 176, 120, 48, 128, 48, 120, 160, 120, 88, 128, 176, 128, 32, 120, 0, 184, 32, 128, 104, 136, 160, 128, 208, 152, 104, 128, 208, 160, 136, 160, 136, 152, 120, 152, 88, 136, 208, 240, 56, 240, 56, 224, 112, 208, 208, 280, 56, 280, 208, 296, 56, 296, 32, 240, 32, 280, 56, 352, 232, 352, 64, 160, 64, 152, 32, 296, 32, 224, 112, 184, 80, 152 )
polygons = [ PoolIntArray( 0, 1, 2, 3 ), PoolIntArray( 4, 5, 6, 7 ), PoolIntArray( 8, 0, 9, 10 ), PoolIntArray( 11, 4, 7 ), PoolIntArray( 12, 5, 13, 14 ), PoolIntArray( 14, 13, 15, 16 ), PoolIntArray( 17, 15, 13 ), PoolIntArray( 9, 0, 18, 19 ), PoolIntArray( 4, 11, 20 ), PoolIntArray( 21, 4, 20, 22 ), PoolIntArray( 23, 9, 19 ), PoolIntArray( 17, 13, 24, 25 ), PoolIntArray( 26, 8, 10, 27, 28 ), PoolIntArray( 29, 30, 31, 32 ), PoolIntArray( 33, 28, 27, 23 ), PoolIntArray( 26, 28, 31 ), PoolIntArray( 26, 31, 30 ), PoolIntArray( 26, 30, 34 ), PoolIntArray( 35, 26, 34, 36 ), PoolIntArray( 37, 38, 33, 23, 19, 39 ), PoolIntArray( 38, 37, 40, 31 ), PoolIntArray( 39, 41, 42, 43 ), PoolIntArray( 37, 39, 43 ), PoolIntArray( 37, 43, 44, 45 ), PoolIntArray( 21, 22, 46, 47, 48, 49 ), PoolIntArray( 46, 11, 7, 50 ), PoolIntArray( 47, 46, 50, 51 ), PoolIntArray( 50, 52, 53, 51 ), PoolIntArray( 54, 47, 51, 55 ), PoolIntArray( 16, 15, 56 ), PoolIntArray( 52, 6, 5, 57 ), PoolIntArray( 58, 35, 36, 29, 59 ), PoolIntArray( 5, 12, 57 ), PoolIntArray( 52, 57, 16, 53 ), PoolIntArray( 53, 16, 56, 60 ), PoolIntArray( 60, 56, 25 ), PoolIntArray( 60, 25, 24 ), PoolIntArray( 55, 60, 24 ), PoolIntArray( 54, 55, 24 ), PoolIntArray( 61, 54, 24 ), PoolIntArray( 61, 24, 49, 48 ), PoolIntArray( 1, 21, 49, 62 ), PoolIntArray( 2, 1, 62 ), PoolIntArray( 2, 62, 35, 58 ), PoolIntArray( 45, 44, 3, 2, 63 ), PoolIntArray( 41, 18, 0 ), PoolIntArray( 42, 41, 0 ), PoolIntArray( 3, 42, 0 ), PoolIntArray( 32, 45, 63, 59, 29 ), PoolIntArray( 31, 40, 32 ), PoolIntArray( 59, 29, 59 ) ]
outlines = [ PoolVector2Array( 0.97995, 51.5854, 254.357, 52.9477, 256, 184, 144, 184, 144, 208, 256, 208, 256, 384, 0, 384, 0, 208, 112, 208, 112, 184, 0, 184 ), PoolVector2Array( 32, 120, 48, 120, 48, 128, 32, 128 ), PoolVector2Array( 64, 152, 80, 152, 80, 160, 64, 160, 64, 152 ), PoolVector2Array( 88, 128, 104, 128, 104, 136, 88, 136 ), PoolVector2Array( 120, 152, 136, 152, 136, 160, 120, 160 ), PoolVector2Array( 160, 120, 176, 120, 176, 128, 160, 128 ), PoolVector2Array( 224, 128, 240, 128, 240, 136, 224, 136 ), PoolVector2Array( 208, 152, 224, 152, 224, 160, 208, 160 ), PoolVector2Array( 32, 352, 56, 352, 56, 368, 32, 368 ), PoolVector2Array( 208, 224, 232, 224, 232, 240, 208, 240 ), PoolVector2Array( 208, 280, 232, 280, 232, 296, 208, 296 ), PoolVector2Array( 208, 352, 232, 352, 232, 368, 208, 368 ), PoolVector2Array( 32, 224, 56, 224, 56, 240, 32, 240 ), PoolVector2Array( 32, 280, 56, 280, 56, 296, 32, 296 ) ]

[sub_resource type="Curve2D" id=2]
_data = {
"points": PoolVector2Array( -16.3126, 0.515134, 16.3126, -0.515134, -56, 124.8, -0.214639, -11.0754, 0.214639, 11.0754, -40, 144, 7.08309, 0, -7.08309, 0, -56, 163.2, 0, 12.8783, 0, -12.8783, -72, 144, -12.4491, 0.257567, 12.4491, -0.257567, -56, 124.8 )
}

[sub_resource type="Curve2D" id=3]
_data = {
"points": PoolVector2Array( -16.3126, 0.515134, 16.3126, -0.515134, -56, 124.8, -0.214639, -11.0754, 0.214639, 11.0754, -40, 144, 7.08309, 0, -7.08309, 0, -56, 163.2, 0, 12.8783, 0, -12.8783, -72, 144, -12.4491, 0.257567, 12.4491, -0.257567, -56, 124.8 )
}

[node name="Game" type="YSort"]
script = ExtResource( 5 )
Bullet = ExtResource( 4 )
Soldier = ExtResource( 2 )
SoldierNames = ExtResource( 9 )
Waves = ExtResource( 10 )

[node name="SickBay" parent="." instance=ExtResource( 7 )]
position = Vector2( 0, 192 )

[node name="Battlefield" parent="." instance=ExtResource( 3 )]
Bullet = ExtResource( 4 )

[node name="Player" parent="." instance=ExtResource( 1 )]
position = Vector2( 154, 157 )

[node name="Gurney" parent="." instance=ExtResource( 11 )]

[node name="Soldiers" type="YSort" parent="."]

[node name="Bullets" type="YSort" parent="."]

[node name="UI" parent="." instance=ExtResource( 6 )]

[node name="GameCam" parent="." instance=ExtResource( 8 )]
sort_enabled = true

[node name="Navigation2D" type="Navigation2D" parent="."]
__meta__ = {
"_edit_lock_": true
}

[node name="NavigationPolygonInstance" type="NavigationPolygonInstance" parent="Navigation2D"]
navpoly = SubResource( 1 )
__meta__ = {
"_edit_lock_": true
}

[node name="RandomSoldierPositionLeft" type="Path2D" parent="."]
position = Vector2( -8, 0 )
curve = SubResource( 2 )

[node name="Position" type="PathFollow2D" parent="RandomSoldierPositionLeft"]
position = Vector2( -56, 124.8 )
rotation = 0.0176605

[node name="RandomSoldierPositionRight" type="Path2D" parent="."]
position = Vector2( 384, 0 )
curve = SubResource( 3 )

[node name="Position" type="PathFollow2D" parent="RandomSoldierPositionRight"]
position = Vector2( -56, 124.8 )
rotation = 0.0176605

[node name="SniperLine" type="Line2D" parent="."]
visible = false
width = 1.0
default_color = Color( 1, 0.4, 0.4, 1 )
[connection signal="spawn_bullet" from="Battlefield" to="." method="_on_Battlefield_spawn_bullet"]
[connection signal="spawn_sniper_bullet" from="Battlefield" to="." method="_on_Battlefield_spawn_sniper_bullet"]
[connection signal="killed" from="Player" to="." method="_on_Player_killed"]
[connection signal="morphium_changed" from="Player" to="." method="_on_Player_morphium_changed"]
[connection signal="bought" from="UI" to="." method="_on_UI_bought"]
[connection signal="next_wave_pressed" from="UI" to="." method="_on_UI_next_wave_pressed"]
[connection signal="restart_game" from="UI" to="." method="_on_UI_restart_game"]
[connection signal="start_game" from="UI" to="." method="_on_UI_start_game"]
[connection signal="transition_ended" from="GameCam" to="Player" method="_on_GameCam_transition_ended"]
[connection signal="transition_started" from="GameCam" to="Player" method="_on_GameCam_transition_started"]

[editable path="GameCam"]
