[gd_resource type="Resource" load_steps=2 format=2]

[ext_resource path="res://Scripts/SoldierNames.gd" type="Script" id=1]

[resource]
script = ExtResource( 1 )
names = [ "Johnny", "Charly", "James Ryan", "James Ryan", "James Ryan", "James Ryan", "James Ryan", "James Ryan", "James Ryan", "James Ryan" ]
