[gd_scene load_steps=7 format=2]

[ext_resource path="res://Environments/SandSacksMiddle3.png" type="Texture" id=1]
[ext_resource path="res://Environments/SandSacksOuter1.png" type="Texture" id=2]
[ext_resource path="res://Environments/SandSacksMiddle1.png" type="Texture" id=3]
[ext_resource path="res://Environments/SandSacksOuter2.png" type="Texture" id=4]
[ext_resource path="res://Environments/SandSacksMiddle2.png" type="Texture" id=5]

[sub_resource type="RectangleShape2D" id=1]
extents = Vector2( 56, 4 )

[node name="Sandbag" type="StaticBody2D"]
__meta__ = {
"_edit_group_": true
}

[node name="CollisionShape2D" type="CollisionShape2D" parent="."]
position = Vector2( 56, 4 )
shape = SubResource( 1 )

[node name="SandSacksOuter1" type="Sprite" parent="."]
position = Vector2( 8, 0 )
texture = ExtResource( 2 )

[node name="SandSacksMiddle2" type="Sprite" parent="."]
position = Vector2( 40, 0 )
texture = ExtResource( 5 )

[node name="SandSacksMiddle3" type="Sprite" parent="."]
position = Vector2( 72, 0 )
texture = ExtResource( 1 )

[node name="SandSacksMiddle4" type="Sprite" parent="."]
position = Vector2( 56, 0 )
texture = ExtResource( 3 )

[node name="SandSacksMiddle6" type="Sprite" parent="."]
position = Vector2( 24, 0 )
texture = ExtResource( 1 )

[node name="SandSacksOuter2" type="Sprite" parent="."]
position = Vector2( 104, 0 )
texture = ExtResource( 4 )

[node name="SandSacksMiddle1" type="Sprite" parent="."]
position = Vector2( 88, 0 )
texture = ExtResource( 3 )
