[gd_resource type="Resource" load_steps=2 format=2]

[ext_resource path="res://Scripts/Waves.gd" type="Script" id=1]

[resource]
script = ExtResource( 1 )
waves = [ {
"bullet_speed": 2.0,
"promotion": false,
"sniper_speed": 5.0,
"soldiers": 2
}, {
"bullet_speed": 1.5,
"promotion": false,
"sniper_speed": 4.5,
"soldiers": 4
}, {
"bullet_speed": 1.0,
"promotion": false,
"sniper_speed": 4.0,
"soldiers": 6
}, {
"bullet_speed": 0.8,
"promotion": true,
"sniper_speed": 3.5,
"soldiers": 8
}, {
"bullet_speed": 0.7,
"promotion": false,
"sniper_speed": 3.0,
"soldiers": 10
}, {
"bullet_speed": 0.6,
"promotion": false,
"sniper_speed": 2.8,
"soldiers": 10
}, {
"bullet_speed": 0.5,
"promotion": true,
"sniper_speed": 2.6,
"soldiers": 10
}, {
"bullet_speed": 0.4,
"promotion": false,
"sniper_speed": 2.4,
"soldiers": 10
}, {
"bullet_speed": 0.3,
"promotion": false,
"sniper_speed": 2.2,
"soldiers": 10
}, {
"bullet_speed": 0.3,
"promotion": true,
"sniper_speed": 2.0,
"soldiers": 10
}, {
"bullet_speed": 0.3,
"promotion": false,
"sniper_speed": 2,
"soldiers": 10
} ]
