[gd_scene load_steps=5 format=2]

[ext_resource path="res://Scripts/Obstacle.gd" type="Script" id=1]
[ext_resource path="res://Environments/SandSacksOuter1.png" type="Texture" id=2]
[ext_resource path="res://Environments/SandSacksOuter2.png" type="Texture" id=4]

[sub_resource type="RectangleShape2D" id=1]
extents = Vector2( 15.1123, 4 )

[node name="SandbagSmall" type="StaticBody2D"]
script = ExtResource( 1 )
__meta__ = {
"_edit_group_": true
}

[node name="CollisionShape2D" type="CollisionShape2D" parent="."]
position = Vector2( 16, 4 )
shape = SubResource( 1 )

[node name="Sprite" type="Sprite" parent="."]

[node name="SandSacksOuter1" type="Sprite" parent="Sprite"]
position = Vector2( 8, 0 )
texture = ExtResource( 2 )

[node name="SandSacksOuter2" type="Sprite" parent="Sprite"]
position = Vector2( 24, 0 )
texture = ExtResource( 4 )
