96	1.2	0
-3.141593	1.756530	-2.105156
0.000000	0.000000	0.000000
A6NFU0.A.r_m.pdb	9.082	-14.981	-1.490
1WHZ.P.l_m.pdb	13.678	3.043	27.830
1.832596	1.335669	0.897240	1	14	14	1077.871
2.094395	1.335669	0.897240	0	14	14	999.947
1.832596	1.504028	0.636812	3	16	12	935.072
1.570796	1.184361	0.625864	4	16	12	868.574
1.308997	2.073035	2.027405	16	1	92	868.191
-1.832596	2.664082	-1.071402	2	16	11	855.990
2.094395	1.504028	0.636812	2	16	12	851.565
-1.832596	2.592629	0.909713	80	90	90	847.336
-1.047198	1.134796	2.434290	79	93	89	841.043
-2.617994	1.194549	-0.801900	18	88	7	839.880
1.308997	1.045978	0.343692	7	18	8	839.006
-1.047198	0.906588	1.252948	91	11	80	835.528
1.570796	1.504028	0.636812	4	16	12	834.180
1.308997	1.194549	-0.801900	3	17	11	830.496
1.047198	2.587733	0.232235	79	2	95	830.306
1.308997	1.184361	0.625864	6	15	12	827.422
1.308997	2.478122	2.609777	5	15	12	825.959
1.308997	0.866955	-0.931351	15	6	91	825.903
-0.261799	2.164094	-2.991358	9	91	18	821.244
0.785398	0.297065	2.160177	13	8	88	820.563
1.832596	1.662363	0.915448	4	14	14	819.775
-1.047198	1.113094	-0.272241	76	5	91	819.222
1.570796	0.685216	-1.712745	7	19	6	816.785
-2.356194	1.195355	1.200319	9	13	83	814.105
-1.570796	1.599406	1.426070	3	12	79	809.138
-2.094395	2.033014	2.977192	0	7	78	807.912
-1.047198	0.618092	2.539118	78	94	94	805.194
-1.047198	1.301460	-0.509251	78	2	89	805.096
-1.308997	0.906588	1.252948	92	12	81	804.684
-1.308997	1.325504	-1.671296	5	16	11	799.992
-1.047198	0.866395	-2.492918	8	14	15	799.570
0.785398	2.588535	-2.976617	5	93	20	798.824
-1.047198	0.914445	2.687814	79	94	91	791.954
-1.308997	1.721184	-0.153948	4	5	78	790.980
-1.832596	2.455966	-0.641220	6	15	10	789.763
1.308997	2.033014	2.977192	1	12	79	788.210
0.000000	2.704512	1.488683	17	8	9	787.671
-2.094395	2.579248	-2.364801	95	12	16	786.775
-2.094395	2.115563	0.685730	12	13	87	785.778
1.047198	0.831641	0.616218	7	15	11	785.292
2.094395	0.961715	0.014085	6	0	20	782.392
-1.570796	0.961715	0.014085	77	7	91	782.122
1.308997	0.640596	-2.797608	78	2	3	781.266
0.000000	1.510910	-0.740472	90	9	18	780.738
0.785398	1.168678	2.108595	10	7	83	780.374
-0.523599	1.310100	1.488307	77	1	1	780.049
-2.356194	2.579248	-2.364801	0	12	16	779.275
0.000000	1.325504	-1.671296	0	9	19	778.071
-2.094395	1.195355	1.200319	7	15	83	776.714
-2.094395	1.662363	0.915448	9	15	85	776.094
-1.047198	1.756530	-2.105156	92	15	13	774.351
0.523599	1.658653	-2.409879	14	91	86	773.941
-2.356194	2.138223	1.678323	12	15	3	772.249
2.617994	0.866955	-0.931351	17	10	3	772.240
-2.617994	2.719179	-1.780644	6	21	6	771.775
-1.308997	1.545873	-1.877082	79	6	5	771.415
0.523599	0.864993	2.278281	12	6	85	771.206
-0.785398	0.370812	-2.547742	17	88	92	771.112
-1.308997	2.108018	1.311430	16	88	91	769.055
1.308997	0.290380	-0.796960	89	12	14	768.949
0.785398	2.299159	2.264663	9	14	11	767.495
-1.570796	1.617114	-1.572037	6	16	9	766.223
-1.570796	1.909857	-0.381669	6	7	78	761.033
-0.785398	0.914445	2.687814	79	91	90	758.852
-1.832596	2.115563	0.685730	10	14	87	757.026
1.832596	1.184361	0.625864	0	16	12	755.830
1.570796	2.251330	-2.330739	16	90	92	755.730
0.785398	2.404280	-0.174044	79	2	0	753.578
1.832596	0.866395	-2.492918	80	3	2	753.491
1.832596	0.370812	-2.547742	12	15	6	752.187
-0.523599	1.413347	-1.339188	77	95	92	750.246
-1.308997	0.914445	2.687814	78	95	92	749.413
1.308997	2.174483	2.653697	1	15	12	748.900
-2.094395	2.393226	1.857173	12	16	2	748.564
2.879793	1.135834	-1.431087	15	13	4	748.542
0.785398	0.203748	0.590255	6	90	18	748.364
2.094395	1.195355	1.200319	1	12	16	747.468
1.832596	2.115563	0.685730	3	8	79	747.260
1.832596	1.510910	-0.740472	6	8	79	746.777
-1.308997	2.724429	-0.348782	15	12	5	746.091
0.785398	2.104282	-0.813972	78	0	90	745.719
0.523599	2.704512	1.488683	16	12	8	745.708
1.308997	2.984978	1.954446	7	16	11	744.990
-0.785398	1.310100	1.488307	78	3	1	744.952
-1.308997	1.128190	-2.288622	6	15	15	744.589
-0.785398	0.960688	-0.577532	76	4	95	744.152
1.308997	1.134497	-1.109631	5	19	9	743.143
1.308997	2.356369	3.005869	0	16	11	742.781
0.785398	2.637879	2.121598	8	14	11	742.669
-0.261799	2.637879	2.121598	93	12	80	742.376
1.570796	1.045978	0.343692	5	17	10	741.703
2.094395	0.929350	-2.910676	79	3	2	741.181
2.879793	2.881233	-2.582574	7	21	5	740.418
1.047198	0.910508	1.903534	10	7	83	739.611
-0.785398	1.413347	-1.339188	77	2	92	738.797
-1.570796	0.866395	-2.492918	11	13	15	738.347
1.047198	0.866955	-0.931351	3	18	11	738.146
-2.356194	1.184361	0.625864	3	16	12	738.069
1.047198	1.741644	-2.695914	8	15	84	738.057
-2.094395	1.325504	-1.671296	11	16	11	738.005
1.047198	0.618092	2.539118	8	10	19	737.022
2.094395	1.909857	-0.381669	14	13	6	736.858
2.356194	0.618092	2.539118	78	1	5	736.794
2.094395	2.588535	-2.976617	14	17	8	736.713
1.047198	2.455966	-0.641220	78	95	91	735.685
1.570796	1.335669	0.897240	3	14	14	735.539
-1.308997	0.866395	-2.492918	9	14	15	734.639
2.356194	0.496451	0.593859	9	20	3	734.477
-1.047198	1.617114	-1.572037	77	5	4	734.443
-2.356194	2.719179	-1.780644	0	16	13	733.971
-3.141593	0.700570	1.559208	1	11	80	733.618
-1.308997	1.113094	-0.272241	77	8	89	733.462
0.523599	2.343981	-1.040456	78	0	94	732.540
-0.785398	0.866395	-2.492918	7	14	16	731.342
1.570796	1.836682	-0.676006	2	8	78	731.177
2.879793	1.391910	3.030322	78	95	90	730.969
-2.879793	0.831641	0.616218	1	18	9	730.896
1.308997	0.831641	0.616218	5	17	11	730.461
-1.570796	2.979456	-1.009304	5	16	11	729.790
1.832596	2.704512	1.488683	93	12	80	729.774
-0.261799	1.510910	-0.740472	91	10	18	729.709
0.523599	2.153910	-1.714959	75	2	90	729.328
0.523599	0.615174	-0.666022	4	19	9	729.242
1.570796	2.637879	2.121598	6	13	83	728.384
-0.785398	1.168678	2.108595	79	92	89	728.369
-1.570796	2.664082	-1.071402	12	16	6	728.196
-1.047198	1.824694	1.850876	16	91	90	727.399
0.785398	1.948085	-2.363031	13	93	84	726.947
-1.570796	1.413347	-1.339188	7	17	8	726.199
-2.356194	0.290380	-0.796960	7	15	15	725.164
-1.047198	2.588535	-2.976617	2	7	20	725.097
1.570796	1.699788	2.452890	17	92	95	724.755
0.000000	0.709924	0.218797	94	11	18	724.244
1.570796	0.203748	0.590255	9	2	18	723.532
1.832596	0.619654	-2.216909	8	19	5	723.516
-1.570796	1.606104	-0.451151	3	7	77	723.388
0.261799	2.356369	3.005869	2	11	79	722.938
0.523599	2.108018	1.311430	81	7	8	722.696
1.047198	1.113094	-0.272241	79	91	2	722.299
2.094395	1.134497	-1.109631	92	16	13	721.564
2.356194	1.134497	-1.109631	91	16	12	721.464
0.523599	0.906588	1.252948	78	1	4	721.434
-2.094395	2.404280	-0.174044	80	7	9	721.350
-2.356194	1.555207	1.708892	78	1	5	721.288
-1.832596	1.325504	-1.671296	10	16	11	720.493
-2.879793	1.194549	-0.801900	14	95	86	720.430
-1.570796	1.325504	-1.671296	7	17	11	719.874
-1.832596	1.555207	1.708892	78	95	95	719.835
1.047198	1.374601	-2.456031	17	93	91	719.780
-2.879793	0.571433	-1.188419	16	94	89	719.567
0.785398	0.910508	1.903534	11	6	83	719.269
0.523599	1.948085	-2.363031	14	90	85	719.095
-0.785398	0.899350	-2.069907	12	12	10	718.563
-1.832596	1.310100	1.488307	78	95	95	718.409
-1.832596	1.756530	-2.105156	8	20	5	717.855
-0.785398	1.301460	-0.509251	78	95	89	717.659
0.523599	1.168678	2.108595	11	6	83	716.976
0.000000	1.135834	-1.431087	94	11	18	716.582
-2.879793	1.134497	-1.109631	16	95	88	716.571
1.047198	0.571433	-1.188419	3	20	8	716.426
0.523599	2.187132	-0.479875	79	3	1	715.886
-1.047198	1.194549	-0.801900	77	4	91	715.776
2.879793	1.606104	-0.451151	13	8	82	715.263
0.785398	1.658653	-2.409879	14	92	86	715.015
2.356194	1.488617	1.159546	2	11	16	714.505
2.356194	2.588535	-2.976617	10	19	8	713.061
-2.356194	1.335669	0.897240	11	13	85	712.922
-0.785398	1.599406	1.426070	77	1	94	712.439
1.047198	1.194549	-0.801900	5	17	11	712.168
1.570796	2.174483	2.653697	2	16	13	711.945
-0.785398	1.134796	2.434290	80	92	89	711.076
1.047198	2.174483	2.653697	3	15	11	710.837
-1.047198	0.992645	-1.723759	85	12	14	710.559
1.308997	0.709924	0.218797	7	17	8	710.473
1.308997	1.569311	-3.003978	14	91	87	709.776
-1.308997	0.961715	0.014085	77	5	90	709.404
-1.308997	1.195355	1.200319	95	13	81	709.161
-1.570796	2.760637	2.781135	13	7	85	708.695
-2.094395	2.664082	-1.071402	12	18	2	708.693
1.832596	1.812176	0.656819	5	16	13	708.584
-1.570796	1.050534	3.042579	78	95	91	708.578
2.879793	0.709924	0.218797	6	2	20	707.994
0.000000	2.041297	-2.664597	8	93	20	707.843
-1.832596	2.579248	-2.364801	94	14	16	707.838
-0.785398	1.325504	-1.671296	77	3	94	707.763
-2.094395	1.809167	1.213774	8	15	83	707.569
-1.570796	1.846342	-1.796954	2	16	11	707.461
-1.832596	1.599406	1.426070	4	13	80	707.152
-2.356194	2.356369	3.005869	93	14	17	706.793
-1.047198	0.762244	-0.273349	76	5	93	706.763
-1.832596	1.732874	-0.951685	11	15	6	706.685
-1.047198	1.433411	-1.035986	77	7	1	706.379
2.879793	0.992645	-1.723759	14	13	5	706.319
1.047198	1.184361	0.625864	7	15	12	706.102
-2.356194	0.370812	-2.547742	11	4	19	706.024
-2.356194	1.982574	-1.115518	79	3	6	705.525
1.832596	2.760637	2.781135	14	13	90	705.075
-2.356194	1.812176	0.656819	12	13	87	705.049
0.261799	1.870545	-2.976234	9	4	18	704.876
0.261799	2.174483	2.653697	11	16	3	704.638
-2.617994	0.992645	-1.723759	6	12	18	704.515
-2.094395	1.977582	0.969896	10	12	83	704.441
0.261799	1.606104	-0.451151	16	86	91	704.372
1.047198	2.187132	-0.479875	79	95	89	704.253
-3.141593	0.571433	-1.188419	16	92	89	704.202
1.832596	1.617114	-1.572037	1	12	20	704.059
-1.570796	2.295480	1.008277	18	94	4	703.473
-1.832596	2.104282	-0.813972	9	9	80	703.433
-0.523599	1.134796	2.434290	79	92	90	703.429
1.308997	2.164094	-2.991358	94	15	11	703.293
-2.879793	2.592629	0.909713	6	19	6	703.199
0.261799	2.760637	2.781135	1	13	80	703.173
-1.832596	2.174483	2.653697	78	90	2	703.135
1.047198	1.977582	0.969896	12	90	84	702.872
1.570796	2.393226	1.857173	9	11	85	702.433
-2.094395	2.881233	-2.582574	93	14	14	702.375
1.570796	1.617114	-1.572037	2	11	20	701.711
1.047198	0.615174	-0.666022	17	5	93	701.481
-1.570796	1.214854	-1.966664	8	15	13	700.858
-2.356194	2.001437	0.381215	3	8	77	700.830
2.617994	0.762244	-0.273349	15	14	3	700.373
0.000000	1.732874	-0.951685	92	7	19	700.253
-2.094395	1.812176	0.656819	11	15	87	700.079
-0.785398	2.704512	1.488683	18	3	3	699.865
-0.261799	1.433411	-1.035986	95	10	19	699.784
2.094395	1.488617	1.159546	3	12	16	699.439
2.094395	1.732874	-0.951685	19	81	0	699.402
-1.570796	1.128190	-2.288622	9	14	15	699.387
1.570796	1.450119	-2.739050	6	5	23	699.298
2.879793	1.374601	-2.456031	4	16	12	697.742
1.570796	1.909857	-0.381669	12	83	86	697.176
-0.523599	2.881233	-2.582574	75	5	0	696.809
-1.570796	1.766067	2.153843	80	89	92	696.534
-2.094395	1.824694	1.850876	6	11	79	695.887
2.617994	1.247695	1.809890	2	10	78	695.844
-2.617994	0.615174	-0.666022	14	92	89	695.700
2.094395	1.014500	0.906702	14	15	94	695.663
-1.308997	1.134796	2.434290	78	95	90	695.450
-1.832596	2.587733	0.232235	11	17	6	695.139
2.356194	0.961715	0.014085	7	2	20	695.037
0.785398	2.587733	0.232235	15	11	95	694.854
2.617994	0.961715	0.014085	7	3	20	694.153
-2.617994	2.664082	-1.071402	78	94	95	693.927
1.308997	0.203748	0.590255	8	94	18	693.534
-1.570796	1.977582	0.969896	15	89	90	693.302
-2.617994	0.379747	-1.713059	17	94	91	692.852
0.523599	2.588535	-2.976617	4	94	20	692.691
-2.879793	0.762244	-0.273349	7	17	10	692.689
2.617994	2.881233	-2.582574	13	18	5	692.559
2.356194	2.180315	-1.357379	9	7	20	692.390
-2.879793	1.045978	0.343692	14	84	89	692.205
0.261799	2.704512	1.488683	16	10	9	692.138
2.617994	1.488617	1.159546	1	11	17	691.986
-2.617994	2.247462	0.191623	92	13	16	691.945
1.570796	2.033014	2.977192	95	11	78	691.765
-2.617994	0.618092	2.539118	14	8	14	691.679
-1.308997	0.458961	-0.107937	9	7	19	691.486
2.356194	2.089241	-0.114193	13	15	6	691.441
-1.047198	1.545873	-1.877082	77	6	94	691.405
2.879793	2.719179	-1.780644	78	95	93	691.314
-1.570796	1.555207	1.708892	79	92	93	691.246
-0.261799	1.699788	2.452890	17	4	4	691.079
-2.356194	1.504028	0.636812	14	11	87	691.077
-2.617994	2.407836	1.410646	14	14	4	690.597
-2.356194	2.979456	-1.009304	0	10	18	690.596
-0.785398	0.290380	-0.796960	12	5	18	690.582
-2.617994	1.218453	2.777284	12	10	14	690.512
2.617994	2.349581	-2.702517	9	19	11	690.017
0.261799	2.187132	-0.479875	14	12	89	689.862
-0.523599	0.370812	-2.547742	7	13	19	689.718
-2.879793	0.864993	2.278281	13	6	16	689.405
0.785398	0.961715	0.014085	78	90	95	689.247
-0.523599	2.063651	-2.044600	7	4	19	689.209
1.308997	0.618092	2.539118	6	10	19	688.544
0.261799	2.724429	-0.348782	15	10	91	688.448
0.785398	0.960688	-0.577532	4	10	20	688.398
0.785398	0.571433	-1.188419	11	16	8	688.276
-1.570796	0.914445	2.687814	78	0	94	688.215
1.047198	1.134497	-1.109631	7	18	8	688.051
0.261799	0.906588	1.252948	78	3	4	687.836
2.879793	0.700570	1.559208	0	18	10	687.668
1.570796	0.899350	-2.069907	80	4	5	687.650
2.617994	1.574060	2.783565	78	4	91	687.391
1.047198	2.478122	2.609777	8	13	13	687.374
0.523599	2.251330	-2.330739	9	94	19	686.949
0.261799	0.618092	2.539118	11	8	86	686.873
-2.094395	2.138223	1.678323	10	17	4	686.792
0.261799	0.709924	0.218797	92	10	18	686.586
-2.356194	2.455966	-0.641220	11	13	10	686.582
-2.617994	1.433411	-1.035986	16	92	87	686.573
-1.570796	0.419640	2.974122	11	92	19	686.290
-3.141593	2.579248	-2.364801	6	20	9	686.242
-0.785398	1.374601	-2.456031	4	12	17	686.198
-1.308997	0.571433	-1.188419	87	15	12	685.426
-1.308997	0.762244	-0.273349	10	3	20	685.313
0.523599	2.637879	2.121598	14	8	12	685.132
-1.047198	1.134497	-1.109631	7	16	11	685.073
0.000000	1.413347	-1.339188	94	9	19	684.779
-1.308997	0.733948	3.021411	78	94	91	684.779
-3.141593	2.393226	1.857173	78	7	5	684.587
-0.785398	0.992645	-1.723759	10	13	11	684.281
0.000000	2.881233	-2.582574	12	5	16	684.239
-1.570796	1.699788	2.452890	80	90	94	683.811
-2.879793	2.164094	-2.991358	77	92	89	683.687
-1.047198	1.662363	0.915448	7	6	82	683.442
-2.094395	2.478122	2.609777	13	4	84	683.427
-0.523599	0.866395	-2.492918	13	11	10	683.387
-0.261799	2.704512	1.488683	17	6	9	683.270
-1.047198	1.128190	-2.288622	6	15	15	683.209
-3.141593	0.960688	-0.577532	11	16	9	683.055
-1.308997	0.379747	-1.713059	5	14	18	682.768
-1.570796	2.108018	1.311430	12	14	87	682.671
-2.094395	1.504028	0.636812	12	13	86	682.500
1.047198	2.138223	1.678323	79	3	4	682.438
-2.617994	1.413347	-1.339188	17	94	89	682.419
1.570796	1.135813	-2.658866	3	4	23	682.190
-2.617994	1.417623	-0.202254	17	90	93	681.930
0.261799	1.433411	-1.035986	94	11	19	681.734
-2.617994	1.904882	-1.478089	78	2	7	681.724
1.047198	1.836682	-0.676006	79	93	87	681.715
0.523599	2.478122	2.609777	8	19	4	681.705
-0.785398	1.732874	-0.951685	90	9	17	681.635
-1.047198	0.674054	1.013609	90	12	82	681.610
1.308997	2.295480	1.008277	79	0	1	681.565
-0.785398	1.135813	-2.658866	6	12	17	681.528
1.047198	2.073035	2.027405	79	5	2	681.388
0.000000	2.478122	2.609777	8	0	20	681.353
-0.523599	2.637879	2.121598	94	12	80	681.146
1.832596	2.587733	0.232235	77	1	95	681.007
-2.879793	0.379747	-1.713059	78	93	1	680.975
-0.785398	2.863997	0.549740	16	10	7	680.454
-0.261799	1.135834	-1.431087	1	11	19	679.776
1.047198	2.063651	-2.044600	16	92	91	679.469
-1.570796	2.455966	-0.641220	4	16	10	679.461
-1.570796	1.870545	-2.976234	78	5	1	679.394
-2.879793	0.674054	1.013609	4	12	80	679.148
-3.141593	1.417623	-0.202254	9	11	82	679.065
1.570796	1.741644	-2.695914	10	4	22	678.981
2.356194	1.870545	-2.976234	7	17	14	678.826
-1.832596	1.662363	0.915448	6	15	84	678.824
-1.308997	1.256302	0.062705	77	4	88	678.760
-2.094395	1.599406	1.426070	7	13	81	678.631
-0.261799	0.709924	0.218797	95	12	18	678.529
-0.785398	0.618092	2.539118	78	94	94	678.477
1.570796	2.588535	-2.976617	3	19	8	678.461
-1.570796	1.310100	1.488307	0	11	79	678.304
-2.879793	0.866955	-0.931351	16	91	90	678.286
2.879793	1.545873	-1.877082	14	9	86	677.988
-2.617994	2.979456	-1.009304	1	9	18	677.748
-0.785398	0.864993	2.278281	78	94	92	677.688
-2.356194	1.699788	2.452890	2	4	76	677.652
-2.356194	1.599406	1.426070	9	13	81	677.650
-2.617994	1.374601	-2.456031	0	12	18	677.546
-1.308997	1.617114	-1.572037	4	16	10	677.402
-3.141593	0.906588	1.252948	4	10	79	677.216
2.356194	0.831641	0.616218	15	15	0	677.036
0.523599	0.960688	-0.577532	5	17	11	676.785
-2.879793	2.180315	-1.357379	78	94	92	676.762
2.094395	0.203748	0.590255	8	12	85	676.760
-2.617994	0.458961	-0.107937	95	16	12	676.621
1.570796	1.982574	-1.115518	16	92	92	676.475
-1.308997	1.218453	2.777284	79	93	91	675.978
1.570796	1.662363	0.915448	4	14	15	675.934
0.785398	1.367556	0.358405	14	16	2	675.931
-2.617994	0.910508	1.903534	11	6	18	675.739
-2.356194	2.407836	1.410646	11	17	5	675.645
2.094395	1.184361	0.625864	0	15	13	675.603
2.356194	0.290380	-0.796960	8	94	19	675.383
-2.094395	2.089241	-0.114193	17	94	89	675.330
-1.832596	2.063651	-2.044600	95	7	20	675.277
2.094395	1.025536	1.576859	7	17	7	675.074
-3.141593	2.041297	-2.664597	75	1	92	675.032
1.047198	1.736875	3.023612	5	12	79	674.814
-2.094395	2.587733	0.232235	13	16	6	674.561
-1.832596	1.812176	0.656819	8	15	85	673.859
0.523599	1.448123	-2.163292	16	91	89	673.782
-1.570796	0.700570	1.559208	10	95	18	673.657
-0.261799	1.413347	-1.339188	95	9	19	673.640
-1.308997	0.419640	2.974122	78	95	95	673.529
-1.832596	1.836682	-0.676006	11	15	4	673.197
2.356194	2.760637	2.781135	6	16	13	673.194
-3.141593	1.741644	-2.695914	16	7	93	673.136
-2.879793	1.391910	3.030322	14	14	1	672.599
1.570796	2.001437	0.381215	6	0	77	672.422
1.308997	0.850607	-1.335383	7	18	8	672.352
0.523599	1.545873	-1.877082	0	13	16	672.109
-0.523599	0.297065	2.160177	78	94	1	672.034
-1.832596	1.696674	-1.253233	4	4	21	671.975
0.523599	2.164094	-2.991358	2	11	79	671.949
1.832596	1.433411	-1.035986	7	6	79	671.739
-1.308997	2.356369	3.005869	8	11	81	671.614
1.047198	1.569311	-3.003978	8	14	81	671.436
1.832596	0.700570	1.559208	4	5	79	671.330
-0.261799	1.977582	0.969896	14	9	90	671.280
2.879793	1.736875	3.023612	77	6	0	671.217
1.570796	2.407836	1.410646	1	12	80	671.170
-3.141593	0.831641	0.616218	13	2	17	670.946
1.570796	1.510910	-0.740472	0	15	15	670.499
1.047198	2.089241	-0.114193	79	95	95	670.407
-2.617994	1.256302	0.062705	16	91	91	670.380
0.523599	2.356369	3.005869	5	0	21	670.327
-2.094395	1.683268	0.374177	95	10	77	669.847
-1.047198	0.910508	1.903534	77	4	93	669.451
2.356194	1.194549	-0.801900	18	8	0	669.259
0.000000	1.194549	-0.801900	92	13	18	669.085
1.570796	0.640596	-2.797608	95	6	22	668.877
-0.261799	0.899350	-2.069907	87	10	17	668.872
1.308997	0.685216	-1.712745	9	18	6	668.824
1.308997	1.504028	0.636812	6	16	12	668.666
-0.785398	2.588535	-2.976617	1	7	20	668.364
2.094395	2.396274	-1.959260	16	1	90	668.197
0.785398	1.440580	2.260026	11	9	82	668.162
2.879793	0.831641	0.616218	12	0	18	668.062
2.356194	1.721184	-0.153948	12	14	8	668.000
-1.308997	1.599406	1.426070	8	14	85	667.979
-0.261799	2.664082	-1.071402	8	12	83	667.909
-0.261799	2.041297	-2.664597	5	92	20	667.867
-2.617994	1.440580	2.260026	2	6	76	667.841
2.617994	1.242974	-2.977882	78	1	93	667.808
0.785398	2.089241	-0.114193	79	90	94	667.698
-2.617994	0.762244	-0.273349	77	1	95	667.680
-2.617994	2.153910	-1.714959	76	1	5	667.410
-2.617994	1.214854	-1.966664	7	9	81	667.318
-1.047198	0.864993	2.278281	78	95	92	667.215
1.308997	1.662363	0.915448	6	13	15	667.169
1.047198	0.866395	-2.492918	78	2	3	667.028
-1.570796	2.724429	-0.348782	16	11	5	666.980
-2.356194	1.875281	0.107086	4	10	78	666.969
-1.570796	1.218453	2.777284	78	95	91	666.933
-2.094395	1.872854	1.543456	7	13	81	666.642
0.261799	2.579248	-2.364801	11	6	17	666.619
-0.523599	1.977582	0.969896	15	7	90	666.612
-1.570796	0.960688	-0.577532	14	14	9	666.598
-3.141593	0.899350	-2.069907	93	12	15	666.391
-1.308997	2.863997	0.549740	11	16	5	666.345
1.570796	0.929350	-2.910676	1	7	23	666.234
-2.356194	1.050534	3.042579	11	13	13	666.091
-2.356194	2.984978	1.954446	14	8	87	665.874
-1.308997	1.417623	-0.202254	79	94	93	665.460
-1.047198	0.685216	-1.712745	11	15	7	665.219
-1.570796	0.709924	0.218797	76	5	94	664.893
-2.879793	1.909857	-0.381669	10	10	81	664.688
-3.141593	1.135834	-1.431087	14	15	5	664.511
-0.261799	1.448123	-2.163292	12	15	6	664.484
2.356194	2.592629	0.909713	19	87	0	664.081
-2.879793	2.041297	-2.664597	76	94	92	664.055
1.308997	1.836682	-0.676006	2	9	78	663.587
2.356194	1.504028	0.636812	0	16	13	663.569
1.832596	0.929350	-2.910676	0	6	23	663.506
-2.094395	1.982574	-1.115518	78	2	5	663.170
2.356194	2.349581	-2.702517	13	16	11	663.059
1.832596	1.836682	-0.676006	13	9	14	662.833
-0.785398	1.948085	-2.363031	8	3	18	662.689
2.617994	1.982574	-1.115518	9	5	21	662.648
2.094395	1.510910	-0.740472	19	81	95	662.616
-2.356194	1.683268	0.374177	12	89	84	662.358
-2.879793	0.709924	0.218797	95	17	10	661.943
-1.308997	2.456751	-1.503343	7	20	7	661.822
-2.356194	2.664082	-1.071402	7	12	81	661.636
-1.570796	1.872854	1.543456	5	12	79	661.621
-1.308997	1.374601	-2.456031	79	93	89	661.572
2.094395	2.089241	-0.114193	15	13	5	661.561
2.617994	1.413347	-1.339188	16	11	7	661.481
-2.356194	1.824694	1.850876	7	9	79	661.469
-0.523599	2.041297	-2.664597	6	1	19	661.266
-2.094395	1.025536	1.576859	3	14	80	661.248
2.094395	1.662363	0.915448	4	14	14	661.096
-1.570796	0.379747	-1.713059	7	13	18	660.977
-0.261799	2.579248	-2.364801	75	5	0	660.938
0.785398	2.343981	-1.040456	77	95	92	660.915
-2.094395	1.555207	1.708892	5	13	79	660.829
-1.832596	0.899350	-2.069907	11	15	13	660.775
-1.047198	0.733948	3.021411	79	91	90	660.702
1.570796	1.433411	-1.035986	7	5	79	660.666
-2.617994	2.108018	1.311430	13	15	6	660.344
-1.308997	1.977582	0.969896	13	89	85	660.239
-1.308997	0.992645	-1.723759	85	13	12	660.178
-1.832596	1.113094	-0.272241	7	8	21	659.933
-0.785398	0.615174	-0.666022	10	4	19	659.929
2.094395	1.433411	-1.035986	7	7	79	659.808
-2.617994	0.961715	0.014085	77	0	89	659.698
0.523599	2.393226	1.857173	10	15	10	659.307
-0.523599	0.640596	-2.797608	9	15	14	659.256
2.879793	0.618092	2.539118	9	18	5	659.232
0.261799	2.478122	2.609777	9	18	4	659.227
-1.047198	0.866955	-0.931351	78	10	5	659.118
-2.879793	2.396274	-1.959260	4	7	19	659.067
-0.785398	2.393226	1.857173	11	17	3	658.992
-3.141593	2.979456	-1.009304	9	19	4	658.967
2.094395	2.180315	-1.357379	11	6	19	658.798
-2.617994	0.866955	-0.931351	16	92	91	658.762
1.570796	2.164094	-2.991358	95	14	80	658.666
-2.617994	2.587733	0.232235	93	14	15	658.586
-2.094395	1.488617	1.159546	8	14	83	658.552
2.617994	1.050534	3.042579	78	2	2	658.294
-1.832596	1.948085	-2.363031	7	20	8	658.227
-2.094395	2.396274	-1.959260	2	13	16	658.183
-0.523599	1.948085	-2.363031	8	92	19	657.987
-1.047198	0.458961	-0.107937	8	8	19	657.933
2.879793	2.115563	0.685730	16	12	6	657.874
-1.047198	2.404280	-0.174044	1	9	78	657.846
0.000000	1.433411	-1.035986	95	11	19	657.561
0.785398	2.356369	3.005869	2	16	11	657.312
1.570796	1.812176	0.656819	6	16	13	656.916
-1.308997	2.979456	-1.009304	4	16	12	656.573
-1.047198	1.310100	1.488307	78	5	0	656.482
-2.617994	2.251330	-2.330739	17	13	6	656.369
-2.879793	0.866395	-2.492918	91	12	14	656.318
-2.617994	1.014500	0.906702	13	11	86	656.271
2.094395	1.617114	-1.572037	10	14	13	656.156
0.785398	1.448123	-2.163292	17	94	90	656.103
2.617994	0.297065	2.160177	2	12	81	656.040
-2.617994	0.674054	1.013609	1	10	80	655.875
-1.570796	2.247462	0.191623	15	2	87	655.779
2.356194	0.297065	2.160177	4	10	81	655.639
0.261799	1.846342	-1.796954	75	3	90	655.564
1.047198	2.164094	-2.991358	4	15	82	655.489
1.832596	1.909857	-0.381669	14	87	86	655.241
2.617994	0.960688	-0.577532	16	13	2	655.239
-0.261799	0.418037	1.360082	79	6	7	655.231
-2.879793	2.704512	1.488683	13	9	85	654.749
-1.047198	2.247462	0.191623	77	3	94	654.598
0.261799	1.510910	-0.740472	90	9	19	654.436
-2.879793	0.906588	1.252948	2	10	79	654.379
2.356194	1.545873	-1.877082	84	12	14	654.152
2.094395	2.379497	0.561089	77	1	95	654.098
-1.047198	1.413347	-1.339188	77	5	91	654.096
-2.356194	1.696674	-1.253233	79	2	6	654.030
-0.523599	1.599406	1.426070	77	95	94	653.969
1.832596	1.741644	-2.695914	9	6	22	653.919
0.261799	2.588535	-2.976617	5	95	19	653.885
-1.570796	2.704512	1.488683	78	94	0	653.661
-1.832596	2.704512	1.488683	78	2	0	653.331
-3.141593	2.588535	-2.976617	76	93	90	653.254
-0.261799	1.194549	-0.801900	93	13	18	653.125
2.879793	1.242974	-2.977882	77	95	92	653.102
-1.832596	1.195355	1.200319	4	15	82	653.023
1.308997	1.242974	-2.977882	17	93	90	652.990
1.308997	1.812176	0.656819	11	92	82	652.964
1.570796	2.579248	-2.364801	9	9	16	652.906
-2.094395	0.290380	-0.796960	3	16	15	652.881
-1.047198	1.413430	2.550734	16	80	2	652.803
1.047198	1.247695	1.809890	8	8	80	652.768
-0.785398	0.571433	-1.188419	15	14	8	652.709
1.308997	1.050534	3.042579	18	87	92	652.604
1.047198	1.450119	-2.739050	15	91	87	652.568
-2.617994	0.290380	-0.796960	14	94	88	652.411
-1.832596	1.247695	1.809890	78	95	95	652.360
0.785398	1.128190	-2.288622	19	91	93	652.341
-1.308997	0.700570	1.559208	11	1	17	652.198
1.047198	2.299159	2.264663	16	92	89	652.154
0.261799	2.073035	2.027405	11	14	9	652.086
-2.356194	0.914445	2.687814	12	10	14	651.961
0.523599	1.982574	-1.115518	79	95	90	651.914
1.308997	2.637879	2.121598	9	13	83	651.911
-1.570796	1.756530	-2.105156	6	0	20	651.795
0.261799	2.393226	1.857173	16	8	11	651.678
-1.047198	2.138223	1.678323	17	93	92	651.657
-0.523599	0.080730	-2.622036	8	14	17	651.647
-3.141593	0.418037	1.360082	4	10	81	651.637
-2.617994	1.732874	-0.951685	16	89	88	651.406
-1.308997	1.756530	-2.105156	10	0	18	651.386
2.356194	1.045978	0.343692	16	13	94	651.073
-1.047198	1.766067	2.153843	10	87	82	650.991
-2.879793	0.458961	-0.107937	19	90	0	650.918
-2.617994	1.134497	-1.109631	95	10	18	650.802
-0.785398	1.194549	-0.801900	77	0	91	650.783
2.879793	2.664082	-1.071402	2	19	12	650.751
2.617994	0.080730	-2.622036	93	17	11	650.715
-1.570796	1.448123	-2.163292	4	15	14	650.674
2.879793	1.128190	-2.288622	16	8	91	650.633
2.617994	0.640596	-2.797608	95	19	8	650.488
-1.308997	0.619654	-2.216909	10	16	13	650.101
-2.356194	1.662363	0.915448	11	13	85	650.017
0.523599	1.134796	2.434290	12	8	84	649.962
2.094395	0.290380	-0.796960	6	93	19	649.879
-1.832596	1.488617	1.159546	5	15	82	649.799
-1.308997	2.407836	1.410646	18	93	3	649.736
-1.308997	1.214854	-1.966664	6	16	13	649.724
-1.570796	0.619654	-2.216909	12	15	13	649.712
-1.832596	1.413430	2.550734	94	6	77	649.161
-0.785398	1.658653	-2.409879	8	3	19	649.107
1.047198	2.588535	-2.976617	7	95	20	649.022
2.617994	1.128190	-2.288622	15	1	88	649.020
-2.094395	1.766067	2.153843	4	8	77	648.644
2.879793	0.961715	0.014085	6	4	20	648.619
2.879793	2.979456	-1.009304	12	18	4	648.588
0.785398	0.866955	-0.931351	7	18	9	648.547
-0.785398	1.134497	-1.109631	77	1	92	648.446
0.785398	2.393226	1.857173	16	89	88	648.364
-2.617994	2.187132	-0.479875	3	5	77	648.245
0.785398	1.554776	0.100351	80	87	94	648.224
0.523599	2.760637	2.781135	94	14	81	647.993
0.000000	2.407836	1.410646	17	9	8	647.940
0.000000	1.301460	-0.509251	1	7	76	647.894
-2.094395	1.904882	-1.478089	4	3	21	647.859
-1.832596	2.979456	-1.009304	14	14	8	647.855
-2.879793	2.187132	-0.479875	11	9	82	647.747
-0.785398	0.685216	-1.712745	87	13	15	647.701
-2.356194	2.478122	2.609777	4	7	79	647.503
1.047198	1.045978	0.343692	9	18	7	647.471
-0.523599	2.863997	0.549740	16	12	7	647.417
-2.879793	0.615174	-0.666022	15	93	89	647.409
-1.308997	2.719179	-1.780644	94	16	13	647.305
-2.617994	2.356369	3.005869	95	15	17	647.193
0.000000	2.588535	-2.976617	13	8	15	647.086
1.308997	0.379747	-1.713059	9	19	5	646.510
2.879793	1.617114	-1.572037	12	8	83	646.419
-2.094395	2.979456	-1.009304	15	12	8	646.397
2.617994	1.413430	2.550734	7	11	81	646.302
-1.832596	2.719179	-1.780644	10	18	9	646.134
-0.261799	1.574060	2.783565	5	3	22	646.013
-2.879793	2.251330	-2.330739	75	0	95	645.966
1.832596	1.732874	-0.951685	4	6	78	645.565
0.523599	1.440580	2.260026	11	8	83	645.462
-2.094395	1.836682	-0.676006	17	90	90	645.315
1.570796	0.733948	3.021411	7	7	19	645.248
-2.356194	2.724429	-0.348782	11	16	7	645.223
0.785398	1.247695	1.809890	9	7	81	645.145
-0.523599	1.732874	-0.951685	89	8	17	644.901
2.356194	0.370812	-2.547742	0	18	10	644.824
1.570796	1.904882	-1.478089	5	10	21	644.730
-0.785398	1.696674	-1.253233	0	14	12	644.674
2.094395	1.683268	0.374177	9	1	20	644.566
0.261799	2.404280	-0.174044	15	0	88	644.492
-1.832596	0.960688	-0.577532	14	12	9	644.452
-1.308997	0.864993	2.278281	3	10	80	644.424
-1.832596	1.045978	0.343692	77	7	90	644.411
-1.308997	2.089241	-0.114193	7	17	7	644.355
-1.047198	1.741644	-2.695914	10	2	17	644.185
1.047198	1.998705	2.370472	20	92	4	644.156
-1.832596	1.025536	1.576859	78	5	1	644.018
-2.094395	2.356369	3.005869	90	13	17	643.979
-2.356194	2.187132	-0.479875	12	14	10	643.969
-0.785398	1.433411	-1.035986	76	2	91	643.942
2.094395	1.256302	0.062705	7	2	21	643.769
-0.523599	0.419640	2.974122	11	84	85	643.538
-1.308997	0.615174	-0.666022	14	15	8	643.511
1.308997	1.450119	-2.739050	15	93	87	643.509
1.308997	1.617114	-1.572037	4	10	21	643.430
2.617994	1.569311	-3.003978	3	16	15	643.400
2.617994	0.831641	0.616218	8	2	19	643.211
-2.617994	0.899350	-2.069907	5	10	19	643.195
2.617994	0.709924	0.218797	10	19	2	643.180
2.094395	1.310100	1.488307	8	18	5	643.109
-1.570796	1.045978	0.343692	95	10	80	643.034
-3.141593	0.992645	-1.723759	14	15	6	642.986
-2.617994	1.335669	0.897240	13	11	85	642.782
-1.308997	1.555207	1.708892	81	90	87	642.776
2.356194	1.683268	0.374177	93	8	77	642.634
-1.308997	1.433411	-1.035986	4	17	10	642.377
-2.094395	2.001437	0.381215	2	9	76	642.256
0.523599	2.984978	1.954446	15	9	10	642.231
-3.141593	1.766067	2.153843	15	90	87	642.119
1.047198	1.904882	-1.478089	9	8	21	642.075
1.570796	0.831641	0.616218	3	18	11	642.062
-0.261799	1.555207	1.708892	19	0	4	641.945
-1.832596	2.478122	2.609777	14	6	85	641.872
0.785398	2.760637	2.781135	6	19	6	641.861
-1.308997	1.310100	1.488307	0	11	78	641.811
1.047198	1.870545	-2.976234	6	15	82	641.807
-1.832596	2.295480	1.008277	17	95	93	641.661
-0.785398	1.662363	0.915448	7	7	82	641.659
-2.094395	2.637879	2.121598	12	10	83	641.657
1.570796	1.194549	-0.801900	95	15	14	641.625
-1.832596	1.977582	0.969896	9	14	83	641.623
2.094395	0.418037	1.360082	6	5	80	641.468
-2.356194	1.488617	1.159546	10	13	83	641.316
1.308997	1.977582	0.969896	12	91	84	641.235
-0.785398	1.135834	-1.431087	6	15	12	641.203
-2.879793	2.349581	-2.702517	76	93	91	641.009
-1.570796	1.545873	-1.877082	79	93	90	640.973
1.832596	2.379497	0.561089	91	7	77	640.870
1.308997	0.762244	-0.273349	8	5	19	640.811
-0.261799	2.881233	-2.582574	75	2	0	640.782
-1.570796	0.640596	-2.797608	80	87	89	640.645
2.094395	1.242974	-2.977882	10	7	18	640.537
-2.356194	1.325504	-1.671296	13	15	11	640.478
-2.617994	2.295480	1.008277	10	17	7	640.338
-1.832596	0.458961	-0.107937	10	6	19	640.325
1.832596	1.325504	-1.671296	94	12	19	640.137
1.570796	1.696674	-1.253233	4	9	22	640.082
1.047198	0.591903	2.010408	12	9	86	639.986
-2.879793	0.700570	1.559208	1	12	80	639.965
-2.879793	0.992645	-1.723759	6	10	18	639.927
-3.141593	2.164094	-2.991358	76	94	88	639.921
-1.308997	1.134497	-1.109631	8	16	11	639.808
2.356194	1.869911	2.701025	78	5	93	639.680
2.617994	0.496451	0.593859	20	88	95	639.661
-2.094395	1.310100	1.488307	6	13	80	639.623
-0.785398	1.413430	2.550734	17	81	1	639.419
0.785398	1.545873	-1.877082	2	16	14	639.239
2.617994	2.343981	-1.040456	12	7	18	639.090
0.785398	2.063651	-2.044600	15	91	88	638.989
-0.523599	1.168678	2.108595	78	94	94	638.951
-1.308997	1.045978	0.343692	94	8	79	638.813
1.308997	0.961715	0.014085	10	17	6	638.681
-0.785398	1.555207	1.708892	5	13	83	638.634
2.617994	1.736875	3.023612	78	5	92	638.505
1.047198	0.619654	-2.216909	78	90	92	638.355
2.094395	1.545873	-1.877082	86	14	14	638.297
1.308997	1.510910	-0.740472	3	15	15	638.175
-0.523599	0.864993	2.278281	81	87	82	638.022
1.832596	1.440580	2.260026	10	18	7	637.923
-2.879793	2.881233	-2.582574	93	16	12	637.793
-2.094395	2.174483	2.653697	12	5	83	637.781
-2.356194	2.637879	2.121598	15	6	86	637.692
-3.141593	1.569311	-3.003978	93	9	21	637.602
2.879793	1.168678	2.108595	11	9	81	637.524
2.356194	2.104282	-0.813972	12	7	86	637.496
2.879793	1.025536	1.576859	4	11	78	637.161
1.047198	0.674054	1.013609	10	13	85	637.158
2.356194	1.766067	2.153843	12	8	87	637.117
-2.094395	1.699788	2.452890	2	5	76	636.962
0.523599	1.417623	-0.202254	79	90	1	636.944
-2.094395	1.168678	2.108595	76	94	0	636.928
-2.356194	2.251330	-2.330739	1	11	18	636.927
1.308997	1.391910	3.030322	16	87	89	636.883
-1.832596	1.184361	0.625864	77	6	89	636.640
-3.141593	2.664082	-1.071402	95	19	12	636.593
-2.094395	2.456751	-1.503343	1	15	15	636.569
0.000000	1.869911	2.701025	18	6	6	636.468
1.570796	1.732874	-0.951685	1	6	77	636.465
-0.523599	1.135813	-2.658866	6	12	16	636.314
-0.261799	2.379497	0.561089	11	11	83	636.251
-1.308997	2.664082	-1.071402	11	18	6	636.055
-2.356194	0.674054	1.013609	1	14	81	636.018
-2.094395	1.014500	0.906702	77	1	95	635.997
-2.094395	2.719179	-1.780644	10	17	9	635.835
2.356194	0.960688	-0.577532	17	10	2	635.623
2.094395	0.640596	-2.797608	13	15	3	635.233
1.832596	0.297065	2.160177	5	7	80	635.054
-1.570796	1.256302	0.062705	78	7	89	635.011
-1.308997	1.909857	-0.381669	6	8	78	634.877
-1.832596	1.506530	1.988858	78	94	0	634.771
2.617994	0.618092	2.539118	11	17	5	634.527
0.261799	2.164094	-2.991358	9	2	18	634.430
-2.356194	0.709924	0.218797	94	7	79	634.397
2.617994	1.683268	0.374177	11	2	20	634.316
-1.047198	1.135834	-1.431087	13	2	19	634.304
-1.832596	1.440580	2.260026	94	9	78	634.221
1.832596	0.961715	0.014085	7	0	20	634.166
-0.785398	1.014500	0.906702	92	12	81	634.156
0.261799	2.349581	-2.702517	11	10	15	634.142
-1.570796	1.504028	0.636812	94	17	13	634.140
1.570796	0.458961	-0.107937	7	90	18	634.094
0.261799	0.864993	2.278281	11	8	85	634.017
-2.356194	1.433411	-1.035986	16	94	87	633.929
0.785398	0.458961	-0.107937	88	10	16	633.877
-0.261799	1.948085	-2.363031	14	13	5	633.824
1.308997	2.349581	-2.702517	8	10	16	633.690
-1.832596	2.187132	-0.479875	79	3	6	633.647
1.047198	2.041297	-2.664597	7	16	84	633.293
-1.047198	2.637879	2.121598	78	0	94	632.999
2.617994	0.290380	-0.796960	7	0	19	632.911
-1.047198	1.014500	0.906702	92	13	82	632.884
2.356194	0.080730	-2.622036	0	18	11	632.621
1.570796	2.104282	-0.813972	0	7	78	632.598
1.047198	2.637879	2.121598	13	12	12	632.531
-2.094395	1.658653	-2.409879	2	3	22	632.519
-0.523599	1.846342	-1.796954	90	14	12	632.468
-1.570796	1.869911	2.701025	94	8	78	632.348
0.523599	2.664082	-1.071402	77	1	95	632.296
-3.141593	0.674054	1.013609	1	18	9	632.119
2.356194	2.299159	2.264663	79	2	95	632.076
-0.261799	0.866395	-2.492918	11	13	10	631.977
1.832596	2.349581	-2.702517	91	14	13	631.726
-0.261799	0.700570	1.559208	79	5	5	631.716
-2.879793	1.696674	-1.253233	77	7	1	631.572
-2.356194	1.732874	-0.951685	17	91	88	631.340
-2.879793	1.766067	2.153843	16	92	87	631.320
2.356194	2.164094	-2.991358	10	17	12	631.224
1.832596	0.914445	2.687814	5	11	18	631.091
-1.047198	1.982574	-1.115518	90	8	18	630.940
-2.356194	1.413347	-1.339188	78	2	3	630.897
2.094395	1.247695	1.809890	13	15	0	630.876
1.570796	1.050534	3.042579	8	9	19	630.808
-3.141593	2.396274	-1.959260	7	10	18	630.803
-2.094395	0.960688	-0.577532	78	94	92	630.693
2.617994	0.571433	-1.188419	88	13	13	630.606
-2.617994	1.325504	-1.671296	5	8	79	630.604
1.570796	0.914445	2.687814	18	85	91	630.480
-2.356194	1.194549	-0.801900	18	90	7	630.480
0.523599	1.374601	-2.456031	5	11	81	630.364
1.308997	1.367556	0.358405	6	19	9	630.326
2.879793	1.506530	1.988858	81	87	90	630.229
2.356194	2.174483	2.653697	77	4	93	630.143
-1.047198	1.948085	-2.363031	7	89	17	630.082
-2.094395	0.571433	-1.188419	18	90	2	630.051
1.308997	2.724429	-0.348782	77	0	93	630.029
-3.141593	2.881233	-2.582574	2	22	6	629.941
-1.832596	2.404280	-0.174044	9	17	7	629.814
-1.308997	0.370812	-2.547742	16	1	91	629.720
-0.261799	2.863997	0.549740	9	16	9	629.699
-2.356194	0.906588	1.252948	15	87	88	629.597
-1.832596	2.356369	3.005869	0	7	79	629.550
0.785398	0.591903	2.010408	11	8	85	629.529
2.617994	1.113094	-0.272241	6	4	21	629.489
-1.047198	0.370812	-2.547742	9	9	19	629.355
-1.047198	1.135813	-2.658866	7	12	17	629.280
1.832596	0.203748	0.590255	7	4	19	629.253
2.356194	0.418037	1.360082	5	5	80	629.069
1.832596	2.164094	-2.991358	94	12	79	629.045
1.570796	2.349581	-2.702517	19	89	0	629.018
1.832596	1.113094	-0.272241	4	6	21	628.914
2.617994	2.979456	-1.009304	13	17	4	628.862
-3.141593	1.683268	0.374177	9	16	9	628.760
-2.094395	1.696674	-1.253233	12	16	6	628.675
-2.617994	1.128190	-2.288622	3	10	19	628.618
1.047198	2.033014	2.977192	2	14	80	628.602
-1.570796	1.184361	0.625864	0	16	15	628.534
-1.570796	2.153910	-1.714959	94	9	18	628.433
-1.570796	2.719179	-1.780644	0	16	12	628.394
0.785398	2.863997	0.549740	78	89	93	628.153
1.308997	1.135834	-1.431087	80	6	6	628.140
0.261799	1.732874	-0.951685	94	8	20	628.131
-0.523599	2.592629	0.909713	18	8	6	627.986
-2.879793	1.256302	0.062705	13	86	88	627.985
2.617994	0.458961	-0.107937	4	13	79	627.894
-2.356194	0.458961	-0.107937	93	17	12	627.735
-1.047198	2.456751	-1.503343	7	5	80	627.691
-1.570796	1.391910	3.030322	78	95	89	627.599
0.261799	2.180315	-1.357379	77	1	92	627.552
-0.523599	0.709924	0.218797	2	11	19	627.423
-1.047198	1.658653	-2.409879	8	3	19	627.387
1.832596	0.290380	-0.796960	7	92	19	627.290
-1.047198	1.732874	-0.951685	91	10	17	627.283
2.879793	2.247462	0.191623	3	4	76	627.207
0.261799	1.699788	2.452890	11	13	9	626.976
-2.617994	1.982574	-1.115518	80	5	10	626.885
2.617994	0.203748	0.590255	6	15	15	626.858
2.356194	1.050534	3.042579	79	4	3	626.785
2.617994	0.419640	2.974122	5	19	7	626.754
-0.785398	0.850607	-1.335383	79	9	8	626.623
-0.785398	2.404280	-0.174044	12	11	83	626.529
-1.832596	1.699788	2.452890	0	7	77	626.522
-2.356194	1.606104	-0.451151	14	88	87	626.287
-1.047198	1.195355	1.200319	95	12	79	626.219
-3.141593	1.325504	-1.671296	7	4	78	626.177
0.000000	1.367556	0.358405	76	2	4	626.175
0.000000	0.458961	-0.107937	4	10	19	626.167
-1.570796	0.290380	-0.796960	15	9	90	626.033
2.094395	1.741644	-2.695914	7	7	22	625.953
-0.523599	0.700570	1.559208	13	3	17	625.918
-3.141593	0.762244	-0.273349	9	16	10	625.901
1.047198	2.251330	-2.330739	14	17	6	625.846
1.570796	2.704512	1.488683	95	12	80	625.719
2.094395	1.506530	1.988858	7	16	13	625.714
2.879793	0.899350	-2.069907	15	10	90	625.623
2.356194	1.736875	3.023612	4	18	13	625.602
0.000000	1.374601	-2.456031	12	16	5	625.572
-2.617994	1.696674	-1.253233	77	5	1	625.436
-2.356194	0.899350	-2.069907	4	10	19	625.234
1.570796	1.367556	0.358405	7	17	10	625.143
2.879793	2.579248	-2.364801	12	18	8	625.127
-0.785398	1.617114	-1.572037	93	16	10	625.107
-0.261799	1.301460	-0.509251	1	6	76	624.813
-1.308997	1.367556	0.358405	1	9	80	624.789
1.832596	0.685216	-1.712745	1	19	8	624.699
0.523599	0.685216	-1.712745	94	13	18	624.687
2.617994	0.591903	2.010408	2	9	79	624.612
-1.308997	2.984978	1.954446	2	17	11	624.594
-1.570796	1.113094	-0.272241	89	9	79	624.482
1.047198	0.297065	2.160177	13	9	88	624.398
-3.141593	2.187132	-0.479875	11	7	82	624.376
0.523599	1.812176	0.656819	3	8	77	624.317
-3.141593	2.104282	-0.813972	13	10	84	624.087
1.047198	2.760637	2.781135	95	15	13	624.055
0.261799	1.555207	1.708892	17	10	11	623.904
2.356194	0.866955	-0.931351	90	14	14	623.903
2.617994	1.450119	-2.739050	4	13	18	623.879
-2.094395	2.455966	-0.641220	5	11	79	623.869
0.523599	1.256302	0.062705	18	6	4	623.807
0.261799	2.153910	-1.714959	75	5	89	623.535
1.570796	1.195355	1.200319	4	14	16	623.517
1.570796	1.870545	-2.976234	2	14	80	623.299
1.832596	2.251330	-2.330739	17	0	93	623.277
2.094395	0.571433	-1.188419	89	13	14	623.255
-2.356194	1.310100	1.488307	7	12	80	623.139
2.356194	1.335669	0.897240	0	14	14	623.056
-2.617994	0.960688	-0.577532	16	3	92	623.043
-2.094395	1.335669	0.897240	9	15	85	622.856
1.570796	1.683268	0.374177	15	89	88	622.767
-0.785398	1.846342	-1.796954	91	15	12	622.588
2.356194	1.812176	0.656819	77	95	92	622.449
-1.832596	2.724429	-0.348782	8	17	8	622.409
2.356194	1.574060	2.783565	6	10	80	622.381
-0.261799	0.615174	-0.666022	9	10	19	622.336
-3.141593	1.658653	-2.409879	17	5	91	622.130
2.356194	0.379747	-1.713059	91	14	14	622.053
-0.261799	1.050534	3.042579	14	11	9	621.848
1.570796	0.619654	-2.216909	12	16	6	621.786
-3.141593	1.113094	-0.272241	10	17	8	621.748
-1.832596	2.863997	0.549740	2	11	80	621.666
-3.141593	0.864993	2.278281	14	5	16	621.652
1.308997	2.138223	1.678323	79	1	3	621.493
1.308997	1.135813	-2.658866	5	4	23	621.391
2.094395	0.618092	2.539118	18	9	95	621.387
0.523599	2.041297	-2.664597	1	6	19	621.360
-0.261799	0.419640	2.974122	14	2	87	621.289
-2.356194	1.128190	-2.288622	2	11	19	621.251
2.879793	2.104282	-0.813972	13	7	84	620.986
-0.523599	1.574060	2.783565	5	2	22	620.812
-2.356194	1.374601	-2.456031	0	12	18	620.785
-2.879793	2.393226	1.857173	77	5	5	620.779
-2.879793	1.128190	-2.288622	95	13	15	620.749
-1.308997	2.138223	1.678323	16	94	89	620.725
1.832596	1.488617	1.159546	3	14	16	620.582
1.832596	1.982574	-1.115518	16	93	93	620.532
-1.308997	1.809167	1.213774	8	15	86	620.519
-2.094395	1.721184	-0.153948	15	87	88	620.250
-2.879793	1.301460	-0.509251	19	87	5	620.182
2.094395	1.367556	0.358405	7	93	20	620.105
0.523599	1.870545	-2.976234	9	5	18	620.039
-0.785398	1.683268	0.374177	95	7	76	619.996
0.523599	1.846342	-1.796954	75	0	90	619.851
-0.523599	0.733948	3.021411	13	16	6	619.772
-2.356194	1.113094	-0.272241	78	0	94	619.702
0.261799	2.407836	1.410646	17	11	8	619.648
0.523599	0.619654	-2.216909	75	0	95	619.617
1.570796	1.545873	-1.877082	1	13	19	619.531
-2.617994	0.080730	-2.622036	12	0	18	619.502
2.356194	0.709924	0.218797	7	1	19	619.363
1.047198	0.914445	2.687814	10	9	19	619.356
-2.094395	2.104282	-0.813972	10	8	80	619.351
-2.094395	1.247695	1.809890	3	12	78	619.345
1.832596	1.195355	1.200319	14	16	95	619.291
1.570796	0.591903	2.010408	5	7	79	619.231
-1.570796	1.836682	-0.676006	6	9	78	619.218
1.308997	0.733948	3.021411	8	6	19	619.080
0.785398	2.153910	-1.714959	75	95	90	619.046
-2.879793	0.960688	-0.577532	9	18	10	618.959
1.308997	2.041297	-2.664597	6	14	82	618.931
-0.261799	2.349581	-2.702517	6	90	18	618.848
-2.879793	0.910508	1.903534	12	4	18	618.796
2.617994	2.115563	0.685730	17	9	6	618.792
1.570796	2.041297	-2.664597	19	86	6	618.755
-1.308997	1.184361	0.625864	92	9	79	618.753
-2.879793	1.982574	-1.115518	76	0	91	618.618
-2.879793	1.433411	-1.035986	17	95	88	618.577
2.356194	0.203748	0.590255	6	12	85	618.469
2.356194	1.554776	0.100351	7	4	21	618.443
2.094395	2.881233	-2.582574	5	13	15	618.405
2.094395	2.979456	-1.009304	18	12	4	618.374
1.308997	2.760637	2.781135	6	19	6	618.293
-0.785398	1.242974	-2.977882	12	16	6	618.291
1.832596	1.904882	-1.478089	3	11	21	618.241
-1.047198	1.998705	2.370472	13	86	84	618.229
-2.617994	0.418037	1.360082	9	20	6	618.217
1.308997	1.809167	1.213774	14	92	86	618.085
2.356194	1.836682	-0.676006	13	8	88	618.035
-1.832596	2.456751	-1.503343	11	17	7	617.948
1.832596	1.450119	-2.739050	6	5	23	617.913
0.261799	2.138223	1.678323	17	9	10	617.872
0.000000	0.910508	1.903534	0	11	81	617.755
-1.047198	2.108018	1.311430	15	90	90	617.746
0.785398	0.864993	2.278281	13	8	85	617.679
-1.308997	2.033014	2.977192	5	3	22	617.624
-2.879793	1.050534	3.042579	1	11	79	617.583
-1.832596	1.504028	0.636812	10	14	85	617.549
2.094395	1.836682	-0.676006	13	10	14	617.383
0.785398	1.045978	0.343692	15	15	1	617.345
0.000000	2.063651	-2.044600	6	7	19	617.333
-0.785398	1.218453	2.777284	81	90	87	617.221
1.308997	0.571433	-1.188419	2	14	17	617.151
1.308997	2.579248	-2.364801	12	19	4	617.090
-2.879793	1.998705	2.370472	15	91	87	617.046
-2.094395	1.045978	0.343692	13	11	88	616.831
0.000000	1.545873	-1.877082	11	17	7	616.769
-1.308997	2.588535	-2.976617	13	6	84	616.719
-1.832596	1.214854	-1.966664	9	15	13	616.629
0.785398	1.417623	-0.202254	79	90	1	616.622
0.523599	1.998705	2.370472	10	14	10	616.586
-2.879793	1.113094	-0.272241	8	15	83	616.522
1.570796	2.478122	2.609777	11	14	86	616.470
1.308997	2.587733	0.232235	79	0	95	616.432
-1.832596	1.824694	1.850876	4	12	79	616.395
0.523599	2.379497	0.561089	19	88	6	616.300
2.879793	2.704512	1.488683	19	88	94	616.230
-2.617994	1.025536	1.576859	9	4	20	616.168
-0.523599	1.045978	0.343692	0	10	19	616.126
0.261799	2.089241	-0.114193	17	92	91	616.117
0.523599	2.174483	2.653697	6	95	22	615.898
-2.879793	2.108018	1.311430	75	95	1	615.828
-2.617994	1.113094	-0.272241	18	91	95	615.821
-1.047198	2.104282	-0.813972	87	10	16	615.768
0.785398	1.113094	-0.272241	78	94	3	615.704
-1.570796	2.456751	-1.503343	10	18	7	615.696
0.261799	1.301460	-0.509251	16	84	91	615.658
-1.308997	1.135813	-2.658866	8	12	17	615.613
-1.047198	2.863997	0.549740	16	12	3	615.604
-2.094395	1.869911	2.701025	1	4	76	615.573
-2.356194	1.367556	0.358405	0	14	15	615.482
-3.141593	1.367556	0.358405	10	4	20	615.464
-3.141593	1.982574	-1.115518	7	5	21	615.429
0.000000	0.203748	0.590255	87	11	13	615.420
2.617994	0.866395	-2.492918	5	1	22	615.391
2.094395	1.554776	0.100351	9	8	80	615.347
0.785398	1.374601	-2.456031	16	91	88	615.219
-2.356194	2.174483	2.653697	3	8	79	615.106
-1.308997	1.025536	1.576859	8	0	19	615.094
-0.523599	0.992645	-1.723759	10	14	11	615.060
-0.261799	1.128190	-2.288622	89	8	19	614.940
0.785398	1.184361	0.625864	7	18	10	614.887
-2.617994	1.413430	2.550734	95	5	76	614.883
-2.356194	0.961715	0.014085	15	7	91	614.578
-3.141593	1.872854	1.543456	76	3	3	614.529
-1.832596	1.545873	-1.877082	78	0	90	614.495
-0.261799	1.617114	-1.572037	95	8	19	614.465
1.570796	1.569311	-3.003978	5	13	81	614.260
0.523599	1.872854	1.543456	17	12	9	614.125
-0.523599	0.290380	-0.796960	11	6	18	614.035
0.000000	1.218453	2.777284	16	8	11	614.025
2.356194	0.733948	3.021411	9	18	5	613.975
-3.141593	0.709924	0.218797	12	95	18	613.965
0.000000	1.440580	2.260026	18	6	6	613.898
0.261799	1.214854	-1.966664	17	88	91	613.819
-2.094395	1.617114	-1.572037	11	16	10	613.559
-0.523599	0.914445	2.687814	94	3	76	613.504
0.000000	1.113094	-0.272241	8	6	20	613.472
2.879793	1.683268	0.374177	11	15	8	613.453
-1.047198	1.325504	-1.671296	3	15	12	613.436
-2.617994	1.184361	0.625864	14	11	88	613.129
2.617994	2.164094	-2.991358	8	18	12	613.084
0.523599	1.732874	-0.951685	3	10	78	612.971
0.261799	0.674054	1.013609	78	4	7	612.930
-2.094395	2.180315	-1.357379	2	5	21	612.820
-1.570796	2.587733	0.232235	11	16	5	612.775
-2.617994	1.195355	1.200319	76	5	0	612.504
-1.832596	1.617114	-1.572037	9	17	10	612.410
0.785398	1.721184	-0.153948	79	90	94	612.365
2.617994	1.391910	3.030322	79	94	92	612.226
-1.570796	2.187132	-0.479875	9	8	79	612.213
0.523599	2.033014	2.977192	95	11	78	612.149
-2.094395	2.063651	-2.044600	3	11	19	612.124
2.094395	0.619654	-2.216909	6	20	5	612.016
-0.785398	2.063651	-2.044600	7	3	19	611.939
-2.879793	1.014500	0.906702	15	9	86	611.930
2.094395	0.674054	1.013609	12	18	2	611.928
2.094395	0.700570	1.559208	5	5	78	611.741
0.000000	0.906588	1.252948	78	5	5	611.706
0.785398	0.866395	-2.492918	76	95	1	611.705
-2.094395	0.080730	-2.622036	13	1	18	611.648
-0.785398	1.450119	-2.739050	6	10	18	611.605
0.000000	1.128190	-2.288622	88	7	19	611.575
2.879793	0.203748	0.590255	7	6	82	611.488
-1.047198	2.180315	-1.357379	91	9	16	611.471
0.785398	1.741644	-2.695914	11	13	84	611.470
0.523599	2.349581	-2.702517	3	4	20	611.453
2.356194	1.325504	-1.671296	84	11	15	611.296
0.785398	1.732874	-0.951685	78	95	89	611.086
-2.617994	1.488617	1.159546	18	12	4	611.027
-2.879793	2.089241	-0.114193	9	8	78	610.919
-2.356194	0.379747	-1.713059	16	94	90	610.867
1.832596	1.256302	0.062705	5	2	21	610.860
0.785398	2.455966	-0.641220	78	1	92	610.847
2.617994	2.407836	1.410646	18	88	92	610.683
-2.879793	2.579248	-2.364801	2	21	9	610.562
-0.523599	0.762244	-0.273349	7	10	20	610.559
-2.879793	1.374601	-2.456031	1	13	18	610.530
-0.523599	2.979456	-1.009304	94	15	14	610.295
1.570796	2.073035	2.027405	79	95	1	610.294
-0.261799	0.203748	0.590255	93	13	16	610.212
-1.832596	2.180315	-1.357379	93	10	19	610.182
0.000000	0.700570	1.559208	20	85	95	610.160
-0.261799	1.736875	3.023612	2	2	22	610.155
-2.879793	1.325504	-1.671296	17	11	11	609.946
-1.308997	0.866955	-0.931351	9	17	9	609.934
-3.141593	1.128190	-2.288622	95	14	15	609.743
2.879793	2.356369	3.005869	76	94	88	609.721
0.523599	1.504028	0.636812	5	5	77	609.697
2.617994	1.545873	-1.877082	82	10	13	609.579
0.000000	2.456751	-1.503343	77	2	1	609.576
2.879793	0.297065	2.160177	13	18	2	609.569
-2.879793	0.733948	3.021411	17	5	10	609.563
1.308997	1.824694	1.850876	17	1	94	609.516
-1.047198	2.033014	2.977192	4	3	22	609.501
2.879793	2.251330	-2.330739	11	0	18	609.460
2.617994	0.619654	-2.216909	74	6	94	609.389
0.523599	1.433411	-1.035986	79	95	94	609.326
0.000000	2.393226	1.857173	17	6	11	609.265
-1.832596	0.961715	0.014085	8	11	20	609.264
-3.141593	2.356369	3.005869	78	92	87	609.195
-0.261799	1.812176	0.656819	8	6	81	609.191
-1.570796	1.335669	0.897240	78	2	87	609.172
-2.879793	1.413347	-1.339188	17	92	88	609.133
-1.570796	0.864993	2.278281	4	10	80	609.099
1.832596	2.588535	-2.976617	95	18	9	609.078
-0.523599	2.033014	2.977192	11	91	17	609.055
2.879793	0.290380	-0.796960	15	94	88	608.985
-2.617994	1.909857	-0.381669	9	12	81	608.890
1.047198	1.135813	-2.658866	17	91	90	608.727
-1.570796	1.554776	0.100351	0	13	19	608.518
-0.785398	1.574060	2.783565	6	2	22	608.245
-0.785398	1.256302	0.062705	86	12	15	608.201
1.047198	2.153910	-1.714959	14	89	87	608.156
1.047198	1.948085	-2.363031	15	95	89	608.132
2.356194	2.881233	-2.582574	3	18	9	608.084
-2.094395	2.379497	0.561089	18	94	95	608.080
-3.141593	2.033014	2.977192	77	93	86	608.047
-3.141593	1.998705	2.370472	14	89	86	608.033
2.879793	2.033014	2.977192	77	2	93	608.033
2.356194	0.866395	-2.492918	5	0	22	607.992
1.047198	0.850607	-1.335383	10	17	7	607.917
1.570796	2.984978	1.954446	1	11	80	607.904
-2.356194	1.554776	0.100351	94	13	16	607.855
-2.094395	0.992645	-1.723759	4	16	17	607.819
2.617994	1.766067	2.153843	13	89	84	607.812
1.047198	0.419640	2.974122	10	4	18	607.721
-1.832596	1.218453	2.777284	8	73	4	607.691
-0.785398	2.104282	-0.813972	85	7	16	607.665
-2.356194	1.218453	2.777284	11	12	14	607.653
2.617994	0.992645	-1.723759	15	11	5	607.647
-1.832596	1.135813	-2.658866	10	11	17	607.641
0.523599	1.113094	-0.272241	1	15	13	607.582
-0.261799	2.984978	1.954446	7	20	7	607.494
-3.141593	0.379747	-1.713059	20	93	95	607.493
1.832596	2.343981	-1.040456	92	11	17	607.422
-2.356194	0.992645	-1.723759	4	11	79	607.328
0.785398	2.041297	-2.664597	10	15	85	607.290
2.617994	0.418037	1.360082	3	9	81	607.278
1.308997	1.875281	0.107086	9	81	84	607.108
-2.094395	2.724429	-0.348782	79	5	6	606.979
-1.308997	2.153910	-1.714959	93	8	18	606.946
1.570796	2.356369	3.005869	20	95	3	606.885
-1.832596	1.766067	2.153843	2	10	78	606.851
1.308997	2.588535	-2.976617	8	92	20	606.806
0.261799	1.836682	-0.676006	15	87	88	606.761
-0.523599	1.413430	2.550734	16	92	91	606.685
0.000000	0.379747	-1.713059	3	17	15	606.517
-1.832596	0.080730	-2.622036	77	95	2	606.505
-0.261799	1.214854	-1.966664	18	5	14	606.412
0.000000	2.579248	-2.364801	13	4	17	606.380
2.356194	0.674054	1.013609	7	20	4	606.277
2.356194	1.569311	-3.003978	5	16	16	606.265
-0.785398	2.001437	0.381215	2	10	77	606.158
-0.785398	2.979456	-1.009304	9	72	95	606.075
-1.832596	2.247462	0.191623	3	10	77	605.990
2.094395	0.297065	2.160177	4	8	80	605.966
-0.785398	2.073035	2.027405	6	18	9	605.918
0.785398	2.164094	-2.991358	0	12	79	605.917
-0.261799	1.367556	0.358405	76	5	1	605.774
-1.832596	1.433411	-1.035986	8	5	21	605.774
-2.617994	2.396274	-1.959260	4	20	10	605.744
-0.261799	1.195355	1.200319	0	11	81	605.701
-0.261799	1.218453	2.777284	16	6	11	605.678
1.570796	2.760637	2.781135	2	14	14	605.669
2.617994	0.615174	-0.666022	16	13	4	605.652
-2.094395	1.440580	2.260026	77	94	1	605.640
-1.832596	1.982574	-1.115518	1	6	21	605.472
2.094395	2.863997	0.549740	77	0	1	605.466
2.356194	1.440580	2.260026	12	86	83	605.437
2.356194	2.138223	1.678323	82	88	86	605.377
-3.141593	0.080730	-2.622036	88	13	13	605.314
-3.141593	1.301460	-0.509251	12	12	84	605.173
-0.261799	2.033014	2.977192	19	94	91	605.169
-0.261799	2.295480	1.008277	77	0	92	605.087
1.570796	2.180315	-1.357379	13	78	91	605.073
0.785398	1.510910	-0.740472	5	9	79	605.036
-2.094395	0.419640	2.974122	8	4	20	604.953
-1.570796	2.356369	3.005869	11	8	83	604.937
1.308997	1.696674	-1.253233	6	8	22	604.759
-0.261799	0.370812	-2.547742	5	14	19	604.739
1.832596	0.419640	2.974122	77	1	2	604.689
0.523599	0.418037	1.360082	11	16	87	604.614
2.879793	1.417623	-0.202254	11	10	82	604.553
1.570796	0.615174	-0.666022	7	6	19	604.533
1.308997	1.606104	-0.451151	6	10	79	604.526
-2.617994	0.709924	0.218797	94	17	11	604.352
2.356194	1.617114	-1.572037	92	12	19	604.332
-0.523599	2.164094	-2.991358	9	91	18	604.331
-2.094395	1.510910	-0.740472	10	9	82	604.302
-0.523599	0.850607	-1.335383	4	17	13	604.181
-2.879793	2.719179	-1.780644	1	7	19	604.091
0.261799	2.984978	1.954446	15	8	11	604.046
2.356194	1.413430	2.550734	6	13	16	604.024
-1.047198	1.599406	1.426070	13	15	5	604.013
2.356194	2.343981	-1.040456	13	5	18	603.899
-0.785398	1.195355	1.200319	92	11	80	603.873
-1.047198	1.417623	-0.202254	1	5	77	603.840
-2.356194	2.881233	-2.582574	94	14	14	603.826
1.570796	1.113094	-0.272241	6	5	21	603.730
-2.094395	2.187132	-0.479875	79	5	8	603.647
-1.570796	2.396274	-1.959260	5	20	9	603.637
0.261799	0.910508	1.903534	13	17	6	603.636
0.261799	1.413430	2.550734	12	13	10	603.500
-2.094395	0.709924	0.218797	14	4	18	603.482
-2.356194	2.379497	0.561089	93	14	15	603.427
1.308997	1.310100	1.488307	6	8	79	603.336
-2.094395	2.108018	1.311430	12	78	91	603.306
1.832596	2.104282	-0.813972	15	89	89	603.300
1.308997	1.904882	-1.478089	6	9	21	603.271
1.047198	0.418037	1.360082	10	10	85	603.255
2.356194	0.899350	-2.069907	9	2	19	603.242
-0.785398	0.379747	-1.713059	16	6	89	603.217
1.832596	1.050534	3.042579	7	8	19	603.117
1.308997	1.870545	-2.976234	4	15	81	602.999
0.261799	1.113094	-0.272241	4	15	13	602.984
-2.879793	2.407836	1.410646	76	0	4	602.904
1.570796	1.736875	3.023612	78	94	94	602.869
-0.785398	1.506530	1.988858	14	92	88	602.817
-3.141593	2.251330	-2.330739	12	1	18	602.649
-0.261799	2.299159	2.264663	11	1	20	602.597
0.785398	1.875281	0.107086	79	90	94	602.530
-0.523599	1.836682	-0.676006	86	9	16	602.506
0.785398	0.674054	1.013609	13	10	85	602.468
-0.523599	0.899350	-2.069907	88	11	17	602.453
1.832596	1.218453	2.777284	8	11	17	602.450
-1.570796	0.910508	1.903534	8	2	20	602.422
2.617994	2.041297	-2.664597	10	17	13	602.072
0.523599	1.741644	-2.695914	1	8	18	602.041
0.261799	0.762244	-0.273349	3	18	11	602.037
2.356194	1.113094	-0.272241	18	9	95	601.984
-1.570796	1.488617	1.159546	3	14	81	601.975
0.261799	2.637879	2.121598	16	5	11	601.967
1.832596	1.310100	1.488307	18	92	89	601.956
-2.094395	0.591903	2.010408	12	6	17	601.905
-1.047198	1.448123	-2.163292	10	93	19	601.802
2.356194	0.914445	2.687814	4	9	18	601.724
-1.308997	1.413430	2.550734	81	90	90	601.659
-1.570796	1.721184	-0.153948	5	5	77	601.579
1.570796	0.762244	-0.273349	7	5	19	601.486
1.570796	1.256302	0.062705	6	3	21	601.462
2.094395	0.831641	0.616218	95	13	80	601.314
-0.523599	1.683268	0.374177	94	6	76	601.248
0.261799	1.948085	-2.363031	14	87	86	601.182
-2.356194	2.153910	-1.714959	3	8	20	601.163
-2.617994	1.872854	1.543456	10	11	81	601.139
1.570796	2.724429	-0.348782	20	89	2	601.088
-1.832596	0.370812	-2.547742	78	93	93	600.967
2.617994	2.637879	2.121598	95	7	79	600.885
2.617994	1.870545	-2.976234	78	5	1	600.874
-2.094395	2.984978	1.954446	9	3	81	600.651
0.785398	1.846342	-1.796954	76	93	89	600.625
-1.832596	1.256302	0.062705	79	10	88	600.588
-0.785398	1.448123	-2.163292	12	94	18	600.528
1.570796	0.571433	-1.188419	92	13	16	600.449
2.879793	2.588535	-2.976617	12	18	7	600.403
0.785398	1.870545	-2.976234	8	14	82	600.398
-2.617994	1.599406	1.426070	11	11	81	600.386
-1.308997	0.685216	-1.712745	89	14	14	600.354
2.617994	1.824694	1.850876	15	88	86	600.023
2.617994	2.180315	-1.357379	8	8	20	599.972
-2.879793	1.510910	-0.740472	19	86	7	599.961
0.261799	1.904882	-1.478089	2	12	17	599.912
0.523599	2.089241	-0.114193	78	92	95	599.900
2.094395	1.391910	3.030322	9	10	17	599.895
-2.617994	1.870545	-2.976234	15	13	1	599.874
-3.141593	0.203748	0.590255	7	6	81	599.833
-1.570796	1.809167	1.213774	4	14	80	599.790
-1.570796	1.506530	1.988858	79	90	92	599.702
-2.879793	2.724429	-0.348782	12	18	6	599.647
-2.617994	2.164094	-2.991358	15	13	2	599.585
1.832596	2.180315	-1.357379	15	80	90	599.567
-0.785398	1.756530	-2.105156	89	15	12	599.510
2.617994	2.760637	2.781135	92	10	17	599.510
2.356194	0.850607	-1.335383	89	15	12	599.500
-2.094395	2.343981	-1.040456	78	92	93	599.486
1.308997	1.113094	-0.272241	5	4	21	599.435
-3.141593	1.870545	-2.976234	77	0	90	599.359
0.785398	2.664082	-1.071402	20	88	2	599.320
0.523599	0.203748	0.590255	5	89	18	599.289
2.094395	1.998705	2.370472	78	5	92	599.263
0.523599	1.574060	2.783565	11	15	9	599.169
1.308997	1.741644	-2.695914	7	14	83	599.154
0.523599	2.404280	-0.174044	79	5	0	599.135
-1.308997	1.413347	-1.339188	79	8	3	599.086
-2.356194	2.587733	0.232235	16	14	6	598.940
0.000000	0.419640	2.974122	14	6	87	598.796
-0.261799	0.297065	2.160177	78	92	1	598.776
2.617994	1.875281	0.107086	13	14	7	598.770
-1.308997	1.948085	-2.363031	77	0	3	598.729
1.047198	1.658653	-2.409879	17	93	91	598.643
-2.094395	0.961715	0.014085	10	9	20	598.631
0.261799	2.063651	-2.044600	74	2	93	598.376
1.832596	1.696674	-1.253233	2	9	22	598.254
-0.523599	0.591903	2.010408	77	95	95	598.228
0.261799	2.881233	-2.582574	11	7	16	598.154
-0.523599	0.379747	-1.713059	17	11	4	598.104
2.094395	0.379747	-1.713059	90	14	13	598.071
-2.356194	1.617114	-1.572037	14	15	10	598.068
-1.047198	1.875281	0.107086	5	8	80	598.067
-2.879793	1.732874	-0.951685	7	1	22	598.052
-0.261799	0.733948	3.021411	14	87	85	598.048
-1.570796	1.732874	-0.951685	9	16	6	598.032
-2.356194	0.618092	2.539118	13	9	14	598.008
-0.785398	1.875281	0.107086	5	9	80	597.942
-0.523599	1.510910	-0.740472	1	5	75	597.899
0.000000	0.618092	2.539118	13	2	86	597.894
2.356194	1.599406	1.426070	5	10	17	597.879
1.308997	2.979456	-1.009304	74	1	94	597.875
-1.570796	0.615174	-0.666022	15	10	93	597.813
1.047198	2.704512	1.488683	4	15	82	597.763
2.094395	1.168678	2.108595	10	18	3	597.637
-1.832596	2.108018	1.311430	8	13	81	597.622
2.094395	1.736875	3.023612	8	17	13	597.587
-3.141593	1.450119	-2.739050	0	17	12	597.586
-1.047198	0.899350	-2.069907	80	91	93	597.519
-2.356194	1.214854	-1.966664	78	91	3	597.374
-3.141593	0.290380	-0.796960	15	95	88	597.364
-1.308997	2.001437	0.381215	10	15	8	597.273
1.047198	1.721184	-0.153948	7	12	81	597.112
0.000000	1.413430	2.550734	14	12	7	597.098
1.570796	2.187132	-0.479875	16	7	12	597.063
-1.047198	0.960688	-0.577532	95	2	75	597.013
-1.832596	1.374601	-2.456031	8	13	16	597.011
1.570796	2.396274	-1.959260	7	20	8	596.990
-3.141593	2.456751	-1.503343	78	95	93	596.982
1.832596	1.014500	0.906702	2	15	14	596.892
2.094395	0.762244	-0.273349	5	0	20	596.844
0.785398	1.569311	-3.003978	9	13	82	596.748
2.617994	2.299159	2.264663	79	91	93	596.439
-0.261799	1.168678	2.108595	79	91	93	596.383
-0.261799	2.251330	-2.330739	13	14	6	596.272
-2.356194	1.448123	-2.163292	9	10	82	596.197
1.047198	2.108018	1.311430	12	88	85	596.196
-1.570796	1.998705	2.370472	80	88	92	596.145
2.094395	2.153910	-1.714959	8	9	19	596.116
-1.308997	1.872854	1.543456	12	89	85	595.992
-0.785398	0.866955	-0.931351	1	18	13	595.971
-2.879793	1.736875	3.023612	13	13	12	595.856
-1.047198	1.168678	2.108595	4	11	81	595.817
0.523599	0.458961	-0.107937	93	12	17	595.755
-0.261799	1.374601	-2.456031	6	11	81	595.708
-0.523599	0.619654	-2.216909	13	13	8	595.648
-0.523599	1.134497	-1.109631	95	15	15	595.604
-0.523599	2.349581	-2.702517	4	89	19	595.535
2.094395	2.393226	1.857173	79	93	1	595.527
2.356194	1.982574	-1.115518	9	4	21	595.451
-0.261799	2.343981	-1.040456	6	5	79	595.400
0.785398	2.478122	2.609777	7	19	4	595.379
1.308997	1.014500	0.906702	5	15	14	595.326
2.879793	1.134497	-1.109631	15	14	2	595.315
1.832596	2.984978	1.954446	76	93	93	595.255
-1.570796	1.242974	-2.977882	79	93	92	595.241
-2.094395	0.906588	1.252948	15	89	88	595.225
1.832596	2.041297	-2.664597	12	6	20	595.207
-2.617994	1.846342	-1.796954	76	0	4	595.198
-3.141593	2.349581	-2.702517	75	0	91	595.152
0.000000	0.418037	1.360082	79	5	6	595.120
-1.832596	0.297065	2.160177	85	11	12	594.849
1.832596	0.866955	-0.931351	90	15	13	594.784
-2.094395	2.592629	0.909713	78	92	90	594.777
-0.261799	2.407836	1.410646	17	7	8	594.745
-1.832596	1.872854	1.543456	7	11	79	594.649
0.785398	0.370812	-2.547742	75	0	93	594.547
-1.047198	1.872854	1.543456	16	86	92	594.463
-0.523599	1.214854	-1.966664	78	7	9	594.460
1.570796	2.299159	2.264663	9	14	84	594.386
2.094395	1.574060	2.783565	8	8	79	594.294
2.879793	1.413347	-1.339188	16	12	3	594.222
1.047198	0.762244	-0.273349	8	3	19	594.046
-0.523599	1.194549	-0.801900	0	13	18	594.045
-2.617994	0.906588	1.252948	16	15	3	593.998
1.047198	1.168678	2.108595	10	9	82	593.900
-1.570796	1.194549	-0.801900	10	16	9	593.888
2.879793	1.214854	-1.966664	15	9	88	593.858
-2.356194	1.809167	1.213774	11	13	83	593.685
1.570796	0.992645	-1.723759	8	19	5	593.670
1.308997	2.251330	-2.330739	15	91	89	593.622
1.832596	1.736875	3.023612	0	13	79	593.610
2.094395	1.134796	2.434290	17	93	91	593.608
-0.523599	0.571433	-1.188419	14	16	8	593.490
-1.308997	0.080730	-2.622036	15	0	89	593.490
-0.785398	0.640596	-2.797608	11	14	14	593.489
0.785398	1.391910	3.030322	14	11	86	593.405
-0.261799	0.864993	2.278281	2	11	80	593.336
0.523599	2.456751	-1.503343	3	14	80	593.335
-2.356194	1.870545	-2.976234	14	15	2	593.295
-2.879793	1.948085	-2.363031	75	95	0	593.243
2.356194	1.218453	2.777284	6	10	18	593.217
-1.308997	1.683268	0.374177	79	95	3	593.163
-1.047198	2.724429	-0.348782	14	14	5	593.147
-2.617994	1.504028	0.636812	15	9	87	593.101
0.523599	1.510910	-0.740472	89	9	19	593.072
2.617994	1.998705	2.370472	79	91	93	593.066
-2.356194	2.033014	2.977192	2	6	77	593.055
-0.261799	2.588535	-2.976617	13	7	15	593.044
-1.308997	2.396274	-1.959260	7	95	19	593.010
0.000000	2.349581	-2.702517	6	90	18	592.989
-2.356194	1.247695	1.809890	76	1	1	592.982
-1.570796	1.025536	1.576859	9	0	19	592.950
-3.141593	1.606104	-0.451151	11	10	82	592.921
2.617994	2.108018	1.311430	77	0	0	592.878
-0.785398	2.174483	2.653697	19	93	90	592.877
1.047198	2.979456	-1.009304	74	4	94	592.850
-2.356194	1.721184	-0.153948	16	94	89	592.704
-2.879793	2.247462	0.191623	3	13	18	592.690
0.261799	1.658653	-2.409879	6	17	8	592.678
2.617994	1.506530	1.988858	95	9	77	592.564
-0.523599	2.724429	-0.348782	88	10	14	592.558
-1.832596	1.128190	-2.288622	9	14	15	592.458
2.356194	0.619654	-2.216909	7	0	20	592.336
1.570796	0.866395	-2.492918	80	7	6	592.253
0.261799	1.554776	0.100351	77	95	5	592.175
-0.785398	1.214854	-1.966664	77	4	0	592.153
-1.308997	1.870545	-2.976234	8	7	20	592.119
-1.832596	0.866395	-2.492918	13	11	15	592.095
1.570796	1.869911	2.701025	17	92	94	592.042
0.000000	1.554776	0.100351	77	2	4	591.916
1.308997	0.591903	2.010408	90	13	17	591.860
2.617994	1.696674	-1.253233	3	5	77	591.793
-2.617994	0.591903	2.010408	0	17	11	591.773
2.094395	2.001437	0.381215	94	5	75	591.762
-1.570796	0.866955	-0.931351	11	16	9	591.732
0.000000	1.741644	-2.695914	12	16	4	591.654
1.570796	1.606104	-0.451151	5	10	79	591.654
-1.570796	0.762244	-0.273349	12	3	20	591.650
-1.047198	2.587733	0.232235	17	10	5	591.638
0.000000	1.658653	-2.409879	8	11	15	591.518
1.047198	0.960688	-0.577532	79	92	1	591.512
1.570796	1.218453	2.777284	17	86	89	591.487
2.094395	2.984978	1.954446	77	90	93	591.473
-1.570796	1.367556	0.358405	78	7	87	591.416
-2.617994	2.881233	-2.582574	0	13	15	591.407
-0.523599	1.433411	-1.035986	0	10	18	591.395
-1.308997	1.658653	-2.409879	10	94	17	591.341
2.617994	2.104282	-0.813972	13	5	84	591.328
-1.308997	1.448123	-2.163292	6	15	15	591.292
1.308997	0.929350	-2.910676	3	8	23	591.289
1.047198	1.732874	-0.951685	2	7	77	591.160
-0.785398	2.164094	-2.991358	4	11	79	591.107
0.523599	0.571433	-1.188419	2	6	22	591.076
0.261799	0.992645	-1.723759	1	11	20	591.025
2.094395	0.496451	0.593859	7	12	84	590.907
1.570796	2.138223	1.678323	12	13	88	590.864
1.832596	0.709924	0.218797	5	94	20	590.836
-1.832596	1.194549	-0.801900	12	14	8	590.832
-2.879793	0.961715	0.014085	18	91	94	590.815
1.047198	2.104282	-0.813972	78	94	89	590.790
2.094395	1.440580	2.260026	7	14	15	590.771
0.785398	1.256302	0.062705	14	14	95	590.766
1.047198	2.579248	-2.364801	13	18	5	590.764
-0.785398	2.587733	0.232235	16	12	5	590.695
0.785398	0.640596	-2.797608	76	2	6	590.508
-1.308997	1.050534	3.042579	78	94	88	590.501
-2.617994	2.001437	0.381215	4	7	77	590.469
0.000000	2.174483	2.653697	13	15	1	590.411
1.570796	1.214854	-1.966664	91	13	18	590.409
-1.570796	0.370812	-2.547742	11	4	20	590.406
-2.356194	2.343981	-1.040456	7	8	79	590.330
2.356194	0.458961	-0.107937	12	18	3	590.303
-1.047198	2.089241	-0.114193	77	1	1	590.292
-1.047198	1.569311	-3.003978	8	8	19	590.227
-0.785398	2.592629	0.909713	78	94	92	590.122
-0.523599	2.404280	-0.174044	11	13	83	589.898
-2.617994	1.510910	-0.740472	19	93	0	589.880
2.617994	1.741644	-2.695914	5	15	16	589.863
0.785398	1.982574	-1.115518	78	94	90	589.795
1.832596	2.396274	-1.959260	17	94	91	589.786
-1.832596	2.588535	-2.976617	79	86	91	589.726
1.570796	2.153910	-1.714959	12	5	19	589.652
1.308997	2.393226	1.857173	11	9	85	589.568
-0.261799	1.870545	-2.976234	6	5	18	589.559
-0.523599	1.756530	-2.105156	11	94	19	589.521
0.785398	2.251330	-2.330739	9	0	19	589.493
-0.523599	1.374601	-2.456031	2	12	17	589.356
-1.832596	2.343981	-1.040456	17	11	3	589.314
-2.356194	2.295480	1.008277	20	0	0	589.252
0.261799	0.685216	-1.712745	1	14	18	589.216
-1.047198	1.574060	2.783565	16	80	4	589.141
2.879793	1.134796	2.434290	8	11	80	589.067
-1.047198	0.297065	2.160177	79	6	7	589.017
-1.570796	0.899350	-2.069907	9	16	14	589.003
-0.785398	1.824694	1.850876	9	11	83	588.999
1.832596	1.413430	2.550734	11	19	5	588.986
1.308997	1.736875	3.023612	3	14	80	588.965
0.523599	1.335669	0.897240	13	10	14	588.934
0.261799	1.134497	-1.109631	95	14	18	588.916
-0.785398	1.367556	0.358405	3	8	20	588.900
-0.261799	1.310100	1.488307	77	95	1	588.874
1.047198	1.242974	-2.977882	10	13	82	588.824
-1.308997	2.187132	-0.479875	95	9	78	588.774
0.785398	1.836682	-0.676006	79	0	87	588.673
0.261799	2.247462	0.191623	19	89	3	588.625
2.617994	1.045978	0.343692	9	2	19	588.559
1.308997	1.869911	2.701025	1	10	77	588.501
-0.523599	1.699788	2.452890	16	90	88	588.304
-1.047198	1.247695	1.809890	78	5	95	588.052
0.261799	2.251330	-2.330739	8	93	19	588.001
2.879793	0.591903	2.010408	11	19	2	587.996
2.879793	0.619654	-2.216909	7	4	20	587.995
1.047198	2.356369	3.005869	20	86	3	587.980
0.000000	0.831641	0.616218	75	3	1	587.849
1.308997	1.948085	-2.363031	15	95	90	587.773
0.261799	0.458961	-0.107937	95	13	17	587.724
1.047198	1.367556	0.358405	11	17	9	587.708
0.000000	2.984978	1.954446	5	20	8	587.422
-1.047198	1.721184	-0.153948	4	5	78	587.378
2.094395	0.914445	2.687814	5	9	18	587.296
-1.570796	1.301460	-0.509251	79	12	88	587.258
-2.094395	1.606104	-0.451151	15	89	87	587.240
2.094395	2.033014	2.977192	9	18	11	587.135
-1.832596	1.014500	0.906702	78	94	0	587.099
0.785398	2.138223	1.678323	12	16	10	587.060
-1.047198	0.379747	-1.713059	2	16	18	587.051
-1.047198	0.850607	-1.335383	84	13	13	587.021
1.832596	0.906588	1.252948	14	16	0	586.974
-2.879793	1.658653	-2.409879	13	10	86	586.941
-1.047198	0.419640	2.974122	80	87	90	586.915
0.000000	2.760637	2.781135	0	13	81	586.895
-2.879793	0.203748	0.590255	5	7	82	586.863
-0.785398	1.440580	2.260026	16	82	94	586.562
-0.261799	2.587733	0.232235	87	10	14	586.398
1.832596	1.948085	-2.363031	94	6	78	586.370
-1.570796	1.440580	2.260026	94	8	78	586.360
-2.356194	0.910508	1.903534	1	13	79	586.325
0.785398	2.174483	2.653697	8	13	12	586.240
-0.785398	1.766067	2.153843	16	94	91	586.152
2.094395	1.218453	2.777284	7	10	18	586.144
-1.047198	1.846342	-1.796954	93	16	11	586.098
1.047198	2.343981	-1.040456	19	91	2	586.088
1.832596	2.637879	2.121598	8	17	12	586.060
0.261799	1.909857	-0.381669	18	92	92	586.023
-1.832596	1.554776	0.100351	1	12	20	586.012
1.308997	1.732874	-0.951685	2	7	77	585.940
-1.047198	2.041297	-2.664597	8	87	17	585.835
-0.261799	1.391910	3.030322	19	89	93	585.805
-0.261799	1.606104	-0.451151	3	10	77	585.797
0.000000	0.864993	2.278281	11	18	8	585.582
-2.356194	1.872854	1.543456	10	11	81	585.525
1.047198	2.180315	-1.357379	75	95	87	585.495
-2.879793	2.174483	2.653697	10	17	7	585.343
-0.523599	2.704512	1.488683	18	6	4	585.317
-0.261799	1.242974	-2.977882	77	2	92	585.273
0.785398	2.704512	1.488683	7	14	82	585.200
2.879793	1.812176	0.656819	11	4	19	585.179
-2.879793	1.870545	-2.976234	91	11	20	585.046
2.879793	2.180315	-1.357379	76	6	89	584.957
2.879793	2.396274	-1.959260	16	10	90	584.912
0.523599	0.674054	1.013609	13	3	83	584.881
-1.832596	1.904882	-1.478089	13	16	4	584.850
-1.308997	1.846342	-1.796954	95	19	9	584.834
2.879793	0.571433	-1.188419	77	8	93	584.811
-1.570796	2.073035	2.027405	13	89	83	584.802
-2.879793	0.618092	2.539118	15	7	14	584.769
-0.523599	1.504028	0.636812	0	4	77	584.705
-0.523599	2.343981	-1.040456	8	3	80	584.636
2.356194	1.696674	-1.253233	16	11	4	584.585
-0.261799	0.618092	2.539118	14	16	5	584.548
1.047198	2.393226	1.857173	12	14	11	584.544
-3.141593	1.134796	2.434290	7	12	80	584.429
0.523599	1.662363	0.915448	6	8	78	584.427
0.000000	1.335669	0.897240	2	95	75	584.390
-2.094395	1.909857	-0.381669	17	90	90	584.334
1.832596	1.135813	-2.658866	2	4	24	584.297
-2.879793	1.367556	0.358405	78	4	3	584.262
-2.094395	1.875281	0.107086	14	92	86	584.085
-0.261799	0.992645	-1.723759	16	8	16	584.047
-2.879793	1.554776	0.100351	13	84	88	584.034
2.879793	2.174483	2.653697	83	13	11	584.020
-2.356194	1.134796	2.434290	10	8	16	584.013
2.356194	1.014500	0.906702	8	17	8	583.982
0.261799	1.325504	-1.671296	18	90	93	583.971
-1.832596	2.396274	-1.959260	8	8	80	583.885
-2.356194	1.168678	2.108595	75	1	1	583.768
0.000000	2.664082	-1.071402	6	12	82	583.739
2.617994	1.440580	2.260026	14	7	85	583.680
0.261799	1.195355	1.200319	79	4	6	583.647
1.832596	0.640596	-2.797608	13	17	2	583.595
2.617994	1.554776	0.100351	8	6	21	583.593
-0.785398	1.247695	1.809890	4	11	82	583.586
2.094395	2.704512	1.488683	77	4	92	583.528
-2.356194	0.419640	2.974122	9	3	20	583.513
1.308997	2.343981	-1.040456	15	14	5	583.435
0.261799	1.413347	-1.339188	93	10	18	583.304
-0.261799	1.662363	0.915448	10	5	82	583.281
0.785398	2.984978	1.954446	15	15	3	583.241
0.261799	2.033014	2.977192	0	9	78	583.145
-2.356194	0.591903	2.010408	13	4	17	583.119
-1.047198	1.870545	-2.976234	6	7	20	583.108
2.617994	0.850607	-1.335383	88	15	12	583.041
-1.832596	0.619654	-2.216909	18	88	6	582.989
2.094395	0.709924	0.218797	5	94	20	582.950
-2.879793	2.033014	2.977192	79	91	86	582.525
-1.832596	1.721184	-0.153948	16	88	88	582.513
-0.261799	0.290380	-0.796960	10	3	18	582.398
-1.832596	0.418037	1.360082	94	15	14	582.384
0.000000	1.184361	0.625864	75	2	2	582.374
-2.617994	1.875281	0.107086	4	11	20	582.345
1.308997	2.881233	-2.582574	11	9	15	582.329
1.832596	2.356369	3.005869	14	17	8	582.287
1.047198	1.128190	-2.288622	17	92	91	582.261
0.261799	1.194549	-0.801900	91	12	18	582.219
2.879793	1.909857	-0.381669	11	10	83	582.218
-0.785398	0.080730	-2.622036	14	4	87	582.196
-0.523599	1.325504	-1.671296	77	8	7	582.099
2.617994	0.379747	-1.713059	9	2	18	582.092
-0.785398	1.025536	1.576859	77	5	95	581.985
-0.261799	2.719179	-1.780644	20	86	0	581.847
2.094395	1.812176	0.656819	12	8	85	581.801
-0.523599	2.115563	0.685730	14	9	89	581.751
-1.308997	1.135834	-1.431087	13	2	19	581.731
-2.879793	2.664082	-1.071402	4	7	19	581.727
2.617994	1.135813	-2.658866	18	84	0	581.672
-2.356194	2.863997	0.549740	94	15	13	581.646
-0.785398	1.741644	-2.695914	5	10	19	581.634
-0.261799	0.906588	1.252948	78	7	5	581.474
-0.261799	0.496451	0.593859	91	13	16	581.364
2.617994	1.909857	-0.381669	10	8	82	581.298
-2.094395	1.413430	2.550734	94	6	76	581.039
-2.617994	1.367556	0.358405	13	91	85	580.959
1.047198	1.135834	-1.431087	13	16	6	580.949
-0.261799	1.545873	-1.877082	12	15	7	580.909
0.261799	2.592629	0.909713	85	9	13	580.630
2.094395	2.760637	2.781135	15	15	6	580.537
1.832596	1.168678	2.108595	5	6	77	580.517
1.832596	0.762244	-0.273349	5	6	20	580.443
2.879793	1.050534	3.042579	79	95	90	580.398
-1.832596	1.335669	0.897240	9	14	83	580.354
-0.261799	1.134497	-1.109631	0	16	15	580.286
-2.356194	0.929350	-2.910676	12	15	10	580.281
1.832596	0.458961	-0.107937	9	15	82	580.280
2.617994	2.404280	-0.174044	3	4	77	580.261
-1.047198	0.080730	-2.622036	14	12	94	580.224
-2.879793	1.721184	-0.153948	8	11	80	580.163
-2.617994	1.736875	3.023612	83	6	17	580.154
-1.832596	0.290380	-0.796960	15	6	89	580.103
1.047198	2.247462	0.191623	79	0	95	580.038
-2.094395	0.379747	-1.713059	14	15	11	580.021
-2.356194	1.836682	-0.676006	17	94	90	579.845
-0.523599	1.736875	3.023612	4	2	22	579.709
-2.356194	2.456751	-1.503343	12	18	4	579.601
-1.047198	2.664082	-1.071402	11	1	81	579.588
0.785398	0.418037	1.360082	93	9	19	579.582
2.879793	0.458961	-0.107937	7	11	83	579.497
0.000000	2.164094	-2.991358	5	2	20	579.468
-2.094395	0.929350	-2.910676	7	94	22	579.437
1.832596	1.977582	0.969896	5	9	79	579.406
-1.832596	1.736875	3.023612	9	12	21	579.381
-2.617994	1.545873	-1.877082	7	7	81	579.327
2.617994	1.904882	-1.478089	16	11	3	579.313
-0.523599	2.579248	-2.364801	0	9	19	579.310
2.356194	0.640596	-2.797608	5	18	8	579.260
2.094395	0.733948	3.021411	11	18	4	579.242
0.000000	0.619654	-2.216909	76	5	0	579.238
-1.570796	0.458961	-0.107937	11	4	19	579.224
0.261799	0.418037	1.360082	78	1	5	579.221
-3.141593	0.961715	0.014085	8	17	8	579.186
2.094395	0.615174	-0.666022	4	8	19	579.171
2.356194	2.396274	-1.959260	17	3	90	579.132
-0.785398	1.504028	0.636812	95	4	76	579.014
-2.094395	0.733948	3.021411	12	13	12	579.002
1.832596	1.606104	-0.451151	16	88	88	578.926
2.094395	2.041297	-2.664597	10	8	20	578.914
2.879793	1.413430	2.550734	6	9	79	578.794
2.879793	1.488617	1.159546	0	11	17	578.780
0.261799	0.615174	-0.666022	7	9	19	578.708
2.617994	2.579248	-2.364801	11	12	16	578.690
-3.141593	2.407836	1.410646	76	3	4	578.660
-2.094395	1.506530	1.988858	76	95	91	578.644
2.617994	2.174483	2.653697	77	8	90	578.613
0.000000	1.699788	2.452890	18	6	8	578.585
0.785398	0.899350	-2.069907	77	92	94	578.581
-1.832596	2.349581	-2.702517	10	79	85	578.576
-2.617994	1.301460	-0.509251	12	90	84	578.461
-0.785398	2.299159	2.264663	4	18	9	578.455
1.047198	1.545873	-1.877082	95	16	14	578.431
-0.523599	1.440580	2.260026	14	90	87	578.415
0.785398	2.187132	-0.479875	78	1	89	578.398
0.000000	1.617114	-1.572037	94	7	19	578.397
-2.879793	2.295480	1.008277	14	15	6	578.279
0.785398	2.033014	2.977192	94	12	78	578.236
-3.141593	0.297065	2.160177	2	14	80	578.201
2.094395	0.458961	-0.107937	7	16	82	578.139
-1.570796	2.393226	1.857173	17	91	87	578.094
-1.308997	0.929350	-2.910676	80	91	87	578.012
0.261799	1.545873	-1.877082	74	2	90	578.008
0.785398	0.914445	2.687814	10	7	20	577.989
0.523599	2.396274	-1.959260	74	0	94	577.909
2.356194	1.391910	3.030322	8	10	17	577.794
0.785398	1.134497	-1.109631	13	14	8	577.706
2.617994	1.367556	0.358405	10	0	20	577.664
-1.047198	1.812176	0.656819	8	8	82	577.578
1.570796	1.998705	2.370472	18	90	0	577.575
-2.617994	2.478122	2.609777	3	10	80	577.569
-1.047198	0.571433	-1.188419	16	12	7	577.566
2.356194	1.128190	-2.288622	17	84	93	577.414
2.879793	1.325504	-1.671296	14	9	85	577.414
-2.879793	2.456751	-1.503343	4	5	19	577.377
1.570796	0.864993	2.278281	8	7	78	577.366
-1.047198	1.555207	1.708892	13	86	87	577.290
2.879793	0.418037	1.360082	4	6	79	577.259
-0.261799	1.325504	-1.671296	76	5	6	577.249
-2.356194	0.685216	-1.712745	15	14	11	577.161
-3.141593	1.696674	-1.253233	93	10	80	577.124
1.308997	1.599406	1.426070	18	0	1	577.078
2.879793	1.510910	-0.740472	92	12	17	576.996
0.261799	1.998705	2.370472	11	13	10	576.994
1.832596	0.379747	-1.713059	94	16	13	576.815
-0.261799	0.910508	1.903534	0	11	81	576.800
2.356194	2.001437	0.381215	17	9	7	576.731
1.047198	0.864993	2.278281	91	11	20	576.672
-2.617994	0.297065	2.160177	94	13	80	576.604
2.356194	0.762244	-0.273349	5	1	20	576.581
1.832596	1.870545	-2.976234	1	13	79	576.547
-1.308997	1.741644	-2.695914	10	1	17	576.546
-3.141593	1.256302	0.062705	76	4	89	576.503
1.570796	2.881233	-2.582574	6	19	8	576.453
2.617994	2.588535	-2.976617	7	21	8	576.414
-2.879793	1.545873	-1.877082	76	2	3	576.398
0.261799	2.041297	-2.664597	8	95	20	576.394
-1.832596	1.417623	-0.202254	80	11	85	576.363
0.261799	1.440580	2.260026	18	9	6	576.343
-0.261799	1.569311	-3.003978	77	1	90	576.320
2.094395	2.456751	-1.503343	12	8	18	576.318
-2.356194	2.180315	-1.357379	76	3	94	576.241
1.570796	1.301460	-0.509251	8	9	80	576.217
1.570796	2.863997	0.549740	78	5	1	576.169
0.785398	2.349581	-2.702517	11	3	17	576.083
-2.617994	1.135834	-1.431087	16	14	9	576.010
-2.617994	1.391910	3.030322	13	12	13	576.005
1.047198	2.984978	1.954446	9	15	11	576.000
-0.523599	1.545873	-1.877082	10	0	20	575.929
-0.261799	2.153910	-1.714959	5	5	20	575.929
-1.308997	1.736875	3.023612	9	5	20	575.915
0.523599	1.214854	-1.966664	4	18	11	575.901
1.047198	1.909857	-0.381669	79	95	86	575.900
2.094395	0.685216	-1.712745	95	19	8	575.863
0.523599	1.554776	0.100351	78	93	4	575.826
-3.141593	2.379497	0.561089	11	16	9	575.817
-1.832596	0.906588	1.252948	2	15	82	575.557
1.570796	1.242974	-2.977882	11	16	88	575.450
1.308997	1.998705	2.370472	18	1	0	575.398
1.570796	2.063651	-2.044600	17	92	94	575.389
0.785398	1.812176	0.656819	3	8	78	575.367
-1.047198	2.407836	1.410646	10	19	5	575.318
-3.141593	1.909857	-0.381669	10	9	81	575.270
2.356194	2.478122	2.609777	76	95	87	575.244
-1.570796	2.863997	0.549740	12	15	5	575.138
1.832596	0.910508	1.903534	8	5	78	575.132
2.356194	2.295480	1.008277	17	89	91	575.096
-0.261799	1.824694	1.850876	83	88	82	575.076
-0.261799	2.174483	2.653697	11	18	95	575.070
2.356194	2.704512	1.488683	78	5	93	575.066
2.879793	0.960688	-0.577532	19	10	7	574.854
-0.261799	1.135813	-2.658866	7	13	16	574.841
-2.879793	2.153910	-1.714959	10	10	82	574.789
-2.356194	1.440580	2.260026	76	1	1	574.672
1.570796	1.875281	0.107086	10	89	82	574.617
0.261799	2.299159	2.264663	94	13	16	574.612
-1.570796	1.134497	-1.109631	11	3	21	574.607
1.832596	2.138223	1.678323	80	92	95	574.603
-1.308997	2.760637	2.781135	76	3	3	574.539
-0.261799	0.685216	-1.712745	15	15	7	574.499
-1.308997	1.554776	0.100351	3	2	77	574.445
2.094395	1.948085	-2.363031	16	10	4	574.421
2.094395	1.721184	-0.153948	13	13	8	574.418
-2.879793	1.195355	1.200319	13	9	83	574.396
2.617994	1.256302	0.062705	12	14	5	574.380
-2.356194	0.762244	-0.273349	2	10	79	574.377
-1.832596	0.733948	3.021411	78	1	3	574.345
-2.094395	0.619654	-2.216909	18	86	7	574.304
1.570796	1.977582	0.969896	9	14	85	574.249
-0.261799	0.929350	-2.910676	10	13	14	574.179
2.879793	1.247695	1.809890	1	10	78	574.163
-1.832596	0.379747	-1.713059	17	89	95	574.158
-0.785398	1.488617	1.159546	77	9	91	574.150
-3.141593	1.374601	-2.456031	74	4	93	574.138
-2.879793	1.450119	-2.739050	75	94	90	574.134
-2.879793	1.836682	-0.676006	12	13	84	573.978
1.832596	1.242974	-2.977882	3	7	23	573.962
-0.785398	1.736875	3.023612	4	2	22	573.927
1.832596	2.455966	-0.641220	15	15	4	573.908
-2.879793	1.135834	-1.431087	18	12	9	573.907
1.832596	1.683268	0.374177	10	0	20	573.801
0.261799	1.128190	-2.288622	14	84	86	573.717
-2.094395	1.413347	-1.339188	79	1	3	573.613
0.000000	0.733948	3.021411	13	14	12	573.604
-2.617994	1.050534	3.042579	15	10	12	573.598
-0.261799	0.961715	0.014085	2	9	20	573.532
-0.785398	1.812176	0.656819	8	7	82	573.510
2.094395	1.982574	-1.115518	19	84	95	573.468
-2.356194	1.014500	0.906702	2	8	78	573.401
2.879793	0.685216	-1.712745	13	13	8	573.345
1.570796	1.440580	2.260026	1	8	76	573.338
-0.785398	2.396274	-1.959260	8	0	19	573.273
-3.141593	1.391910	3.030322	91	8	21	573.240
1.832596	2.579248	-2.364801	20	90	95	573.118
1.047198	1.699788	2.452890	2	8	77	573.016
2.617994	1.325504	-1.671296	17	6	11	572.989
0.000000	2.719179	-1.780644	20	88	0	572.945
-2.094395	1.194549	-0.801900	9	10	82	572.892
-2.617994	0.685216	-1.712745	19	93	92	572.873
-1.308997	1.488617	1.159546	0	14	81	572.828
0.261799	2.456751	-1.503343	76	0	93	572.812
2.879793	0.615174	-0.666022	16	13	6	572.716
1.570796	1.134497	-1.109631	14	8	89	572.689
-3.141593	0.618092	2.539118	93	11	16	572.618
-0.261799	0.458961	-0.107937	5	11	19	572.617
1.832596	1.367556	0.358405	7	94	20	572.565
-2.094395	1.732874	-0.951685	18	93	90	572.564
-2.879793	1.875281	0.107086	4	11	20	572.513
0.785398	1.014500	0.906702	11	5	82	572.502
1.832596	1.301460	-0.509251	19	80	95	572.501
2.356194	2.153910	-1.714959	79	4	3	572.459
-1.832596	1.809167	1.213774	79	91	1	572.454
-0.785398	1.545873	-1.877082	76	4	94	572.430
-2.094395	2.407836	1.410646	20	95	94	572.429
0.785398	1.134796	2.434290	12	10	84	572.333
2.617994	1.134497	-1.109631	18	9	3	572.247
0.523599	1.247695	1.809890	10	18	10	572.243
1.832596	1.247695	1.809890	8	16	13	572.189
0.523599	2.299159	2.264663	10	13	11	572.110
1.047198	0.370812	-2.547742	77	2	1	572.104
2.879793	1.218453	2.777284	81	88	87	572.098
1.832596	1.721184	-0.153948	12	1	19	572.096
2.094395	1.413347	-1.339188	94	10	21	572.072
2.617994	2.001437	0.381215	9	8	19	572.071
1.570796	1.391910	3.030322	16	88	89	571.977
1.308997	1.699788	2.452890	78	0	1	571.933
-2.617994	2.174483	2.653697	93	12	19	571.911
-2.879793	1.741644	-2.695914	75	94	90	571.900
-0.523599	2.187132	-0.479875	9	13	80	571.817
-1.047198	1.450119	-2.739050	11	2	17	571.744
-2.879793	2.984978	1.954446	9	2	19	571.522
1.308997	2.592629	0.909713	15	11	1	571.489
-2.094395	1.545873	-1.877082	77	2	90	571.486
1.570796	1.766067	2.153843	17	91	95	571.441
-2.617994	2.724429	-0.348782	5	19	12	571.258
-0.523599	0.618092	2.539118	17	90	93	571.255
-0.785398	2.247462	0.191623	76	1	94	571.214
-2.094395	0.370812	-2.547742	77	94	0	571.113
-1.308997	1.194549	-0.801900	7	17	12	571.073
1.308997	2.863997	0.549740	78	6	0	571.026
-3.141593	2.108018	1.311430	75	2	2	570.934
2.356194	1.510910	-0.740472	21	83	95	570.929
-1.570796	0.674054	1.013609	0	21	8	570.898
-3.141593	1.836682	-0.676006	13	10	84	570.757
-3.141593	1.732874	-0.951685	7	1	22	570.696
-2.356194	2.396274	-1.959260	10	19	5	570.684
-1.832596	2.138223	1.678323	15	91	85	570.629
0.785398	1.433411	-1.035986	91	11	18	570.625
-1.570796	2.343981	-1.040456	95	15	13	570.595
2.094395	0.864993	2.278281	8	20	6	570.525
1.570796	2.108018	1.311430	79	93	95	570.508
1.047198	2.863997	0.549740	19	90	94	570.477
-1.047198	1.367556	0.358405	3	7	21	570.467
1.308997	0.914445	2.687814	2	3	22	570.439
0.523599	1.569311	-3.003978	1	6	20	570.391
-0.523599	1.869911	2.701025	18	90	90	570.374
1.308997	0.458961	-0.107937	7	90	18	570.344
1.308997	1.335669	0.897240	6	13	14	570.317
-1.308997	1.440580	2.260026	79	95	94	570.304
1.308997	1.417623	-0.202254	8	2	20	570.102
-3.141593	1.218453	2.777284	92	14	14	570.032
0.261799	1.247695	1.809890	77	94	94	570.024
-2.356194	0.080730	-2.622036	13	1	18	570.009
-0.523599	2.247462	0.191623	8	10	81	569.983
0.523599	0.866395	-2.492918	74	1	0	569.852
-2.094395	1.113094	-0.272241	3	8	78	569.823
-1.047198	1.440580	2.260026	79	94	87	569.750
1.308997	1.025536	1.576859	8	8	80	569.733
1.047198	1.875281	0.107086	3	12	78	569.630
2.617994	1.872854	1.543456	77	95	1	569.552
0.523599	0.992645	-1.723759	0	11	20	569.460
1.308997	1.554776	0.100351	9	12	82	569.410
0.785398	2.180315	-1.357379	75	1	87	569.273
2.879793	0.496451	0.593859	20	90	94	569.266
0.000000	0.992645	-1.723759	3	12	20	569.265
0.000000	1.050534	3.042579	13	12	11	569.207
0.000000	2.089241	-0.114193	80	5	11	569.114
-1.832596	0.419640	2.974122	10	90	19	569.112
2.094395	1.045978	0.343692	95	16	82	569.027
-2.094395	2.073035	2.027405	13	15	1	569.021
2.094395	1.135834	-1.431087	9	5	80	568.972
2.617994	1.374601	-2.456031	76	7	1	568.929
-0.785398	0.619654	-2.216909	14	11	8	568.812
2.356194	1.450119	-2.739050	80	10	6	568.757
-1.047198	2.760637	2.781135	76	0	4	568.741
0.000000	0.370812	-2.547742	15	6	86	568.728
2.879793	1.872854	1.543456	77	6	4	568.672
-1.570796	1.135834	-1.431087	9	17	8	568.585
2.094395	1.870545	-2.976234	15	76	2	568.584
0.000000	2.404280	-0.174044	17	85	92	568.584
2.617994	1.617114	-1.572037	5	16	14	568.467
0.000000	1.736875	3.023612	2	2	22	568.453
-1.308997	2.455966	-0.641220	3	17	10	568.449
1.047198	0.929350	-2.910676	19	87	95	568.425
-2.356194	2.404280	-0.174044	13	16	8	568.353
-1.832596	1.875281	0.107086	17	89	92	568.345
-1.308997	2.063651	-2.044600	3	23	6	568.258
2.879793	1.301460	-0.509251	5	7	21	568.200
0.000000	1.846342	-1.796954	19	88	94	568.155
0.261799	1.045978	0.343692	76	1	3	568.034
-1.047198	2.001437	0.381215	7	17	8	568.012
-0.261799	2.089241	-0.114193	79	6	11	568.003
-1.832596	0.866955	-0.931351	78	93	91	567.952
0.261799	1.741644	-2.695914	5	8	18	567.926
-2.617994	2.104282	-0.813972	78	7	5	567.891
2.617994	1.214854	-1.966664	15	5	13	567.773
-2.094395	1.574060	2.783565	95	4	75	567.758
-2.879793	1.574060	2.783565	12	11	14	567.727
1.047198	2.404280	-0.174044	79	1	93	567.695
-2.356194	1.545873	-1.877082	77	4	89	567.615
2.356194	1.134796	2.434290	4	12	17	567.580
1.570796	1.574060	2.783565	14	85	87	567.501
-1.832596	2.153910	-1.714959	1	11	18	567.433
-0.523599	2.588535	-2.976617	4	14	81	567.418
0.785398	1.909857	-0.381669	6	13	80	567.395
0.000000	1.872854	1.543456	77	95	88	567.354
-2.356194	0.615174	-0.666022	18	91	1	567.214
2.617994	2.719179	-1.780644	17	5	12	567.202
-2.094395	1.391910	3.030322	14	10	20	567.139
1.832596	0.418037	1.360082	6	4	80	567.124
-3.141593	1.310100	1.488307	17	11	2	567.105
0.523599	1.875281	0.107086	78	92	4	567.054
-3.141593	2.063651	-2.044600	15	15	9	567.043
-3.141593	1.948085	-2.363031	17	4	90	566.945
-2.356194	2.588535	-2.976617	11	76	88	566.869
-2.879793	1.135813	-2.658866	15	12	10	566.751
-2.879793	1.869911	2.701025	81	8	13	566.736
-2.879793	1.504028	0.636812	17	90	88	566.617
1.308997	2.455966	-0.641220	20	89	5	566.488
2.094395	2.295480	1.008277	18	86	94	566.485
2.356194	2.979456	-1.009304	16	14	4	566.386
-2.879793	1.214854	-1.966664	8	16	11	566.336
2.094395	2.587733	0.232235	18	4	12	566.321
-2.356194	2.108018	1.311430	11	13	83	566.221
0.785398	1.450119	-2.739050	11	14	84	566.187
-2.094395	1.741644	-2.695914	0	1	22	566.166
2.094395	1.977582	0.969896	7	14	14	566.007
-1.570796	0.571433	-1.188419	89	15	13	565.949
-2.356194	2.393226	1.857173	93	13	17	565.942
2.356194	1.184361	0.625864	10	16	6	565.930
1.570796	0.709924	0.218797	7	93	19	565.769
-0.523599	2.456751	-1.503343	6	11	81	565.750
-2.879793	0.297065	2.160177	0	14	80	565.730
2.879793	2.393226	1.857173	79	9	5	565.716
2.617994	2.587733	0.232235	12	8	85	565.714
1.308997	2.108018	1.311430	10	15	85	565.576
2.094395	0.591903	2.010408	94	20	10	565.441
1.308997	2.063651	-2.044600	16	92	91	565.387
-3.141593	2.724429	-0.348782	14	16	6	565.371
0.000000	2.247462	0.191623	18	11	10	565.346
-2.356194	2.704512	1.488683	8	18	4	565.320
0.261799	1.218453	2.777284	15	13	8	565.214
1.832596	2.979456	-1.009304	20	9	4	565.214
0.000000	1.982574	-1.115518	4	13	80	565.127
-2.617994	0.914445	2.687814	12	17	6	565.123
1.308997	1.168678	2.108595	1	5	76	564.989
1.047198	0.290380	-0.796960	92	14	14	564.918
-1.047198	2.299159	2.264663	78	1	4	564.872
0.523599	2.587733	0.232235	16	9	95	564.856
-2.879793	1.809167	1.213774	18	11	4	564.800
2.617994	2.247462	0.191623	3	4	76	564.740
-1.047198	2.984978	1.954446	2	16	12	564.596
0.000000	1.606104	-0.451151	2	10	77	564.577
-0.785398	2.251330	-2.330739	7	1	18	564.563
2.617994	2.863997	0.549740	74	3	95	564.534
-1.832596	1.869911	2.701025	79	91	3	564.532
-3.141593	1.242974	-2.977882	93	6	22	564.471
2.356194	2.108018	1.311430	19	87	95	564.425
2.879793	2.863997	0.549740	10	4	82	564.403
2.094395	1.050534	3.042579	6	8	19	564.148
2.356194	1.909857	-0.381669	13	7	86	564.083
-2.094395	1.448123	-2.163292	95	16	17	564.052
-1.570796	1.982574	-1.115518	15	14	1	564.033
2.879793	2.637879	2.121598	95	9	79	564.013
-0.261799	0.850607	-1.335383	3	17	13	564.002
2.617994	0.370812	-2.547742	93	18	10	563.949
-2.356194	2.041297	-2.664597	7	11	19	563.946
-1.047198	1.242974	-2.977882	14	15	6	563.897
0.523599	1.014500	0.906702	12	12	14	563.890
-2.879793	0.418037	1.360082	3	11	81	563.843
-1.047198	2.979456	-1.009304	15	1	88	563.788
-2.879793	2.115563	0.685730	9	17	10	563.751
1.308997	1.756530	-2.105156	16	95	92	563.692
-1.570796	0.618092	2.539118	94	19	9	563.670
0.523599	0.899350	-2.069907	77	4	0	563.610
0.523599	0.866955	-0.931351	2	4	23	563.514
-1.308997	1.168678	2.108595	5	11	81	563.480
2.879793	2.001437	0.381215	8	9	19	563.413
2.094395	0.866955	-0.931351	92	15	14	563.366
-1.047198	1.683268	0.374177	0	9	76	563.361
-2.879793	1.488617	1.159546	17	12	5	563.361
2.094395	1.128190	-2.288622	4	18	11	563.297
-2.356194	1.413430	2.550734	95	5	75	563.258
1.308997	2.187132	-0.479875	79	93	88	563.247
1.308997	1.982574	-1.115518	15	13	7	563.210
2.094395	2.073035	2.027405	11	17	10	563.140
1.047198	1.335669	0.897240	7	14	14	563.074
0.785398	1.504028	0.636812	4	6	77	563.063
-2.617994	2.404280	-0.174044	10	8	78	563.038
2.094395	2.579248	-2.364801	20	93	0	563.010
1.308997	0.866395	-2.492918	78	1	2	562.822
2.356194	0.571433	-1.188419	91	14	14	562.793
1.832596	0.733948	3.021411	0	9	21	562.762
-1.570796	1.168678	2.108595	5	4	21	562.752
2.094395	1.194549	-0.801900	93	15	14	562.543
-1.308997	1.247695	1.809890	6	3	21	562.523
2.356194	1.904882	-1.478089	17	9	3	562.450
0.523599	1.195355	1.200319	12	5	83	562.447
0.523599	2.104282	-0.813972	78	1	93	562.416
-0.785398	2.356369	3.005869	78	1	5	562.400
2.356194	1.875281	0.107086	6	7	78	562.372
1.308997	2.299159	2.264663	3	18	11	562.344
-1.047198	1.374601	-2.456031	80	91	89	562.268
1.570796	0.866955	-0.931351	15	8	91	562.241
-2.617994	2.456751	-1.503343	13	18	4	562.104
