96	1.2	0
-2.356194	1.554776	0.100351
0.000000	0.000000	0.000000
A6NFU0.A.r_m.pdb	4.657	-16.200	-6.281
2JJS.P.l_m.pdb	37.153	-20.767	20.022
-0.785398	0.615174	-0.666022	0	15	71	1100.732
2.617994	1.506530	1.988858	74	85	95	1070.520
-2.879793	1.510910	-0.740472	91	87	89	1064.143
-0.261799	1.699788	2.452890	11	17	12	1039.055
-1.047198	0.866395	-2.492918	91	3	83	1001.212
1.308997	1.904882	-1.478089	76	8	91	999.444
-2.879793	1.732874	-0.951685	91	87	89	989.180
-0.523599	1.135813	-2.658866	91	4	83	987.399
0.785398	1.391910	3.030322	87	93	90	984.149
2.094395	1.812176	0.656819	80	79	88	983.665
-0.785398	1.606104	-0.451151	6	26	90	978.069
-2.094395	0.960688	-0.577532	9	79	86	974.654
0.000000	1.869911	2.701025	6	17	16	973.907
1.832596	0.906588	1.252948	80	8	75	969.977
-3.141593	1.809167	1.213774	95	69	88	966.904
-1.308997	1.736875	3.023612	5	12	85	965.392
2.356194	0.914445	2.687814	79	7	78	959.044
2.356194	1.812176	0.656819	83	75	88	958.773
1.047198	1.904882	-1.478089	77	12	91	958.232
2.356194	1.658653	-2.409879	75	89	11	956.592
2.356194	1.977582	0.969896	83	76	90	953.208
-0.261799	1.417623	-0.202254	92	25	83	952.127
-0.261799	1.869911	2.701025	9	16	16	944.122
1.570796	2.579248	-2.364801	83	3	95	943.272
0.785398	1.569311	-3.003978	86	3	86	939.950
2.617994	1.812176	0.656819	90	71	85	939.502
-2.879793	2.588535	-2.976617	5	88	24	938.952
1.308997	1.696674	-1.253233	76	8	86	936.441
0.785398	1.982574	-1.115518	80	16	91	936.044
-3.141593	0.458961	-0.107937	87	89	91	935.362
2.617994	2.138223	1.678323	75	85	7	931.576
1.047198	1.696674	-1.253233	77	12	86	928.996
1.308997	2.349581	-2.702517	83	1	94	928.443
2.356194	1.555207	1.708892	72	87	94	928.022
-0.523599	1.417623	-0.202254	0	24	83	927.368
2.094395	1.875281	0.107086	80	78	90	926.001
-1.047198	0.762244	-0.273349	4	13	71	925.304
-2.617994	2.343981	-1.040456	1	79	5	922.518
1.570796	2.704512	1.488683	84	80	90	922.158
-2.617994	1.555207	1.708892	14	85	6	921.406
2.356194	2.295480	1.008277	75	85	5	921.063
1.047198	1.247695	1.809890	88	21	80	917.350
-2.617994	2.579248	-2.364801	9	89	23	916.026
0.000000	1.504028	0.636812	1	6	11	914.643
-2.356194	2.588535	-2.976617	8	88	24	913.220
0.523599	2.984978	1.954446	5	11	22	913.115
1.832596	1.875281	0.107086	78	82	90	913.042
2.617994	1.824694	1.850876	74	84	3	908.057
-1.308997	1.391910	3.030322	0	10	80	907.845
2.356194	2.001437	0.381215	82	75	93	907.638
2.356194	1.870545	-2.976234	76	88	13	906.643
-0.785398	0.960688	-0.577532	2	20	77	906.592
1.047198	1.732874	-0.951685	78	12	86	904.889
-0.261799	2.174483	2.653697	9	13	20	901.627
1.308997	1.510910	-0.740472	77	8	81	900.268
2.617994	2.108018	1.311430	76	83	4	897.622
2.094395	2.001437	0.381215	81	78	92	897.540
-3.141593	1.168678	2.108595	83	77	89	897.182
-1.047198	1.301460	-0.509251	7	24	87	895.918
2.617994	1.872854	1.543456	75	84	2	895.914
1.570796	2.115563	0.685730	12	3	9	894.789
0.523599	0.910508	1.903534	1	23	80	894.475
-1.047198	0.866955	-0.931351	7	20	77	893.633
-2.617994	2.349581	-2.702517	9	85	22	893.149
-2.094395	1.135834	-1.431087	5	19	91	892.805
-2.879793	0.591903	2.010408	95	79	71	892.183
1.832596	1.195355	1.200319	77	7	78	891.843
-2.094395	0.290380	-0.796960	2	81	87	891.193
-2.879793	0.685216	-1.712745	1	3	79	890.585
2.879793	1.599406	1.426070	90	71	84	888.020
2.094395	1.658653	-2.409879	73	91	11	886.979
1.047198	2.349581	-2.702517	84	2	94	886.742
-0.785398	1.135813	-2.658866	91	4	83	886.718
2.094395	0.733948	3.021411	74	90	91	886.224
1.832596	2.089241	-0.114193	83	75	0	885.883
-1.308997	0.379747	-1.713059	1	81	87	885.124
1.047198	1.510910	-0.740472	78	13	81	885.004
1.047198	1.982574	-1.115518	78	12	90	884.665
1.047198	1.417623	-0.202254	80	13	78	884.161
-0.261799	1.301460	-0.509251	92	25	81	884.061
-0.785398	1.417623	-0.202254	4	25	85	882.501
-2.879793	2.719179	-1.780644	6	5	23	881.654
2.356194	2.456751	-1.503343	86	92	94	880.133
0.785398	2.588535	-2.976617	11	13	18	879.947
-2.617994	0.080730	-2.622036	92	15	91	878.891
2.094395	1.050534	3.042579	73	89	95	878.682
1.832596	1.736875	3.023612	74	94	10	878.409
-3.141593	2.588535	-2.976617	4	87	24	877.513
0.523599	1.242974	-2.977882	4	82	81	875.716
2.617994	1.247695	1.809890	75	86	89	874.601
2.879793	1.809167	1.213774	91	70	88	873.930
-1.047198	0.458961	-0.107937	95	11	68	873.246
-0.785398	1.301460	-0.509251	5	25	85	873.156
2.356194	2.108018	1.311430	74	86	4	872.827
-0.785398	0.866955	-0.931351	3	21	77	872.127
2.356194	0.733948	3.021411	75	87	90	871.052
0.261799	1.977582	0.969896	94	28	93	870.186
1.308997	1.732874	-0.951685	76	7	85	867.732
0.261799	0.929350	-2.910676	1	94	78	867.639
1.832596	1.050534	3.042579	72	93	0	867.452
0.000000	1.948085	-2.363031	1	14	86	865.207
-3.141593	2.456751	-1.503343	4	84	25	864.409
2.094395	0.418037	1.360082	92	9	69	864.161
1.570796	0.700570	1.559208	82	11	73	863.791
-0.261799	1.554776	0.100351	93	26	85	862.973
2.617994	1.870545	-2.976234	77	84	12	861.437
0.523599	0.929350	-2.910676	88	95	85	860.993
1.832596	0.290380	-0.796960	93	15	92	860.820
-3.141593	2.187132	-0.479875	86	87	6	860.809
0.000000	2.984978	1.954446	11	18	12	860.580
1.832596	0.418037	1.360082	86	9	70	860.330
0.785398	2.041297	-2.664597	81	16	16	859.570
2.879793	2.180315	-1.357379	91	85	91	859.160
-3.141593	1.732874	-0.951685	88	89	91	858.897
2.617994	1.555207	1.708892	75	84	94	858.787
2.094395	0.866955	-0.931351	91	10	87	858.578
-0.785398	1.256302	0.062705	3	23	81	858.023
-1.047198	1.135813	-2.658866	90	5	83	857.894
-0.261799	0.866955	-0.931351	92	19	73	857.548
1.047198	1.836682	-0.676006	78	12	86	856.458
-0.261799	1.450119	-2.739050	11	23	6	855.555
-1.570796	1.846342	-1.796954	17	7	17	854.947
0.523599	0.419640	2.974122	6	19	72	854.722
-0.523599	1.450119	-2.739050	92	6	82	854.660
2.617994	1.766067	2.153843	74	84	4	854.141
2.094395	0.700570	1.559208	82	5	72	853.872
1.047198	1.367556	0.358405	82	6	74	853.505
-0.523599	1.998705	2.370472	14	12	16	853.107
-1.570796	0.290380	-0.796960	11	15	74	852.882
1.308997	1.448123	-2.163292	2	14	80	852.740
-1.047198	2.456751	-1.503343	87	13	81	851.577
-1.047198	1.870545	-2.976234	6	11	85	851.172
0.785398	0.618092	2.539118	86	91	92	850.350
-1.308997	0.914445	2.687814	18	12	92	849.728
-0.785398	0.762244	-0.273349	1	15	71	848.843
-2.879793	0.379747	-1.713059	0	5	74	848.372
-0.523599	1.948085	-2.363031	13	10	18	847.577
2.356194	1.242974	-2.977882	74	84	3	847.530
0.785398	1.696674	-1.253233	79	16	86	844.427
-2.879793	1.433411	-1.035986	92	87	86	843.712
2.356194	1.599406	1.426070	72	87	92	842.952
2.356194	1.050534	3.042579	74	86	95	842.928
-2.879793	2.579248	-2.364801	8	89	24	842.669
0.523599	2.704512	1.488683	2	17	20	841.221
2.879793	1.812176	0.656819	87	75	89	840.665
2.617994	1.134796	2.434290	76	81	90	839.303
2.617994	1.809167	1.213774	76	83	0	838.960
2.356194	1.135813	-2.658866	74	88	1	838.795
-0.523599	0.615174	-0.666022	94	15	70	838.361
-0.785398	0.866395	-2.492918	91	1	83	837.887
1.832596	0.866955	-0.931351	91	11	87	837.618
2.617994	1.662363	0.915448	87	72	85	837.048
1.570796	1.301460	-0.509251	78	3	76	836.600
1.308997	2.579248	-2.364801	84	3	0	836.499
1.570796	0.929350	-2.910676	72	94	94	836.332
-0.523599	1.766067	2.153843	15	14	12	836.305
2.879793	0.203748	0.590255	8	8	68	836.027
1.047198	1.606104	-0.451151	78	13	82	835.397
-0.523599	2.579248	-2.364801	12	12	91	834.821
-2.879793	0.910508	1.903534	95	72	79	833.838
2.879793	0.618092	2.539118	89	75	78	833.061
2.356194	1.872854	1.543456	72	87	1	832.840
-3.141593	0.864993	2.278281	92	72	81	832.354
-3.141593	2.343981	-1.040456	7	87	23	831.980
-1.047198	1.736875	3.023612	3	11	80	831.790
-1.308997	0.458961	-0.107937	1	10	69	831.737
1.308997	1.617114	-1.572037	75	8	86	831.578
1.308997	1.433411	-1.035986	77	8	81	830.985
2.617994	1.599406	1.426070	75	83	94	830.930
1.308997	0.297065	2.160177	93	14	69	830.892
-0.523599	0.290380	-0.796960	91	13	70	830.367
1.570796	0.906588	1.252948	81	11	75	829.817
-3.141593	1.606104	-0.451151	84	93	8	829.749
-3.141593	2.356369	3.005869	2	84	22	829.558
-2.356194	1.134497	-1.109631	95	83	87	829.395
2.879793	1.662363	0.915448	92	70	85	829.349
0.000000	2.760637	2.781135	86	0	8	829.242
1.308997	0.866955	-0.931351	75	88	89	828.963
-2.094395	2.456751	-1.503343	14	6	19	828.411
-0.261799	1.998705	2.370472	11	14	16	827.797
-3.141593	0.685216	-1.712745	95	3	80	827.725
-0.785398	2.724429	-0.348782	9	18	14	827.223
0.785398	0.910508	1.903534	93	22	80	827.182
2.879793	1.488617	1.159546	91	70	82	827.163
0.261799	2.704512	1.488683	4	17	20	826.702
1.308997	1.870545	-2.976234	75	4	13	826.197
-1.047198	0.290380	-0.796960	94	13	70	825.889
-2.617994	0.899350	-2.069907	2	2	81	825.778
0.523599	1.683268	0.374177	3	6	10	825.569
-2.356194	0.370812	-2.547742	89	15	92	825.535
1.570796	1.809167	1.213774	84	83	82	824.518
1.047198	2.984978	1.954446	2	12	22	824.413
0.785398	2.396274	-1.959260	81	8	20	823.734
0.523599	1.812176	0.656819	2	6	10	823.181
-1.047198	0.899350	-2.069907	15	20	79	822.712
0.785398	2.984978	1.954446	4	12	22	822.617
1.570796	0.418037	1.360082	87	11	70	821.753
-2.879793	0.080730	-2.622036	94	16	92	821.734
-2.094395	0.866955	-0.931351	8	79	85	821.732
-1.308997	1.870545	-2.976234	6	11	86	821.711
2.356194	2.407836	1.410646	92	94	18	820.642
2.356194	0.910508	1.903534	74	91	84	820.527
-2.879793	2.456751	-1.503343	6	85	25	820.430
2.356194	1.766067	2.153843	72	88	4	820.265
0.785398	1.574060	2.783565	86	91	90	820.185
0.785398	1.440580	2.260026	92	25	84	819.678
-2.879793	1.836682	-0.676006	91	87	90	819.615
-0.261799	1.756530	-2.105156	10	15	16	819.591
2.094395	2.592629	0.909713	75	89	9	819.473
0.000000	1.699788	2.452890	7	18	13	819.437
2.879793	0.864993	2.278281	80	82	85	819.215
0.000000	1.977582	0.969896	4	28	95	818.213
1.308997	1.982574	-1.115518	76	7	89	817.677
1.832596	1.310100	1.488307	76	7	81	817.593
2.094395	1.134796	2.434290	79	7	78	817.368
-3.141593	2.108018	1.311430	0	66	94	816.965
2.356194	0.496451	0.593859	88	4	69	816.896
-0.785398	1.998705	2.370472	15	4	17	816.835
-1.047198	0.685216	-1.712745	14	19	78	816.781
1.047198	2.187132	-0.479875	13	11	94	816.531
0.261799	1.809167	1.213774	0	29	93	816.514
1.570796	1.504028	0.636812	74	2	80	816.289
-0.523599	0.960688	-0.577532	95	20	76	816.149
0.523599	1.606104	-0.451151	84	19	82	815.846
-3.141593	0.910508	1.903534	92	77	74	815.787
1.570796	2.404280	-0.174044	73	0	7	815.243
2.617994	0.203748	0.590255	9	8	69	814.805
1.570796	1.025536	1.576859	79	12	77	814.780
-3.141593	1.662363	0.915448	1	69	84	814.363
1.832596	1.948085	-2.363031	94	88	84	814.305
0.000000	0.419640	2.974122	84	91	92	814.169
1.308997	1.242974	-2.977882	71	4	3	814.156
0.785398	1.904882	-1.478089	79	15	91	813.604
2.617994	1.977582	0.969896	85	74	91	813.509
1.570796	1.242974	-2.977882	71	95	3	813.230
0.000000	1.809167	1.213774	5	29	93	812.920
2.617994	0.418037	1.360082	91	9	70	812.788
1.832596	0.929350	-2.910676	72	91	94	812.473
-1.832596	0.866955	-0.931351	10	81	85	812.099
-2.879793	2.724429	-0.348782	12	4	20	812.086
2.094395	0.906588	1.252948	81	1	72	812.036
-0.261799	2.295480	1.008277	8	25	6	811.955
-0.261799	0.571433	-1.188419	91	16	71	811.625
1.308997	1.417623	-0.202254	78	9	78	810.726
0.785398	2.180315	-1.357379	80	15	95	810.608
0.785398	1.134796	2.434290	94	25	84	810.379
2.094395	1.599406	1.426070	70	90	92	809.873
2.094395	1.683268	0.374177	79	79	87	809.378
2.094395	0.080730	-2.622036	90	88	70	809.303
2.356194	2.180315	-1.357379	85	5	89	809.240
0.000000	2.174483	2.653697	6	14	20	808.778
-1.832596	0.458961	-0.107937	2	5	68	808.527
0.000000	0.496451	0.593859	81	10	77	808.096
1.832596	1.433411	-1.035986	90	7	85	807.822
2.617994	2.407836	1.410646	76	85	8	807.627
1.308997	1.135834	-1.431087	72	90	94	807.500
-3.141593	2.719179	-1.780644	4	1	26	807.201
0.785398	1.510910	-0.740472	80	17	81	806.422
-2.094395	0.866395	-2.492918	6	8	83	806.219
1.047198	1.413347	-1.339188	77	13	82	805.985
1.308997	1.335669	0.897240	76	8	77	805.282
0.000000	2.073035	2.027405	5	22	16	804.740
0.785398	1.606104	-0.451151	80	17	82	804.488
-2.617994	0.418037	1.360082	95	85	69	803.857
-0.261799	1.721184	-0.153948	93	27	88	803.742
1.570796	1.374601	-2.456031	16	10	16	803.600
-1.047198	1.574060	2.783565	20	10	11	803.300
1.308997	1.413347	-1.339188	90	10	83	803.286
-2.094395	0.370812	-2.547742	3	8	75	803.144
1.832596	1.569311	-3.003978	73	93	8	802.945
1.832596	2.295480	1.008277	92	5	14	802.685
1.570796	2.247462	0.191623	71	1	4	802.627
1.308997	2.153910	-1.714959	78	8	95	802.479
-1.308997	2.153910	-1.714959	87	15	85	802.355
0.261799	2.033014	2.977192	3	16	19	802.314
1.047198	1.301460	-0.509251	79	13	77	801.864
2.617994	1.168678	2.108595	83	91	74	801.411
0.261799	1.135834	-1.431087	14	10	86	801.401
-1.308997	0.864993	2.278281	18	11	91	801.039
-0.523599	1.301460	-0.509251	0	24	81	800.554
1.832596	1.194549	-0.801900	80	95	75	800.128
-3.141593	1.417623	-0.202254	85	92	8	800.081
-0.523599	0.866955	-0.931351	0	23	77	799.941
1.047198	1.433411	-1.035986	77	12	81	799.328
1.047198	1.050534	3.042579	0	82	91	798.906
-0.261799	1.135813	-2.658866	11	24	1	798.312
1.570796	1.433411	-1.035986	77	3	81	798.066
-1.832596	0.290380	-0.796960	13	14	74	797.900
0.785398	1.555207	1.708892	90	21	79	797.835
-2.356194	0.418037	1.360082	1	84	69	797.774
1.308997	2.115563	0.685730	12	0	9	797.677
2.356194	2.393226	1.857173	11	18	91	797.662
-2.617994	1.741644	-2.695914	0	8	19	797.459
1.047198	1.617114	-1.572037	77	12	86	797.434
0.785398	0.419640	2.974122	4	19	73	797.240
1.047198	1.391910	3.030322	0	83	86	797.091
-3.141593	0.370812	-2.547742	90	76	80	796.960
2.094395	1.809167	1.213774	70	89	0	796.869
1.047198	0.864993	2.278281	91	21	78	796.819
-3.141593	2.579248	-2.364801	7	89	24	796.701
0.785398	0.674054	1.013609	95	12	67	796.607
-3.141593	1.025536	1.576859	93	76	74	796.479
2.879793	1.413430	2.550734	78	78	95	795.918
-3.141593	0.571433	-1.188419	94	3	75	795.617
1.308997	1.134497	-1.109631	73	89	93	795.469
1.308997	2.724429	-0.348782	77	2	18	794.653
1.047198	1.256302	0.062705	81	13	75	794.623
0.785398	1.554776	0.100351	83	19	81	794.483
-0.785398	1.194549	-0.801900	5	25	83	794.244
-0.261799	0.080730	-2.622036	8	7	23	793.878
-0.523599	2.251330	-2.330739	3	12	87	793.623
1.047198	2.637879	2.121598	94	14	21	792.793
2.356194	1.310100	1.488307	72	88	89	792.719
2.356194	2.396274	-1.959260	92	84	93	792.678
-1.570796	2.664082	-1.071402	13	13	17	792.472
2.094395	0.674054	1.013609	84	5	71	792.289
2.617994	1.310100	1.488307	75	85	89	792.237
0.261799	0.906588	1.252948	2	16	69	792.211
1.308997	1.504028	0.636812	82	5	74	792.171
0.523599	2.251330	-2.330739	83	12	19	792.014
-0.785398	0.203748	0.590255	81	7	76	791.677
-0.261799	2.187132	-0.479875	7	25	1	791.586
-2.617994	2.396274	-1.959260	8	95	24	791.320
-2.879793	1.168678	2.108595	95	69	83	791.252
1.047198	1.134497	-1.109631	73	93	92	791.083
-3.141593	2.760637	2.781135	2	89	25	790.983
-3.141593	2.396274	-1.959260	6	78	93	790.910
-0.785398	0.290380	-0.796960	93	13	70	790.724
2.356194	0.203748	0.590255	85	91	89	790.498
2.094395	2.407836	1.410646	91	0	18	790.477
1.047198	1.555207	1.708892	87	19	78	790.079
-1.308997	1.574060	2.783565	2	13	82	790.064
-0.523599	2.115563	0.685730	10	24	88	789.848
1.308997	1.301460	-0.509251	80	84	83	789.827
-2.879793	2.349581	-2.702517	7	85	22	789.513
-1.047198	1.135834	-1.431087	20	21	87	789.338
0.785398	2.455966	-0.641220	76	2	15	789.132
1.047198	0.297065	2.160177	85	93	90	789.092
2.356194	0.866955	-0.931351	90	9	86	788.940
0.523599	0.906588	1.252948	95	16	69	788.095
0.261799	2.063651	-2.044600	86	18	94	788.005
1.832596	1.218453	2.777284	71	93	2	787.895
-0.785398	1.569311	-3.003978	15	16	12	787.415
2.356194	1.506530	1.988858	71	88	94	787.222
-0.523599	2.174483	2.653697	11	6	21	787.187
0.261799	0.619654	-2.216909	5	23	81	787.111
0.261799	2.760637	2.781135	86	0	8	786.963
-0.261799	0.762244	-0.273349	92	14	70	786.776
-0.785398	2.247462	0.191623	15	23	5	786.475
0.785398	1.218453	2.777284	77	13	2	786.185
2.879793	1.658653	-2.409879	76	95	9	785.784
-0.261799	0.960688	-0.577532	91	22	76	785.496
2.356194	1.809167	1.213774	73	86	0	785.432
-1.308997	2.979456	-1.009304	6	13	21	785.235
1.047198	2.164094	-2.991358	87	89	1	785.214
-1.308997	1.756530	-2.105156	17	10	16	784.981
1.308997	1.014500	0.906702	88	11	71	784.948
2.094395	1.440580	2.260026	76	3	79	784.274
-3.141593	2.138223	1.678323	6	91	12	784.183
-2.356194	2.579248	-2.364801	10	90	24	783.744
-2.617994	2.456751	-1.503343	10	2	22	782.968
0.523599	1.218453	2.777284	1	27	88	782.815
-0.523599	1.510910	-0.740472	2	28	89	782.725
0.785398	1.014500	0.906702	91	14	70	782.549
-0.785398	2.349581	-2.702517	12	12	88	782.521
0.261799	1.135813	-2.658866	9	25	0	782.356
0.785398	1.488617	1.159546	91	22	80	782.307
-1.570796	1.025536	1.576859	94	10	14	781.719
-1.047198	0.961715	0.014085	4	21	79	781.595
-3.141593	2.349581	-2.702517	6	86	22	781.556
1.047198	1.135834	-1.431087	72	94	94	781.470
2.879793	0.418037	1.360082	86	3	70	781.386
0.785398	1.417623	-0.202254	82	17	79	781.291
1.570796	1.510910	-0.740472	76	84	89	780.687
-0.785398	1.741644	-2.695914	5	11	84	780.671
-1.570796	1.904882	-1.478089	17	8	17	780.628
0.523599	1.050534	3.042579	7	25	89	780.533
-2.879793	0.762244	-0.273349	89	88	93	780.173
1.832596	0.700570	1.559208	81	8	72	779.870
-2.356194	2.456751	-1.503343	10	5	21	779.820
1.308997	2.881233	-2.582574	85	94	8	779.797
-0.261799	1.504028	0.636812	11	25	81	779.529
2.617994	0.496451	0.593859	88	86	4	779.197
-1.308997	0.685216	-1.712745	15	17	77	778.985
1.570796	1.732874	-0.951685	76	83	94	778.980
2.879793	1.872854	1.543456	89	71	89	778.797
-1.308997	0.762244	-0.273349	87	87	87	778.629
0.000000	2.704512	1.488683	75	0	91	778.321
1.308997	1.135813	-2.658866	71	2	1	778.298
0.523599	2.299159	2.264663	94	20	20	777.900
1.047198	2.396274	-1.959260	80	7	20	777.776
-1.047198	0.379747	-1.713059	12	17	75	777.641
0.261799	1.367556	0.358405	84	20	79	777.397
0.000000	2.587733	0.232235	3	20	18	777.313
2.356194	2.637879	2.121598	92	90	24	777.271
2.879793	1.168678	2.108595	79	79	89	777.183
2.356194	0.419640	2.974122	87	85	71	777.175
-2.356194	2.881233	-2.582574	6	93	25	777.148
0.261799	1.554776	0.100351	84	20	82	776.868
0.523599	1.014500	0.906702	93	16	70	776.645
-2.879793	2.187132	-0.479875	88	87	6	776.482
-0.261799	1.448123	-2.163292	11	20	11	776.453
0.261799	2.180315	-1.357379	7	13	91	776.227
0.000000	1.998705	2.370472	7	16	17	775.728
1.570796	1.194549	-0.801900	95	12	88	775.140
1.570796	0.866955	-0.931351	5	15	90	775.119
-1.047198	1.195355	1.200319	95	11	11	774.714
1.047198	1.756530	-2.105156	90	12	84	774.640
1.308997	1.836682	-0.676006	72	90	2	774.309
-1.047198	0.910508	1.903534	17	13	91	774.278
2.356194	0.370812	-2.547742	84	80	81	774.037
1.047198	2.881233	-2.582574	13	8	19	773.942
-0.785398	0.370812	-2.547742	9	18	75	773.864
-0.785398	2.592629	0.909713	13	20	10	773.632
-2.879793	2.104282	-0.813972	88	86	5	773.597
-0.785398	1.869911	2.701025	15	6	17	773.288
0.785398	0.297065	2.160177	85	95	88	772.738
-3.141593	1.977582	0.969896	1	68	89	772.605
1.570796	2.863997	0.549740	76	2	17	772.456
-1.047198	1.256302	0.062705	7	22	81	772.132
1.832596	1.134796	2.434290	79	11	78	772.102
-3.141593	1.440580	2.260026	82	75	94	772.000
2.617994	1.440580	2.260026	81	89	78	771.940
1.308997	1.756530	-2.105156	1	14	80	771.864
0.785398	2.637879	2.121598	0	15	21	771.781
2.094395	1.374601	-2.456031	72	90	6	771.720
-2.879793	0.458961	-0.107937	12	3	69	771.521
-0.261799	1.113094	-0.272241	92	23	78	771.504
0.785398	2.251330	-2.330739	81	12	19	771.452
0.000000	2.033014	2.977192	10	19	15	771.405
2.617994	2.393226	1.857173	79	84	17	771.326
1.832596	1.242974	-2.977882	71	91	2	771.096
1.047198	0.850607	-1.335383	81	95	75	770.970
-0.261799	0.929350	-2.910676	90	3	83	770.828
2.356194	1.134796	2.434290	80	94	75	770.335
-1.832596	2.881233	-2.582574	6	94	26	770.240
-3.141593	0.379747	-1.713059	90	14	90	770.128
1.308997	0.571433	-1.188419	84	87	73	769.814
-0.261799	1.606104	-0.451151	92	27	87	769.657
-0.785398	1.574060	2.783565	17	13	11	769.561
0.523599	1.134796	2.434290	1	26	86	769.431
0.785398	1.721184	-0.153948	81	18	83	769.224
1.832596	0.914445	2.687814	73	94	92	769.204
2.879793	2.404280	-0.174044	5	87	75	769.130
2.879793	0.910508	1.903534	91	72	76	769.058
1.308997	2.187132	-0.479875	71	3	10	768.846
-1.570796	1.741644	-2.695914	2	8	79	768.795
-2.617994	0.615174	-0.666022	88	90	90	768.456
1.047198	2.588535	-2.976617	81	8	94	768.422
2.094395	2.295480	1.008277	93	1	14	768.312
2.094395	1.948085	-2.363031	84	83	21	768.178
1.047198	1.569311	-3.003978	73	7	8	768.080
1.832596	1.113094	-0.272241	81	0	73	768.067
2.094395	1.977582	0.969896	74	87	11	767.955
0.785398	1.736875	3.023612	86	93	90	767.264
1.047198	1.870545	-2.976234	75	7	13	767.210
0.261799	1.168678	2.108595	4	27	86	766.950
0.785398	0.960688	-0.577532	82	3	74	766.943
-2.879793	2.356369	3.005869	4	84	22	766.555
2.879793	2.138223	1.678323	1	93	13	766.493
2.879793	1.134796	2.434290	79	79	90	766.350
-2.617994	0.685216	-1.712745	2	2	76	765.902
-0.523599	1.741644	-2.695914	4	12	84	765.658
1.570796	1.135834	-1.431087	83	78	89	765.630
-2.617994	2.719179	-1.780644	6	7	23	765.431
2.617994	1.488617	1.159546	76	83	91	765.325
-1.570796	0.700570	1.559208	95	18	10	765.052
-1.047198	1.904882	-1.478089	86	12	85	765.017
2.356194	0.418037	1.360082	92	8	69	764.932
0.523599	0.640596	-2.797608	3	23	78	764.917
1.570796	1.756530	-2.105156	95	14	80	764.878
0.523599	2.579248	-2.364801	86	8	22	764.433
0.000000	0.960688	-0.577532	88	21	76	764.414
-2.094395	0.458961	-0.107937	12	12	74	764.381
0.000000	1.766067	2.153843	8	18	12	764.374
-2.094395	0.640596	-2.797608	6	8	82	764.288
-0.261799	1.194549	-0.801900	91	24	80	764.249
2.879793	0.370812	-2.547742	87	78	80	764.009
2.617994	1.413430	2.550734	74	83	1	763.878
-0.523599	2.001437	0.381215	7	24	87	763.461
-0.261799	1.510910	-0.740472	92	26	85	763.219
0.523599	0.866395	-2.492918	0	25	81	763.115
0.261799	2.456751	-1.503343	8	11	86	762.923
1.308997	1.195355	1.200319	87	14	75	762.843
1.047198	1.335669	0.897240	85	9	73	762.408
-3.141593	1.247695	1.809890	92	71	81	762.098
-1.832596	0.960688	-0.577532	9	81	86	762.095
-0.523599	0.640596	-2.797608	90	6	83	761.655
-2.879793	0.864993	2.278281	86	80	79	761.621
2.617994	2.881233	-2.582574	3	7	23	761.544
-0.523599	1.869911	2.701025	13	13	15	761.534
2.094395	1.195355	1.200319	78	0	76	761.011
1.570796	1.113094	-0.272241	80	4	73	761.008
-3.141593	0.591903	2.010408	91	76	76	760.605
-2.879793	2.108018	1.311430	3	67	93	760.557
1.832596	2.393226	1.857173	85	82	85	760.284
1.047198	1.812176	0.656819	12	95	10	760.226
0.000000	2.108018	1.311430	5	28	0	760.029
2.617994	1.545873	-1.877082	87	18	84	759.798
0.523599	1.766067	2.153843	0	23	83	759.701
1.570796	1.488617	1.159546	75	4	79	759.431
1.832596	1.683268	0.374177	78	84	85	759.153
-1.832596	2.153910	-1.714959	15	5	21	758.871
0.523599	2.041297	-2.664597	1	11	77	758.867
-0.523599	2.247462	0.191623	11	25	5	758.864
-1.570796	2.063651	-2.044600	10	9	20	758.265
0.523599	1.367556	0.358405	81	18	79	758.169
2.617994	0.910508	1.903534	76	89	83	757.874
1.832596	0.674054	1.013609	84	8	71	757.646
0.261799	1.014500	0.906702	0	16	70	757.645
2.879793	0.640596	-2.797608	85	75	87	757.614
-0.785398	2.588535	-2.976617	12	13	83	757.236
-2.356194	0.910508	1.903534	9	71	77	757.017
-2.356194	0.290380	-0.796960	88	91	90	756.961
-1.570796	0.458961	-0.107937	2	5	67	756.751
-0.785398	0.379747	-1.713059	10	19	76	756.610
-1.832596	2.456751	-1.503343	15	9	18	756.591
0.523599	2.404280	-0.174044	94	21	8	756.570
-3.141593	2.979456	-1.009304	13	13	15	756.454
2.879793	1.242974	-2.977882	76	83	0	756.447
1.570796	1.617114	-1.572037	89	8	85	755.685
1.570796	2.456751	-1.503343	12	6	18	755.659
0.000000	1.113094	-0.272241	90	17	73	755.529
-2.879793	2.760637	2.781135	3	88	25	755.084
-2.094395	2.664082	-1.071402	11	8	22	754.952
-0.785398	0.619654	-2.216909	6	92	76	754.865
-2.617994	0.700570	1.559208	2	79	71	754.676
2.094395	1.488617	1.159546	70	90	90	754.659
-3.141593	1.836682	-0.676006	86	85	4	754.540
-0.523599	1.194549	-0.801900	1	27	84	754.250
2.094395	0.914445	2.687814	80	10	77	754.163
1.570796	0.640596	-2.797608	74	94	90	754.129
-0.785398	1.510910	-0.740472	4	27	90	753.897
2.356194	0.700570	1.559208	82	3	72	753.833
2.094395	0.419640	2.974122	77	94	77	753.819
0.523599	1.904882	-1.478089	82	19	91	753.773
-2.617994	0.910508	1.903534	5	71	76	753.417
0.000000	2.719179	-1.780644	13	12	93	753.045
0.000000	1.195355	1.200319	5	20	73	752.975
0.785398	1.242974	-2.977882	81	22	81	752.789
1.832596	2.396274	-1.959260	88	84	0	752.572
0.523599	0.700570	1.559208	2	16	69	752.308
-2.617994	2.588535	-2.976617	6	87	24	752.034
1.308997	0.960688	-0.577532	76	86	87	752.021
1.308997	1.025536	1.576859	88	16	75	751.958
1.570796	1.050534	3.042579	72	95	0	751.864
-2.617994	0.379747	-1.713059	1	6	74	751.778
0.000000	2.863997	0.549740	4	16	21	751.461
0.261799	1.504028	0.636812	1	5	11	751.294
-1.308997	1.050534	3.042579	94	9	80	751.219
2.356194	1.218453	2.777284	71	90	92	750.621
-3.141593	0.618092	2.539118	86	79	78	750.615
2.094395	0.370812	-2.547742	89	79	74	750.588
1.832596	1.606104	-0.451151	87	74	86	750.587
-0.261799	1.741644	-2.695914	3	13	84	750.525
1.832596	1.301460	-0.509251	79	95	76	750.487
0.785398	0.992645	-1.723759	74	2	94	750.377
1.832596	1.134497	-1.109631	93	12	87	750.266
0.000000	0.080730	-2.622036	8	17	73	750.127
-0.261799	1.367556	0.358405	95	95	17	749.864
2.094395	2.063651	-2.044600	94	88	85	749.823
2.617994	2.456751	-1.503343	86	92	94	749.805
2.094395	0.709924	0.218797	8	17	93	749.805
2.617994	0.618092	2.539118	87	82	73	749.643
-2.879793	2.001437	0.381215	83	8	5	749.642
-2.356194	0.615174	-0.666022	14	2	69	749.307
-2.356194	0.866395	-2.492918	6	7	83	749.138
-0.523599	2.041297	-2.664597	10	0	22	749.029
-1.570796	0.674054	1.013609	3	5	68	748.702
1.832596	2.592629	0.909713	74	92	9	748.507
2.356194	1.488617	1.159546	73	86	90	748.386
1.832596	0.733948	3.021411	81	14	79	748.276
1.047198	0.418037	1.360082	11	7	70	747.838
-0.785398	0.571433	-1.188419	3	20	74	747.784
1.570796	0.960688	-0.577532	13	14	0	747.762
-1.570796	1.045978	0.343692	13	10	71	747.660
0.261799	2.592629	0.909713	2	20	18	747.328
-0.523599	0.906588	1.252948	9	15	0	747.148
-2.356194	2.455966	-0.641220	12	88	23	746.957
-3.141593	1.696674	-1.253233	91	89	86	746.873
1.570796	1.335669	0.897240	75	3	77	746.824
0.785398	1.732874	-0.951685	79	17	86	746.715
1.570796	1.184361	0.625864	86	8	72	746.606
0.000000	1.168678	2.108595	8	26	85	746.348
-0.785398	1.335669	0.897240	17	17	76	746.261
0.523599	2.379497	0.561089	92	22	16	746.215
0.261799	1.998705	2.370472	1	23	16	746.212
1.308997	1.050534	3.042579	73	3	0	746.075
-0.261799	0.866395	-2.492918	92	6	82	745.982
1.308997	0.992645	-1.723759	73	0	7	745.915
2.094395	0.290380	-0.796960	93	15	92	745.570
2.094395	2.637879	2.121598	83	81	88	745.540
1.047198	1.310100	1.488307	88	17	75	745.516
-3.141593	1.218453	2.777284	82	79	86	745.399
2.356194	0.080730	-2.622036	93	81	72	745.369
2.879793	2.719179	-1.780644	3	0	27	745.337
2.617994	0.700570	1.559208	78	87	80	745.297
-0.523599	0.080730	-2.622036	94	10	68	745.058
1.308997	2.379497	0.561089	72	0	6	744.863
0.000000	2.138223	1.678323	5	22	16	744.810
-2.879793	1.301460	-0.509251	4	75	81	744.752
1.308997	1.310100	1.488307	86	15	75	744.668
1.308997	0.910508	1.903534	88	18	77	744.622
2.617994	1.195355	1.200319	76	85	86	744.574
2.617994	0.419640	2.974122	88	83	72	744.422
-3.141593	1.982574	-1.115518	88	88	93	744.310
-3.141593	0.203748	0.590255	91	4	67	744.281
2.094395	2.153910	-1.714959	84	3	91	744.041
2.879793	1.977582	0.969896	92	70	89	743.982
-1.047198	1.417623	-0.202254	7	24	86	743.793
-1.308997	2.863997	0.549740	8	17	75	743.787
0.261799	0.733948	3.021411	2	78	85	743.710
1.570796	1.417623	-0.202254	85	78	82	743.431
2.356194	1.662363	0.915448	83	76	85	743.415
-0.523599	0.571433	-1.188419	94	17	71	743.277
-3.141593	2.455966	-0.641220	95	75	5	743.213
1.047198	1.554776	0.100351	80	15	81	743.116
2.094395	2.247462	0.191623	73	93	5	742.944
0.523599	0.685216	-1.712745	78	11	80	742.744
-3.141593	1.872854	1.543456	93	69	90	742.717
-2.879793	0.914445	2.687814	93	78	75	742.594
-1.570796	1.756530	-2.105156	18	6	16	742.497
-0.523599	1.870545	-2.976234	3	13	83	742.492
-2.356194	1.658653	-2.409879	13	3	86	742.271
-0.785398	1.736875	3.023612	15	14	15	742.196
2.617994	0.080730	-2.622036	79	3	78	742.175
-0.261799	2.455966	-0.641220	6	22	8	741.986
0.785398	1.413347	-1.339188	73	7	90	741.816
1.832596	1.617114	-1.572037	94	14	84	741.742
1.308997	2.001437	0.381215	14	4	8	741.548
0.261799	2.356369	3.005869	7	16	19	741.345
1.308997	1.569311	-3.003978	72	4	8	741.219
1.832596	2.379497	0.561089	13	7	6	740.787
1.047198	1.846342	-1.796954	90	12	86	740.665
-1.047198	0.619654	-2.216909	91	2	83	740.604
1.308997	2.455966	-0.641220	74	2	15	740.484
-0.523599	1.256302	0.062705	95	23	80	740.250
1.308997	1.545873	-1.877082	89	10	84	740.200
-1.047198	1.413347	-1.339188	21	22	90	740.132
-3.141593	2.104282	-0.813972	88	87	0	740.027
-1.832596	0.831641	0.616218	10	6	68	739.988
-0.523599	1.812176	0.656819	9	23	82	739.760
-2.617994	0.960688	-0.577532	93	80	1	739.616
1.832596	1.812176	0.656819	75	92	85	739.318
-2.879793	0.297065	2.160177	93	84	70	739.181
0.785398	0.733948	3.021411	0	22	77	739.099
0.000000	2.187132	-0.479875	3	25	1	739.081
1.832596	1.135834	-1.431087	94	14	85	738.986
-1.308997	0.910508	1.903534	83	75	93	738.978
-2.617994	2.664082	-1.071402	8	89	26	738.826
-2.879793	2.664082	-1.071402	7	95	25	738.617
-0.523599	1.699788	2.452890	14	15	13	738.611
-1.047198	2.587733	0.232235	73	0	2	738.040
0.523599	0.290380	-0.796960	91	86	72	738.012
2.617994	0.709924	0.218797	84	94	7	738.007
-2.094395	2.579248	-2.364801	10	91	24	737.878
2.879793	0.709924	0.218797	87	88	5	737.750
-1.832596	0.571433	-1.188419	15	12	75	736.934
1.047198	0.700570	1.559208	82	19	77	736.933
-0.261799	1.413430	2.550734	11	26	3	736.931
-0.261799	0.615174	-0.666022	91	15	70	736.882
1.570796	2.001437	0.381215	71	94	92	736.607
2.094395	1.662363	0.915448	74	87	6	736.586
2.617994	1.391910	3.030322	75	82	3	736.418
-2.617994	2.115563	0.685730	89	87	82	736.381
0.000000	0.571433	-1.188419	88	16	71	736.256
1.047198	1.374601	-2.456031	80	92	89	736.217
-0.785398	2.164094	-2.991358	9	0	23	736.142
-2.617994	1.732874	-0.951685	5	77	91	735.983
0.261799	1.195355	1.200319	1	20	73	735.907
1.832596	1.504028	0.636812	75	93	80	735.860
-1.832596	2.592629	0.909713	95	89	15	735.716
0.523599	2.592629	0.909713	94	19	19	735.528
-0.523599	0.866395	-2.492918	1	2	78	735.374
1.047198	2.404280	-0.174044	74	1	13	735.360
2.094395	2.115563	0.685730	74	87	13	735.322
0.523599	2.174483	2.653697	94	20	19	735.166
-2.617994	0.496451	0.593859	8	10	70	734.974
-0.261799	1.683268	0.374177	95	93	16	734.862
-0.523599	1.721184	-0.153948	14	25	88	734.859
1.308997	1.367556	0.358405	84	85	78	734.832
1.308997	0.850607	-1.335383	81	88	76	734.717
1.570796	0.850607	-1.335383	81	80	86	734.614
2.094395	2.456751	-1.503343	85	4	89	734.181
0.523599	1.824694	1.850876	80	16	8	734.110
-2.356194	0.297065	2.160177	81	4	75	734.006
-2.356194	1.433411	-1.035986	7	78	88	733.984
0.000000	1.335669	0.897240	5	21	75	733.942
0.523599	0.914445	2.687814	8	24	85	733.746
2.094395	1.450119	-2.739050	70	91	5	733.280
-2.094395	2.115563	0.685730	24	74	2	733.262
-0.261799	2.041297	-2.664597	10	4	21	733.222
1.570796	0.297065	2.160177	92	13	69	733.138
0.000000	1.025536	1.576859	10	15	73	733.041
-1.832596	1.014500	0.906702	11	4	69	732.889
1.047198	2.033014	2.977192	84	94	90	732.783
2.617994	0.914445	2.687814	79	3	78	732.634
1.570796	1.014500	0.906702	88	10	72	732.455
-1.832596	0.929350	-2.910676	7	9	83	732.440
1.832596	0.831641	0.616218	90	7	70	732.352
0.261799	2.664082	-1.071402	95	18	4	732.340
2.356194	1.374601	-2.456031	74	87	6	732.273
2.879793	0.458961	-0.107937	9	1	68	732.261
-1.570796	2.478122	2.609777	10	15	83	732.227
0.785398	2.379497	0.561089	90	20	16	732.111
0.000000	1.242974	-2.977882	9	26	0	731.941
1.832596	1.870545	-2.976234	74	93	13	731.606
0.523599	2.104282	-0.813972	83	20	92	731.496
1.308997	2.251330	-2.330739	75	0	8	731.440
-0.261799	2.587733	0.232235	6	20	18	731.328
-0.261799	1.948085	-2.363031	3	13	87	731.219
2.094395	1.218453	2.777284	72	89	2	731.183
-0.261799	1.440580	2.260026	12	18	8	730.894
1.570796	2.295480	1.008277	12	1	7	730.804
-1.570796	2.343981	-1.040456	17	13	15	730.734
0.261799	2.455966	-0.641220	83	11	20	730.731
0.000000	1.488617	1.159546	5	28	88	730.721
2.094395	2.089241	-0.114193	81	78	94	730.660
2.879793	2.478122	2.609777	95	85	23	730.571
-2.356194	2.664082	-1.071402	11	7	20	730.471
2.879793	0.914445	2.687814	88	72	83	730.395
-2.094395	1.194549	-0.801900	7	81	86	730.369
-2.617994	1.050534	3.042579	94	12	18	730.270
-1.832596	1.658653	-2.409879	71	92	5	730.221
2.356194	1.736875	3.023612	73	85	9	730.092
-1.047198	0.615174	-0.666022	2	14	71	730.064
2.094395	0.864993	2.278281	83	8	74	730.055
-0.261799	0.850607	-1.335383	92	20	74	730.000
0.000000	1.417623	-0.202254	92	24	79	729.408
-3.141593	1.488617	1.159546	0	69	81	729.407
1.832596	2.247462	0.191623	72	94	4	729.137
-1.570796	2.979456	-1.009304	7	11	22	729.090
0.261799	0.674054	1.013609	89	1	71	729.085
0.261799	2.587733	0.232235	4	21	9	728.770
1.047198	1.683268	0.374177	9	1	14	728.751
1.047198	0.674054	1.013609	93	11	67	728.562
-2.617994	0.203748	0.590255	94	11	70	728.391
-2.617994	1.433411	-1.035986	14	17	87	727.897
0.785398	0.864993	2.278281	95	23	80	727.859
1.832596	1.846342	-1.796954	93	14	82	727.751
0.261799	2.299159	2.264663	2	20	20	727.738
-1.570796	0.379747	-1.713059	93	82	88	727.711
2.094395	1.242974	-2.977882	72	88	3	727.652
2.094395	0.910508	1.903534	83	7	73	727.651
0.523599	2.356369	3.005869	7	17	18	727.421
-2.094395	2.719179	-1.780644	10	9	20	727.351
0.785398	1.683268	0.374177	9	94	14	727.293
-0.261799	1.135834	-1.431087	93	22	78	727.219
-1.047198	1.113094	-0.272241	6	24	83	727.184
0.261799	0.419640	2.974122	86	90	92	726.357
0.785398	0.591903	2.010408	94	18	70	726.266
-2.356194	0.762244	-0.273349	14	95	69	726.226
0.261799	1.683268	0.374177	2	6	11	726.104
-3.141593	1.875281	0.107086	84	9	5	726.061
2.356194	2.115563	0.685730	83	76	93	725.695
0.261799	1.506530	1.988858	2	29	90	725.508
1.047198	1.736875	3.023612	75	9	11	725.441
2.879793	1.555207	1.708892	79	81	89	725.426
-0.785398	2.001437	0.381215	12	24	88	725.332
-1.832596	0.370812	-2.547742	4	10	75	725.301
-0.261799	1.488617	1.159546	10	21	78	725.178
-1.832596	1.050534	3.042579	3	13	87	724.873
0.000000	1.256302	0.062705	92	18	74	724.800
-0.523599	0.762244	-0.273349	95	15	70	724.779
-1.308997	0.571433	-1.188419	14	17	77	724.764
-2.094395	1.948085	-2.363031	14	3	87	724.723
-0.261799	1.574060	2.783565	11	19	80	724.656
2.356194	0.831641	0.616218	85	94	8	724.532
-1.570796	2.396274	-1.959260	88	17	85	724.053
-2.617994	0.762244	-0.273349	95	80	1	724.005
1.047198	1.869911	2.701025	85	18	16	723.907
-0.523599	2.724429	-0.348782	7	18	19	723.395
2.356194	1.195355	1.200319	74	88	86	723.363
-0.523599	1.574060	2.783565	12	15	13	723.352
-1.570796	0.297065	2.160177	95	17	91	723.117
2.879793	0.700570	1.559208	80	86	80	722.800
2.094395	1.194549	-0.801900	82	91	75	722.731
-1.047198	1.050534	3.042579	16	16	0	722.686
-1.047198	1.545873	-1.877082	12	18	13	722.612
1.047198	1.184361	0.625864	86	6	71	722.608
-0.261799	2.704512	1.488683	9	20	12	722.519
0.000000	0.370812	-2.547742	3	86	81	722.430
-2.617994	0.370812	-2.547742	91	16	91	722.352
-0.523599	2.187132	-0.479875	12	24	1	722.040
-0.785398	1.756530	-2.105156	9	15	16	721.800
0.261799	2.187132	-0.479875	0	24	5	721.797
-3.141593	2.393226	1.857173	4	92	17	721.696
-1.832596	1.617114	-1.572037	93	18	87	721.676
1.570796	0.379747	-1.713059	88	81	75	721.650
-1.308997	1.168678	2.108595	85	74	90	721.422
2.617994	0.571433	-1.188419	92	4	77	721.302
-0.785398	1.766067	2.153843	18	11	12	721.199
1.308997	0.591903	2.010408	90	15	71	720.911
0.261799	0.640596	-2.797608	7	24	84	720.889
-0.261799	0.418037	1.360082	6	13	95	720.879
-3.141593	2.664082	-1.071402	7	93	25	720.874
-0.785398	1.812176	0.656819	12	22	81	720.762
1.047198	1.909857	-0.381669	13	11	2	720.643
-2.617994	1.836682	-0.676006	6	77	89	720.590
-0.523599	1.335669	0.897240	10	11	6	720.535
1.570796	2.587733	0.232235	73	1	14	720.510
-2.356194	0.458961	-0.107937	13	10	73	720.406
1.047198	1.194549	-0.801900	79	1	78	720.280
2.356194	1.168678	2.108595	81	95	74	720.096
2.617994	1.050534	3.042579	76	82	95	720.012
0.000000	1.872854	1.543456	6	29	95	719.948
2.617994	1.574060	2.783565	74	84	5	719.858
2.356194	1.440580	2.260026	75	92	7	719.770
0.785398	0.866955	-0.931351	95	9	73	719.687
1.570796	0.496451	0.593859	95	5	66	719.527
0.523599	1.450119	-2.739050	86	6	86	719.521
1.047198	0.866955	-0.931351	81	0	73	719.367
-1.308997	1.569311	-3.003978	2	9	80	719.250
1.308997	1.168678	2.108595	90	13	73	718.955
2.879793	0.419640	2.974122	86	81	77	718.709
1.570796	1.554776	0.100351	84	79	83	718.571
2.617994	0.906588	1.252948	77	89	82	718.266
0.261799	0.618092	2.539118	6	22	78	718.264
-2.356194	2.979456	-1.009304	6	7	26	718.175
-1.047198	1.554776	0.100351	9	23	84	717.955
-0.261799	2.063651	-2.044600	8	11	20	717.487
1.308997	1.909857	-0.381669	71	91	2	717.466
0.785398	2.153910	-1.714959	80	14	95	717.344
0.523599	2.587733	0.232235	1	20	10	717.220
-0.523599	2.592629	0.909713	74	0	94	717.096
-0.261799	1.134796	2.434290	11	25	93	717.038
1.832596	1.325504	-1.671296	94	14	83	716.878
-0.785398	1.113094	-0.272241	2	24	81	716.488
-0.261799	2.863997	0.549740	6	15	21	716.455
-2.356194	2.396274	-1.959260	14	89	22	716.449
1.308997	0.831641	0.616218	90	9	68	716.434
2.094395	1.128190	-2.288622	73	90	2	716.263
1.570796	1.721184	-0.153948	76	88	88	715.923
2.879793	2.760637	2.781135	1	90	25	715.752
2.094395	0.571433	-1.188419	92	7	79	715.695
2.356194	0.618092	2.539118	82	10	75	715.669
-0.261799	2.033014	2.977192	9	12	20	715.492
-0.785398	1.875281	0.107086	14	25	94	715.292
2.356194	2.881233	-2.582574	4	6	23	715.179
2.356194	0.992645	-1.723759	93	67	91	715.178
1.047198	1.195355	1.200319	89	11	72	715.066
-0.523599	2.295480	1.008277	12	24	5	714.922
2.617994	0.370812	-2.547742	87	77	80	714.770
0.523599	2.455966	-0.641220	76	4	15	714.650
0.000000	1.812176	0.656819	89	25	86	714.423
-0.785398	0.992645	-1.723759	11	23	79	714.362
2.356194	1.391910	3.030322	73	84	4	714.214
-0.523599	1.184361	0.625864	93	94	19	713.901
-0.261799	1.977582	0.969896	9	28	95	713.859
1.832596	2.456751	-1.503343	76	93	11	713.766
2.356194	0.906588	1.252948	83	93	71	713.697
-1.308997	0.615174	-0.666022	4	9	69	713.596
0.523599	0.674054	1.013609	0	12	67	713.590
0.261799	0.914445	2.687814	6	25	87	713.563
-2.356194	2.153910	-1.714959	11	94	22	713.522
1.308997	1.184361	0.625864	76	8	75	713.307
0.000000	0.866955	-0.931351	89	18	73	713.293
0.785398	0.929350	-2.910676	94	24	80	713.257
-0.523599	1.554776	0.100351	1	26	85	713.208
-2.879793	1.555207	1.708892	0	67	91	713.151
-0.261799	2.251330	-2.330739	8	9	22	713.075
-2.356194	0.929350	-2.910676	74	7	14	713.063
1.047198	1.014500	0.906702	89	12	70	713.030
-2.617994	2.724429	-0.348782	12	7	20	713.027
0.261799	0.864993	2.278281	4	24	81	712.955
0.261799	2.247462	0.191623	95	24	13	712.489
1.308997	1.325504	-1.671296	90	10	82	712.394
2.617994	1.736875	3.023612	75	81	8	712.160
1.570796	0.591903	2.010408	88	13	71	712.135
-1.570796	0.762244	-0.273349	7	6	69	712.118
1.570796	2.724429	-0.348782	77	95	18	711.932
0.000000	0.850607	-1.335383	89	19	74	711.842
2.617994	1.699788	2.452890	74	85	5	711.833
-0.261799	1.662363	0.915448	9	28	90	711.707
2.356194	1.025536	1.576859	73	91	85	711.579
-1.047198	1.214854	-1.966664	17	21	85	711.471
2.094395	1.699788	2.452890	74	2	85	711.467
1.308997	1.450119	-2.739050	71	2	6	711.396
0.523599	0.618092	2.539118	1	22	77	711.395
2.617994	0.640596	-2.797608	82	78	88	711.187
2.617994	2.404280	-0.174044	5	86	75	711.119
0.000000	1.194549	-0.801900	87	24	80	711.009
-2.094395	2.343981	-1.040456	16	5	19	710.971
-0.785398	2.033014	2.977192	12	2	21	710.956
-2.617994	1.194549	-0.801900	94	83	90	710.672
-2.094395	1.301460	-0.509251	14	11	15	710.653
2.356194	0.591903	2.010408	77	90	80	710.575
-0.261799	1.846342	-1.796954	9	27	1	710.544
0.261799	2.174483	2.653697	8	20	15	710.458
2.094395	1.569311	-3.003978	72	89	8	710.441
0.261799	2.984978	1.954446	7	11	22	710.423
1.832596	0.203748	0.590255	12	9	72	710.274
0.000000	1.599406	1.426070	6	28	91	710.172
1.570796	2.153910	-1.714959	73	92	7	710.036
1.832596	1.732874	-0.951685	78	79	94	710.019
-0.785398	1.195355	1.200319	19	12	75	710.007
0.785398	1.658653	-2.409879	3	11	78	709.956
2.094395	1.909857	-0.381669	89	72	91	709.911
-0.523599	0.929350	-2.910676	90	3	83	709.878
0.785398	1.812176	0.656819	12	92	10	709.877
-1.570796	1.184361	0.625864	14	9	72	709.857
2.356194	1.014500	0.906702	82	93	73	709.724
-2.879793	2.979456	-1.009304	6	12	22	709.607
-2.617994	0.674054	1.013609	9	6	70	709.438
-1.570796	0.571433	-1.188419	14	14	75	709.335
2.356194	1.448123	-2.163292	76	87	8	708.998
-0.523599	0.370812	-2.547742	8	20	75	708.972
0.785398	1.504028	0.636812	84	11	75	708.886
2.094395	0.618092	2.539118	83	12	75	708.677
-2.617994	2.138223	1.678323	7	66	5	708.625
2.356194	1.433411	-1.035986	84	87	79	708.625
0.785398	2.356369	3.005869	83	1	7	708.505
-1.570796	1.736875	3.023612	3	12	82	708.484
2.356194	1.134497	-1.109631	91	10	86	708.437
0.785398	1.135834	-1.431087	73	1	94	708.364
1.832596	1.696674	-1.253233	77	94	85	708.213
2.094395	1.135813	-2.658866	71	91	1	708.037
1.047198	2.104282	-0.813972	71	6	10	707.924
0.261799	2.379497	0.561089	0	22	16	707.843
2.356194	1.569311	-3.003978	74	85	8	707.544
-1.047198	1.128190	-2.288622	17	21	84	707.454
-0.261799	1.812176	0.656819	9	28	92	707.417
-1.047198	1.450119	-2.739050	14	12	14	707.404
0.000000	1.662363	0.915448	4	29	90	707.334
1.308997	0.379747	-1.713059	87	88	71	707.238
-3.141593	0.297065	2.160177	92	84	70	707.219
0.523599	1.696674	-1.253233	82	20	86	707.096
1.832596	1.909857	-0.381669	82	75	94	706.837
0.785398	1.836682	-0.676006	80	17	86	706.693
-0.785398	1.554776	0.100351	5	25	84	706.476
1.308997	1.658653	-2.409879	0	13	78	706.388
-0.785398	1.870545	-2.976234	5	12	83	706.294
-1.570796	1.168678	2.108595	81	79	89	706.250
1.308997	0.370812	-2.547742	77	3	78	706.128
-2.094395	2.063651	-2.044600	11	3	21	706.077
-2.879793	0.203748	0.590255	9	12	72	705.957
-2.356194	1.242974	-2.977882	72	8	9	705.892
0.785398	1.247695	1.809890	91	24	82	705.889
2.617994	1.569311	-3.003978	72	0	7	705.884
1.832596	1.214854	-1.966664	71	94	4	705.864
-1.047198	1.869911	2.701025	18	9	16	705.855
-1.308997	1.374601	-2.456031	8	10	84	705.790
1.570796	1.904882	-1.478089	77	1	89	705.768
1.570796	1.134497	-1.109631	95	13	87	705.663
-3.141593	1.301460	-0.509251	83	91	8	705.629
1.047198	0.910508	1.903534	81	21	79	705.572
-1.308997	0.290380	-0.796960	95	9	68	705.456
1.832596	1.506530	1.988858	71	0	5	705.434
-0.523599	0.685216	-1.712745	3	24	79	705.426
-0.785398	0.910508	1.903534	15	16	91	705.411
-1.832596	2.343981	-1.040456	16	8	19	705.274
1.047198	2.343981	-1.040456	75	1	16	705.061
2.094395	0.203748	0.590255	92	8	68	705.033
-0.261799	2.108018	1.311430	9	26	2	704.884
-0.523599	2.164094	-2.991358	8	5	23	704.777
-0.785398	2.174483	2.653697	13	3	21	704.732
-2.094395	2.760637	2.781135	88	74	87	704.641
0.785398	0.685216	-1.712745	76	8	80	704.615
-0.523599	2.108018	1.311430	13	10	16	704.550
-3.141593	1.134796	2.434290	83	80	83	704.447
-2.356194	0.906588	1.252948	10	79	70	704.371
0.523599	1.732874	-0.951685	82	20	86	704.354
1.832596	0.685216	-1.712745	87	75	82	704.092
-0.785398	1.450119	-2.739050	92	6	82	703.941
0.785398	0.831641	0.616218	91	12	68	703.926
0.000000	1.606104	-0.451151	88	27	87	703.762
-1.832596	1.448123	-2.163292	71	92	10	703.725
1.047198	2.153910	-1.714959	4	73	91	703.643
-1.832596	2.455966	-0.641220	73	0	5	703.480
2.879793	1.256302	0.062705	86	91	8	703.473
2.094395	2.187132	-0.479875	83	76	95	703.416
-1.570796	1.869911	2.701025	79	80	86	703.348
0.785398	2.089241	-0.114193	71	6	8	703.291
-1.570796	0.850607	-1.335383	17	14	77	703.041
0.261799	1.599406	1.426070	1	29	91	703.033
-0.523599	1.488617	1.159546	12	19	76	702.971
2.094395	1.413347	-1.339188	90	6	84	702.928
-0.261799	2.089241	-0.114193	9	25	94	702.903
-1.308997	2.664082	-1.071402	11	14	19	702.857
2.094395	0.496451	0.593859	94	7	67	702.855
1.570796	1.135813	-2.658866	71	94	1	702.799
1.832596	1.374601	-2.456031	70	94	6	702.797
0.523599	1.756530	-2.105156	5	11	80	702.750
1.047198	0.591903	2.010408	92	17	70	702.728
-2.356194	0.850607	-1.335383	0	78	86	702.697
-0.261799	2.396274	-1.959260	3	12	86	702.697
-1.570796	0.370812	-2.547742	4	13	75	702.654
-1.832596	2.063651	-2.044600	19	3	17	702.622
0.261799	1.050534	3.042579	5	27	90	702.612
0.785398	0.762244	-0.273349	81	0	75	702.604
0.785398	2.299159	2.264663	92	19	19	702.440
2.094395	2.379497	0.561089	73	92	7	702.378
1.308997	1.214854	-1.966664	2	14	81	702.167
-0.261799	2.001437	0.381215	4	25	86	702.148
0.785398	1.195355	1.200319	91	16	73	702.109
-1.832596	1.846342	-1.796954	14	8	17	702.050
2.356194	1.683268	0.374177	82	75	87	702.039
-2.879793	1.374601	-2.456031	10	91	82	701.999
0.785398	1.335669	0.897240	87	10	72	701.909
0.523599	0.831641	0.616218	93	13	68	701.802
-0.261799	1.025536	1.576859	12	14	72	701.514
-2.094395	1.247695	1.809890	15	92	5	701.491
-0.523599	2.349581	-2.702517	4	16	21	701.311
0.000000	0.929350	-2.910676	9	25	92	701.250
0.523599	1.721184	-0.153948	85	20	84	701.235
-1.570796	2.180315	-1.357379	14	9	21	701.130
-1.570796	0.496451	0.593859	0	7	68	701.116
-0.261799	1.335669	0.897240	9	20	75	701.011
2.094395	2.881233	-2.582574	1	5	27	700.943
-2.617994	0.591903	2.010408	2	79	71	700.731
0.785398	1.168678	2.108595	92	24	81	700.723
-1.047198	0.864993	2.278281	17	14	92	700.673
1.308997	0.700570	1.559208	83	14	73	700.661
-1.832596	1.756530	-2.105156	18	2	16	700.407
0.523599	1.413347	-1.339188	90	18	80	700.406
2.094395	1.310100	1.488307	70	92	89	700.332
-1.570796	1.242974	-2.977882	0	9	80	700.300
2.356194	0.866395	-2.492918	73	91	93	700.037
2.094395	2.396274	-1.959260	91	81	95	700.035
-0.261799	0.458961	-0.107937	80	12	78	699.933
-0.785398	2.455966	-0.641220	10	21	11	699.730
2.879793	0.571433	-1.188419	93	3	75	699.700
-0.523599	1.448123	-2.163292	11	21	10	699.551
-3.141593	0.080730	-2.622036	89	81	76	699.539
1.832596	1.977582	0.969896	69	91	1	699.530
1.570796	0.674054	1.013609	91	10	68	699.521
1.047198	2.760637	2.781135	2	11	23	699.274
-2.356194	0.685216	-1.712745	4	4	76	699.105
-1.047198	2.247462	0.191623	16	21	7	699.081
1.308997	1.488617	1.159546	75	10	79	698.985
1.047198	0.619654	-2.216909	75	5	80	698.722
0.261799	1.440580	2.260026	89	19	78	698.694
-0.785398	1.391910	3.030322	16	15	9	698.531
-0.261799	2.138223	1.678323	9	21	16	698.498
0.785398	0.866395	-2.492918	92	24	82	698.486
1.832596	1.721184	-0.153948	86	75	86	698.371
0.785398	1.998705	2.370472	89	20	16	698.365
1.570796	0.831641	0.616218	90	7	68	698.348
-3.141593	1.574060	2.783565	87	80	80	698.327
-2.617994	2.104282	-0.813972	5	79	93	698.321
-1.047198	0.674054	1.013609	13	87	69	698.229
-3.141593	1.413430	2.550734	83	78	87	698.182
-3.141593	2.724429	-0.348782	86	90	8	698.150
-0.785398	2.379497	0.561089	12	23	5	698.141
0.000000	0.906588	1.252948	5	17	70	697.893
0.785398	2.174483	2.653697	82	94	92	697.890
-2.879793	1.606104	-0.451151	84	92	8	697.876
-0.261799	1.658653	-2.409879	12	17	13	697.810
-1.570796	1.374601	-2.456031	9	8	84	697.767
0.523599	1.168678	2.108595	95	26	85	697.642
-1.308997	0.992645	-1.723759	17	17	80	697.629
-2.094395	1.168678	2.108595	14	93	5	697.618
2.356194	1.413430	2.550734	78	93	80	697.567
1.047198	1.450119	-2.739050	2	90	80	697.517
1.047198	1.168678	2.108595	87	22	81	697.458
0.261799	2.138223	1.678323	1	23	16	697.432
0.785398	1.301460	-0.509251	81	17	77	697.370
1.308997	0.418037	1.360082	95	12	67	697.361
0.785398	2.579248	-2.364801	84	9	22	697.351
1.308997	1.599406	1.426070	75	9	80	697.282
2.879793	2.343981	-1.040456	93	75	3	697.228
2.356194	2.089241	-0.114193	85	74	94	696.948
1.570796	1.545873	-1.877082	0	14	82	696.760
1.047198	0.992645	-1.723759	73	95	94	696.507
-2.094395	1.696674	-1.253233	1	18	83	696.502
0.000000	0.866395	-2.492918	90	5	82	696.403
-2.356194	1.025536	1.576859	10	72	77	696.353
-2.094395	1.391910	3.030322	70	4	5	696.351
0.523599	1.506530	1.988858	19	92	9	696.223
1.570796	0.685216	-1.712745	82	85	75	696.105
-2.879793	0.496451	0.593859	9	8	70	696.081
-0.785398	1.545873	-1.877082	9	19	14	696.074
2.617994	2.664082	-1.071402	83	4	90	695.643
0.785398	1.948085	-2.363031	2	12	79	695.562
-0.523599	1.128190	-2.288622	12	22	4	695.547
1.832596	0.379747	-1.713059	84	80	81	695.531
1.832596	1.448123	-2.163292	71	94	7	695.515
0.261799	1.555207	1.708892	2	29	90	695.498
0.000000	1.325504	-1.671296	89	24	82	695.486
-2.356194	0.992645	-1.723759	3	19	92	695.453
-2.094395	2.588535	-2.976617	10	90	24	695.393
0.261799	1.113094	-0.272241	88	21	74	695.321
0.000000	0.619654	-2.216909	6	25	87	695.223
-1.047198	1.741644	-2.695914	6	10	84	695.191
1.308997	0.674054	1.013609	93	10	68	695.135
1.047198	1.741644	-2.695914	73	7	10	695.048
2.094395	1.554776	0.100351	80	79	85	695.046
-2.617994	0.619654	-2.216909	2	4	79	695.002
0.785398	0.700570	1.559208	9	12	71	694.982
-0.523599	1.113094	-0.272241	95	25	80	694.978
1.832596	2.587733	0.232235	74	94	10	694.840
2.094395	2.033014	2.977192	74	89	14	694.828
-3.141593	2.180315	-1.357379	88	85	95	694.723
1.308997	0.762244	-0.273349	3	12	87	694.679
1.308997	1.247695	1.809890	82	18	79	694.420
-1.047198	2.588535	-2.976617	12	12	89	694.409
-2.094395	1.134497	-1.109631	24	93	78	694.211
0.261799	0.700570	1.559208	4	15	68	694.152
-2.094395	0.762244	-0.273349	11	5	69	694.047
-3.141593	0.640596	-2.797608	88	73	87	693.958
-2.356194	1.310100	1.488307	13	87	7	693.781
0.523599	1.554776	0.100351	86	22	81	693.387
1.832596	1.413347	-1.339188	94	13	86	693.384
1.047198	2.579248	-2.364801	9	10	19	693.366
-0.261799	2.724429	-0.348782	4	18	20	693.248
2.617994	1.014500	0.906702	84	91	74	693.162
-1.047198	0.914445	2.687814	17	15	93	693.063
2.094395	2.393226	1.857173	86	79	85	693.017
0.261799	1.617114	-1.572037	85	21	85	692.945
2.617994	1.025536	1.576859	75	87	85	692.801
0.261799	1.242974	-2.977882	8	26	0	692.596
-1.308997	1.450119	-2.739050	8	10	85	692.503
-1.308997	0.700570	1.559208	0	9	15	692.459
0.523599	1.658653	-2.409879	4	9	78	692.365
2.879793	2.104282	-0.813972	85	87	95	692.309
-0.261799	1.766067	2.153843	12	16	12	692.301
-0.523599	1.014500	0.906702	14	17	72	692.298
-2.879793	1.113094	-0.272241	90	86	94	692.290
-1.047198	0.203748	0.590255	82	10	75	692.195
2.617994	2.704512	1.488683	0	6	15	692.123
0.785398	1.050534	3.042579	2	84	82	692.055
-2.617994	2.164094	-2.991358	9	82	20	691.998
-0.261799	1.909857	-0.381669	9	26	92	691.969
-1.308997	0.850607	-1.335383	15	17	76	691.927
0.000000	2.637879	2.121598	5	21	82	691.914
-1.570796	2.153910	-1.714959	18	8	17	691.901
1.570796	1.448123	-2.163292	0	14	79	691.823
1.570796	2.396274	-1.959260	76	92	9	691.744
-3.141593	2.478122	2.609777	2	84	23	691.550
1.570796	0.203748	0.590255	4	5	65	691.458
0.000000	1.617114	-1.572037	7	7	83	691.424
-2.094395	1.417623	-0.202254	13	14	12	691.385
2.879793	1.247695	1.809890	88	76	77	691.212
-0.523599	1.875281	0.107086	15	25	89	691.116
2.356194	2.592629	0.909713	75	91	12	690.970
-0.523599	1.391910	3.030322	14	20	8	690.969
2.094395	1.721184	-0.153948	88	72	87	690.939
-2.356194	0.619654	-2.216909	4	4	77	690.879
1.047198	2.174483	2.653697	87	16	18	690.826
0.785398	2.073035	2.027405	89	21	16	690.809
1.047198	2.587733	0.232235	73	2	11	690.714
2.094395	0.929350	-2.910676	70	93	90	690.633
-0.261799	0.619654	-2.216909	1	24	78	690.633
-0.261799	0.379747	-1.713059	9	20	78	690.470
0.261799	0.910508	1.903534	4	24	80	690.438
-0.523599	1.135834	-1.431087	0	22	78	690.370
0.000000	1.367556	0.358405	0	94	18	690.282
1.832596	2.138223	1.678323	73	0	89	690.208
1.832596	1.335669	0.897240	74	92	1	690.191
0.785398	1.310100	1.488307	91	18	75	690.117
0.785398	2.664082	-1.071402	78	5	18	689.990
1.308997	1.606104	-0.451151	77	8	82	689.911
-0.523599	2.343981	-1.040456	9	22	8	689.866
-2.879793	2.343981	-1.040456	95	78	6	689.774
2.617994	0.864993	2.278281	85	94	71	689.765
2.617994	1.184361	0.625864	1	16	77	689.760
2.356194	1.247695	1.809890	72	90	89	689.754
1.047198	0.379747	-1.713059	86	92	72	689.398
0.000000	2.299159	2.264663	5	19	20	689.058
2.879793	1.218453	2.777284	78	83	86	689.032
0.785398	1.374601	-2.456031	81	1	88	688.828
-3.141593	2.073035	2.027405	3	94	12	688.754
0.261799	2.863997	0.549740	2	16	21	688.751
1.832596	2.719179	-1.780644	82	92	7	688.304
2.356194	0.674054	1.013609	84	0	70	688.237
-2.879793	0.700570	1.559208	94	80	72	688.073
0.785398	0.418037	1.360082	2	11	66	688.029
2.617994	2.295480	1.008277	77	83	5	687.948
1.570796	2.379497	0.561089	72	93	6	687.809
-1.047198	1.569311	-3.003978	19	12	12	687.726
0.785398	0.290380	-0.796960	4	5	68	687.707
0.000000	1.374601	-2.456031	93	6	82	687.692
1.047198	0.685216	-1.712745	81	95	74	687.682
2.879793	1.335669	0.897240	92	71	79	687.547
0.785398	2.404280	-0.174044	74	4	13	687.448
-0.261799	0.370812	-2.547742	4	85	81	687.306
-0.261799	1.545873	-1.877082	10	28	93	687.260
1.308997	0.496451	0.593859	95	7	66	687.203
0.523599	2.115563	0.685730	91	24	12	687.173
0.785398	0.850607	-1.335383	8	8	83	686.960
1.832596	1.488617	1.159546	75	0	79	686.787
-1.308997	1.134796	2.434290	19	11	1	686.662
1.308997	1.391910	3.030322	71	4	5	686.496
0.000000	1.448123	-2.163292	6	6	80	686.464
2.617994	2.299159	2.264663	11	19	94	686.441
-0.523599	0.961715	0.014085	0	16	71	686.393
1.570796	2.349581	-2.702517	91	83	0	686.366
2.356194	2.033014	2.977192	75	87	14	686.259
-1.047198	1.846342	-1.796954	9	0	83	686.257
-2.356194	0.674054	1.013609	10	8	71	686.224
-1.047198	0.370812	-2.547742	88	1	84	686.162
-1.047198	1.242974	-2.977882	82	3	82	686.148
0.785398	0.379747	-1.713059	78	6	78	686.044
-3.141593	0.914445	2.687814	92	70	83	685.950
-0.785398	0.850607	-1.335383	16	22	84	685.830
-2.617994	0.290380	-0.796960	86	94	87	685.743
0.000000	2.115563	0.685730	7	26	92	685.641
2.094395	1.766067	2.153843	74	0	84	685.561
0.523599	0.619654	-2.216909	2	23	81	685.561
0.523599	2.164094	-2.991358	84	18	18	685.456
0.261799	1.872854	1.543456	2	29	94	685.426
1.570796	1.256302	0.062705	79	5	75	685.392
-0.785398	0.458961	-0.107937	84	16	76	685.389
1.047198	2.041297	-2.664597	84	90	1	685.385
-1.832596	1.948085	-2.363031	14	6	87	685.383
2.356194	1.413347	-1.339188	80	92	85	685.287
-0.261799	1.256302	0.062705	93	25	80	685.252
-2.356194	0.700570	1.559208	4	80	70	685.100
2.094395	2.719179	-1.780644	83	3	1	684.891
1.047198	2.356369	3.005869	0	81	82	684.852
2.094395	1.184361	0.625864	74	89	92	684.571
2.617994	1.134497	-1.109631	90	9	86	684.554
0.261799	1.846342	-1.796954	86	20	90	684.505
-2.879793	1.696674	-1.253233	92	87	86	684.502
0.523599	1.335669	0.897240	92	19	75	684.345
-2.094395	1.741644	-2.695914	15	5	88	684.294
2.879793	2.455966	-0.641220	92	75	5	683.828
-0.785398	0.080730	-2.622036	95	10	68	683.452
-1.832596	0.899350	-2.069907	5	5	78	683.439
-0.523599	0.496451	0.593859	8	88	68	683.394
-1.832596	2.979456	-1.009304	9	15	16	683.294
0.785398	1.450119	-2.739050	89	94	85	683.277
0.261799	1.374601	-2.456031	93	5	81	683.244
2.879793	1.310100	1.488307	89	76	77	683.200
1.832596	1.545873	-1.877082	94	14	82	683.122
-0.785398	2.251330	-2.330739	12	10	88	683.086
1.832596	2.187132	-0.479875	84	75	2	682.711
2.879793	1.417623	-0.202254	91	75	82	682.636
-1.832596	2.724429	-0.348782	74	2	2	682.577
1.570796	2.187132	-0.479875	74	87	6	682.427
0.523599	1.869911	2.701025	84	93	91	682.369
-1.047198	0.960688	-0.577532	6	19	77	682.335
0.261799	1.904882	-1.478089	86	22	91	682.245
-1.308997	1.218453	2.777284	19	12	3	682.212
2.094395	1.014500	0.906702	80	1	73	682.159
-0.523599	1.736875	3.023612	12	13	16	682.082
-2.879793	1.194549	-0.801900	87	19	88	682.003
1.308997	2.104282	-0.813972	73	90	7	681.967
-2.617994	2.073035	2.027405	8	7	6	681.810
-0.523599	1.545873	-1.877082	5	4	80	681.745
2.879793	1.574060	2.783565	77	83	92	681.691
1.570796	2.455966	-0.641220	74	94	15	681.689
0.523599	0.418037	1.360082	3	11	66	681.668
1.047198	0.370812	-2.547742	77	6	78	681.621
0.523599	1.617114	-1.572037	82	17	85	681.430
-0.261799	2.115563	0.685730	6	25	88	681.345
2.356194	1.836682	-0.676006	86	72	90	681.306
-2.356194	1.194549	-0.801900	89	84	95	681.250
2.094395	1.135834	-1.431087	92	13	85	681.010
1.832596	1.662363	0.915448	75	94	83	680.984
-1.047198	1.194549	-0.801900	7	25	88	680.969
-0.523599	2.299159	2.264663	12	10	21	680.941
-2.879793	1.050534	3.042579	1	13	18	680.935
-2.879793	1.310100	1.488307	3	67	81	680.902
-0.523599	1.195355	1.200319	13	17	73	680.850
0.785398	1.433411	-1.035986	8	9	84	680.788
2.879793	0.685216	-1.712745	94	3	80	680.776
1.832596	1.554776	0.100351	77	83	84	680.613
1.308997	2.704512	1.488683	81	82	89	680.562
1.308997	2.033014	2.977192	84	14	19	680.455
-0.261799	1.242974	-2.977882	13	24	1	680.391
2.094395	0.866395	-2.492918	72	93	93	680.262
0.000000	1.184361	0.625864	4	26	81	680.229
-0.261799	0.496451	0.593859	82	11	77	680.221
-0.523599	0.850607	-1.335383	95	20	74	680.152
-2.879793	0.709924	0.218797	7	91	67	680.099
-1.308997	2.760637	2.781135	11	15	84	680.074
-0.785398	1.662363	0.915448	13	19	78	680.010
-1.047198	1.510910	-0.740472	8	25	91	679.977
-2.879793	2.404280	-0.174044	87	88	7	679.852
1.308997	1.554776	0.100351	74	91	87	679.846
0.000000	1.683268	0.374177	88	24	84	679.760
0.523599	2.033014	2.977192	81	9	4	679.695
-2.617994	2.881233	-2.582574	6	94	25	679.578
-0.261799	2.637879	2.121598	8	5	25	679.562
1.832596	2.115563	0.685730	70	90	3	679.435
1.832596	0.864993	2.278281	83	11	74	679.434
2.094395	1.391910	3.030322	72	89	4	679.363
2.879793	2.396274	-1.959260	0	83	26	679.340
1.570796	1.696674	-1.253233	76	3	85	679.263
1.047198	1.488617	1.159546	85	13	74	679.216
-1.832596	2.115563	0.685730	26	78	2	679.146
0.785398	2.033014	2.977192	89	19	19	679.141
-2.094395	2.396274	-1.959260	14	6	19	679.136
0.523599	1.982574	-1.115518	6	13	89	679.039
1.047198	0.960688	-0.577532	74	90	87	678.817
2.094395	1.836682	-0.676006	82	75	90	678.815
-3.141593	0.709924	0.218797	84	95	91	678.777
1.832596	1.440580	2.260026	77	7	79	678.412
-0.261799	1.413347	-1.339188	9	28	88	678.346
1.047198	2.719179	-1.780644	84	5	23	678.140
-1.308997	1.658653	-2.409879	18	10	15	678.126
0.785398	0.571433	-1.188419	84	0	72	678.010
-1.832596	0.615174	-0.666022	16	13	76	677.926
-2.356194	1.683268	0.374177	1	23	82	677.902
2.617994	2.115563	0.685730	90	71	90	677.895
1.832596	2.579248	-2.364801	86	91	1	677.825
0.000000	0.618092	2.539118	8	21	77	677.766
-1.832596	1.310100	1.488307	20	5	76	677.667
0.000000	1.050534	3.042579	9	26	90	677.586
0.785398	1.869911	2.701025	83	93	91	677.565
0.000000	1.440580	2.260026	8	28	90	677.537
2.356194	1.824694	1.850876	71	88	4	677.429
2.879793	0.379747	-1.713059	95	8	81	677.423
-2.617994	0.961715	0.014085	7	72	83	677.412
-3.141593	0.700570	1.559208	95	74	72	677.234
2.879793	1.135834	-1.431087	85	13	89	677.137
-0.785398	0.496451	0.593859	9	88	68	677.074
0.523599	2.637879	2.121598	77	0	87	677.039
1.308997	1.741644	-2.695914	2	85	83	677.029
-0.523599	2.104282	-0.813972	11	25	0	676.969
-0.785398	1.413347	-1.339188	17	25	89	676.963
-2.356194	2.349581	-2.702517	11	86	22	676.937
-3.141593	0.496451	0.593859	92	0	68	676.844
1.832596	1.045978	0.343692	88	4	71	676.826
2.094395	0.992645	-1.723759	89	70	91	676.549
-1.047198	1.721184	-0.153948	20	20	86	676.307
0.523599	0.733948	3.021411	9	24	84	676.172
1.308997	2.396274	-1.959260	75	2	10	676.104
0.523599	0.591903	2.010408	3	20	76	676.089
1.570796	1.683268	0.374177	76	87	86	676.046
1.047198	0.733948	3.021411	3	81	88	676.017
2.879793	1.904882	-1.478089	0	88	83	675.981
0.261799	2.579248	-2.364801	86	9	21	675.977
2.356194	2.984978	1.954446	0	94	26	675.970
1.832596	0.640596	-2.797608	72	1	85	675.939
-1.570796	1.247695	1.809890	15	3	73	675.798
-3.141593	1.504028	0.636812	1	69	81	675.794
-2.094395	2.180315	-1.357379	15	3	20	675.750
1.308997	0.906588	1.252948	91	13	72	675.663
2.094395	1.617114	-1.572037	89	4	83	675.478
2.094395	1.736875	3.023612	73	89	10	675.476
-2.617994	0.458961	-0.107937	14	5	70	675.407
-3.141593	1.545873	-1.877082	2	88	81	675.371
2.617994	2.478122	2.609777	77	86	17	675.280
-2.356194	1.510910	-0.740472	6	79	90	675.215
0.523599	1.413430	2.550734	0	28	90	675.211
0.000000	2.041297	-2.664597	8	14	19	675.181
1.832596	1.135813	-2.658866	70	95	2	675.116
-3.141593	2.299159	2.264663	2	84	21	674.997
2.094395	0.850607	-1.335383	3	8	83	674.913
-0.261799	0.906588	1.252948	8	16	69	674.839
2.617994	2.719179	-1.780644	2	0	27	674.763
2.617994	2.979456	-1.009304	8	10	20	674.756
0.261799	0.080730	-2.622036	10	16	75	674.752
1.308997	1.812176	0.656819	14	2	10	674.669
0.785398	1.599406	1.426070	87	17	76	674.561
0.523599	2.456751	-1.503343	7	13	86	674.492
0.000000	2.247462	0.191623	3	25	13	674.403
1.570796	1.195355	1.200319	86	11	74	674.385
0.785398	1.506530	1.988858	92	21	79	674.338
0.523599	0.992645	-1.723759	90	79	1	674.275
-1.047198	0.419640	2.974122	4	15	75	674.274
-2.094395	1.242974	-2.977882	71	4	9	674.256
-0.261799	1.599406	1.426070	10	27	91	674.249
2.617994	1.218453	2.777284	75	85	86	674.211
2.879793	2.001437	0.381215	4	66	90	674.170
2.879793	1.025536	1.576859	91	71	77	674.160
1.308997	0.929350	-2.910676	72	3	94	674.125
0.523599	2.881233	-2.582574	88	4	24	674.102
2.617994	0.379747	-1.713059	94	8	80	674.018
1.047198	1.242974	-2.977882	73	8	3	673.962
0.261799	1.488617	1.159546	1	23	78	673.787
-2.879793	2.396274	-1.959260	6	93	24	673.748
2.356194	0.864993	2.278281	74	91	85	673.743
-2.356194	0.866955	-0.931351	8	82	75	673.580
1.047198	1.135813	-2.658866	6	23	89	673.477
-1.832596	0.674054	1.013609	2	3	67	673.475
2.356194	1.617114	-1.572037	11	15	16	673.422
-3.141593	1.433411	-1.035986	88	90	88	673.416
-0.261799	2.349581	-2.702517	11	3	22	673.237
1.832596	0.910508	1.903534	84	11	73	673.210
1.308997	1.256302	0.062705	80	9	75	673.064
-1.047198	1.658653	-2.409879	13	13	16	673.044
-1.570796	2.719179	-1.780644	11	1	24	673.005
-1.832596	2.180315	-1.357379	15	6	21	672.808
1.832596	1.510910	-0.740472	69	89	93	672.793
-1.047198	2.724429	-0.348782	11	19	12	672.759
2.356194	2.704512	1.488683	94	8	16	672.643
1.570796	0.914445	2.687814	89	16	76	672.626
0.523599	1.599406	1.426070	94	28	90	672.623
1.570796	2.089241	-0.114193	72	89	3	672.526
1.570796	1.391910	3.030322	71	2	5	672.496
-1.570796	1.699788	2.452890	78	81	86	672.402
-3.141593	1.391910	3.030322	89	74	84	672.353
-2.617994	2.979456	-1.009304	6	6	26	672.267
-2.879793	1.025536	1.576859	0	74	76	672.257
-3.141593	1.721184	-0.153948	86	94	9	672.239
-0.785398	2.180315	-1.357379	86	10	82	672.226
-2.356194	2.180315	-1.357379	13	3	20	672.163
0.000000	1.413347	-1.339188	79	94	91	672.129
-1.308997	2.033014	2.977192	7	13	86	672.059
2.094395	0.615174	-0.666022	87	7	77	672.016
0.785398	1.756530	-2.105156	4	12	80	671.794
2.356194	2.174483	2.653697	4	15	10	671.750
0.523599	1.301460	-0.509251	84	20	77	671.555
0.261799	0.370812	-2.547742	6	23	81	671.414
0.261799	2.349581	-2.702517	88	12	20	671.377
1.570796	1.218453	2.777284	71	2	2	671.332
0.523599	2.396274	-1.959260	80	10	18	671.112
0.523599	2.343981	-1.040456	7	13	93	671.055
-2.879793	0.618092	2.539118	90	77	77	670.890
1.047198	1.574060	2.783565	84	90	91	670.861
0.785398	1.846342	-1.796954	79	14	90	670.858
-1.570796	2.251330	-2.330739	93	4	72	670.846
1.832596	0.850607	-1.335383	5	15	87	670.785
2.879793	1.440580	2.260026	78	77	94	670.501
-0.523599	1.374601	-2.456031	92	5	83	670.478
-2.094395	2.153910	-1.714959	12	5	20	670.426
0.000000	1.658653	-2.409879	5	6	78	670.426
0.523599	2.153910	-1.714959	83	18	95	670.373
-0.785398	0.674054	1.013609	86	12	76	670.371
-1.308997	2.356369	3.005869	10	12	83	670.352
2.617994	1.214854	-1.966664	87	18	85	670.315
-2.356194	2.115563	0.685730	20	70	2	670.233
-1.570796	0.615174	-0.666022	6	81	86	670.115
-1.832596	0.496451	0.593859	5	7	66	670.087
1.047198	2.664082	-1.071402	78	3	18	670.023
1.308997	2.588535	-2.976617	5	17	18	670.009
-1.047198	0.591903	2.010408	15	12	88	669.929
1.832596	2.588535	-2.976617	0	78	11	669.860
1.047198	1.948085	-2.363031	1	13	78	669.813
-3.141593	1.310100	1.488307	95	67	81	669.778
0.523599	1.836682	-0.676006	83	20	87	669.754
-0.523599	1.569311	-3.003978	13	20	12	669.698
2.356194	1.875281	0.107086	83	74	90	669.559
2.617994	2.396274	-1.959260	94	84	25	669.334
-0.261799	1.374601	-2.456031	93	6	83	669.315
2.094395	1.134497	-1.109631	90	5	84	669.241
0.000000	1.554776	0.100351	88	25	85	669.223
-0.523599	1.909857	-0.381669	13	25	91	669.222
-0.261799	0.685216	-1.712745	10	24	82	669.118
2.617994	2.001437	0.381215	83	77	91	669.086
-2.356194	0.379747	-1.713059	1	8	74	668.996
1.308997	2.637879	2.121598	92	13	22	668.897
1.047198	2.724429	-0.348782	77	94	17	668.887
1.832596	1.391910	3.030322	71	93	5	668.839
-0.785398	1.555207	1.708892	19	11	8	668.711
1.308997	0.618092	2.539118	94	16	72	668.569
-1.047198	1.367556	0.358405	19	16	77	668.530
-0.785398	1.242974	-2.977882	15	22	3	668.422
2.879793	1.554776	0.100351	89	74	84	668.337
0.000000	2.164094	-2.991358	10	7	21	668.184
2.356194	0.571433	-1.188419	91	5	77	668.051
-1.570796	1.617114	-1.572037	24	8	85	668.049
-1.308997	1.977582	0.969896	73	4	4	668.008
1.570796	1.909857	-0.381669	72	86	2	667.975
1.308997	2.164094	-2.991358	80	91	6	667.959
1.570796	0.899350	-2.069907	79	86	79	667.959
-1.832596	2.349581	-2.702517	75	86	93	667.922
-1.047198	1.374601	-2.456031	18	21	88	667.794
-0.785398	1.025536	1.576859	11	14	3	667.746
1.832596	2.863997	0.549740	77	0	17	667.686
2.879793	0.831641	0.616218	88	91	71	667.597
-1.047198	2.138223	1.678323	18	6	17	667.522
1.832596	0.571433	-1.188419	91	9	78	667.390
-2.356194	1.741644	-2.695914	0	8	19	667.340
-0.261799	2.073035	2.027405	8	20	16	667.180
-1.832596	1.450119	-2.739050	1	8	79	667.152
-0.523599	2.637879	2.121598	9	3	25	667.149
0.523599	2.180315	-1.357379	5	14	91	667.109
0.261799	1.574060	2.783565	5	23	81	667.106
1.570796	0.992645	-1.723759	0	15	83	666.944
1.047198	1.134796	2.434290	89	23	83	666.814
-1.047198	1.998705	2.370472	17	1	17	666.712
-1.047198	1.134497	-1.109631	9	22	81	666.591
2.879793	0.297065	2.160177	6	20	81	666.575
-1.570796	1.870545	-2.976234	4	10	80	666.522
1.832596	1.982574	-1.115518	71	93	6	666.466
2.356194	1.756530	-2.105156	76	87	13	666.288
-0.785398	2.456751	-1.503343	86	11	81	666.249
-2.094395	0.899350	-2.069907	4	4	79	666.125
0.000000	1.555207	1.708892	7	28	91	666.025
1.047198	1.218453	2.777284	74	11	2	665.926
-0.523599	0.619654	-2.216909	12	22	82	665.852
1.570796	1.045978	0.343692	88	6	71	665.804
1.570796	1.846342	-1.796954	95	14	82	665.743
-1.308997	0.866395	-2.492918	89	4	83	665.727
-1.570796	1.128190	-2.288622	5	13	85	665.726
0.261799	0.571433	-1.188419	80	10	78	665.615
1.308997	2.760637	2.781135	0	11	23	665.523
-0.261799	1.014500	0.906702	12	15	73	665.492
0.000000	2.456751	-1.503343	7	13	92	665.484
0.523599	2.393226	1.857173	0	21	18	665.471
2.617994	0.297065	2.160177	87	8	70	665.466
0.000000	1.756530	-2.105156	8	18	15	665.362
2.094395	1.433411	-1.035986	77	94	84	665.358
-1.832596	1.194549	-0.801900	18	8	75	665.256
2.879793	1.699788	2.452890	78	77	4	665.165
-0.785398	1.872854	1.543456	18	11	13	665.019
1.832596	0.619654	-2.216909	82	84	75	664.907
2.879793	1.214854	-1.966664	84	16	86	664.876
0.261799	2.588535	-2.976617	4	8	25	664.723
0.261799	2.404280	-0.174044	1	22	8	664.625
-0.785398	0.618092	2.539118	15	17	86	664.504
-1.832596	1.374601	-2.456031	10	6	84	664.455
1.308997	1.113094	-0.272241	0	13	87	664.395
0.785398	0.906588	1.252948	93	14	69	664.374
-2.094395	1.617114	-1.572037	0	18	85	664.310
-2.094395	0.496451	0.593859	2	95	66	664.056
-3.141593	1.256302	0.062705	84	6	9	664.005
-3.141593	1.510910	-0.740472	82	92	7	663.922
2.617994	2.033014	2.977192	76	93	15	663.918
2.879793	2.664082	-1.071402	14	7	17	663.768
1.308997	1.045978	0.343692	87	8	70	663.742
-1.570796	2.456751	-1.503343	14	11	19	663.660
-3.141593	0.419640	2.974122	89	78	77	663.614
1.047198	0.831641	0.616218	91	10	69	663.595
1.308997	1.194549	-0.801900	78	7	75	663.568
1.832596	2.001437	0.381215	81	77	91	663.500
2.356194	0.685216	-1.712745	3	8	83	663.470
-2.356194	0.960688	-0.577532	20	90	74	663.469
0.785398	1.194549	-0.801900	92	13	77	663.102
2.094395	0.831641	0.616218	90	5	69	663.001
-1.308997	1.247695	1.809890	19	8	1	662.877
-2.094395	2.295480	1.008277	76	4	93	662.779
-2.094395	0.906588	1.252948	12	80	70	662.746
-2.617994	1.025536	1.576859	6	71	76	662.722
0.785398	1.184361	0.625864	88	15	72	662.720
0.785398	2.104282	-0.813972	75	95	14	662.544
-1.047198	0.992645	-1.723759	15	20	79	662.402
-1.308997	0.419640	2.974122	5	13	76	662.380
0.261799	1.413347	-1.339188	94	21	80	662.295
1.570796	0.370812	-2.547742	77	1	77	662.220
-3.141593	1.134497	-1.109631	13	5	19	662.185
1.047198	2.455966	-0.641220	74	4	15	662.090
0.523599	2.724429	-0.348782	84	78	84	661.991
-2.094395	2.881233	-2.582574	7	94	25	661.884
-1.047198	1.948085	-2.363031	17	20	3	661.867
0.523599	0.370812	-2.547742	2	23	83	661.782
-2.879793	1.766067	2.153843	1	95	13	661.761
0.000000	2.396274	-1.959260	2	12	85	661.758
-0.785398	2.863997	0.549740	8	18	14	661.678
-3.141593	0.733948	3.021411	88	75	81	661.648
2.879793	1.448123	-2.163292	2	87	81	661.608
0.261799	1.545873	-1.877082	85	21	85	661.594
-3.141593	2.153910	-1.714959	6	76	91	661.534
2.356194	1.909857	-0.381669	85	73	91	661.487
-0.261799	0.961715	0.014085	93	15	71	661.479
-1.047198	1.218453	2.777284	18	16	3	661.462
2.617994	0.850607	-1.335383	91	8	85	661.456
1.047198	2.379497	0.561089	2	94	16	661.286
0.785398	2.478122	2.609777	93	17	23	661.224
1.047198	1.113094	-0.272241	81	12	73	661.188
-0.785398	0.899350	-2.069907	2	2	80	661.060
-2.879793	0.850607	-1.335383	1	1	77	660.913
-2.094395	2.863997	0.549740	13	10	18	660.777
1.308997	1.374601	-2.456031	2	13	77	660.707
-2.879793	1.506530	1.988858	87	74	88	660.547
-1.832596	1.135813	-2.658866	0	9	81	660.384
1.570796	2.719179	-1.780644	85	1	22	660.222
0.523599	2.187132	-0.479875	92	23	4	660.133
-1.832596	1.184361	0.625864	15	4	72	660.117
-2.094395	0.831641	0.616218	9	10	18	660.052
-1.047198	0.571433	-1.188419	3	11	69	659.927
0.785398	1.909857	-0.381669	80	17	86	659.875
1.570796	0.619654	-2.216909	82	88	75	659.857
2.356194	2.251330	-2.330739	89	85	25	659.820
0.523599	1.184361	0.625864	91	17	72	659.763
-2.094395	2.001437	0.381215	94	21	78	659.750
1.570796	1.870545	-2.976234	74	1	13	659.665
2.094395	0.619654	-2.216909	73	94	88	659.490
2.356194	2.153910	-1.714959	82	3	92	659.450
-0.523599	1.413430	2.550734	14	24	3	659.439
1.308997	2.404280	-0.174044	72	3	8	659.397
0.261799	0.379747	-1.713059	87	13	69	659.197
-3.141593	1.599406	1.426070	93	69	85	659.159
-2.356194	1.247695	1.809890	11	69	81	659.131
0.000000	2.404280	-0.174044	5	23	7	659.129
-2.879793	2.455966	-0.641220	2	75	5	659.040
-2.879793	2.478122	2.609777	4	84	23	658.894
-3.141593	2.115563	0.685730	7	65	92	658.892
2.094395	2.979456	-1.009304	88	0	23	658.777
-1.308997	2.343981	-1.040456	15	15	16	658.740
-0.523599	2.588535	-2.976617	95	9	22	658.664
-2.356194	0.591903	2.010408	6	74	74	658.502
-2.879793	2.033014	2.977192	79	86	87	658.473
2.094395	0.960688	-0.577532	84	93	71	658.292
2.356194	2.863997	0.549740	14	12	1	658.236
1.832596	0.080730	-2.622036	90	89	69	658.228
2.617994	0.929350	-2.910676	73	90	90	658.143
0.785398	1.617114	-1.572037	0	74	91	658.088
-1.832596	1.335669	0.897240	16	1	73	658.085
0.785398	2.187132	-0.479875	77	8	17	657.988
0.261799	1.417623	-0.202254	84	20	80	657.934
-2.356194	1.045978	0.343692	17	0	73	657.879
2.094395	1.696674	-1.253233	90	4	85	657.802
0.000000	1.696674	-1.253233	7	8	84	657.765
2.094395	2.180315	-1.357379	86	5	89	657.694
1.047198	0.899350	-2.069907	80	95	78	657.691
-1.308997	0.619654	-2.216909	89	2	83	657.690
-2.617994	1.982574	-1.115518	4	78	93	657.675
-1.832596	0.906588	1.252948	14	84	70	657.665
-2.356194	2.063651	-2.044600	11	84	22	657.665
2.356194	1.450119	-2.739050	73	88	5	657.478
-0.261799	1.736875	3.023612	9	16	16	657.462
2.094395	1.998705	2.370472	92	23	82	657.445
-1.308997	1.367556	0.358405	19	11	76	657.290
0.261799	2.396274	-1.959260	81	11	18	657.198
0.261799	2.251330	-2.330739	85	13	18	657.092
-0.785398	2.073035	2.027405	15	2	18	657.047
2.094395	1.510910	-0.740472	80	89	80	657.042
2.617994	2.379497	0.561089	85	0	79	657.016
2.617994	1.721184	-0.153948	86	75	87	656.995
1.832596	1.025536	1.576859	79	9	76	656.981
-0.523599	1.606104	-0.451151	3	28	90	656.752
1.047198	0.906588	1.252948	80	20	79	656.751
-0.261799	2.579248	-2.364801	2	13	85	656.730
0.785398	2.719179	-1.780644	85	6	23	656.659
-2.356194	1.135813	-2.658866	74	8	13	656.591
2.356194	1.998705	2.370472	72	89	9	656.580
2.094395	1.413430	2.550734	76	3	80	656.506
-0.785398	1.824694	1.850876	18	11	13	656.392
-1.047198	2.041297	-2.664597	6	10	85	656.364
-0.785398	1.506530	1.988858	19	11	8	656.315
1.570796	1.214854	-1.966664	0	14	81	656.133
-2.094395	1.113094	-0.272241	19	95	73	656.080
-0.261799	1.904882	-1.478089	8	26	2	656.050
-1.832596	1.128190	-2.288622	6	5	81	655.977
-2.617994	1.510910	-0.740472	95	85	86	655.963
0.000000	1.545873	-1.877082	6	7	81	655.954
0.000000	1.909857	-0.381669	3	26	91	655.898
1.570796	0.615174	-0.666022	4	14	90	655.668
-1.047198	2.153910	-1.714959	15	15	17	655.666
0.261799	1.870545	-2.976234	14	11	16	655.597
0.523599	2.349581	-2.702517	85	14	20	655.524
0.000000	1.450119	-2.739050	93	7	81	655.509
-2.356194	0.080730	-2.622036	90	14	92	655.449
1.570796	2.299159	2.264663	71	3	6	655.393
2.356194	2.138223	1.678323	72	88	7	655.355
-2.094395	2.033014	2.977192	14	1	17	655.244
-1.308997	1.310100	1.488307	15	8	73	655.102
2.617994	0.674054	1.013609	79	92	79	655.045
1.308997	1.128190	-2.288622	77	92	82	654.953
2.617994	0.458961	-0.107937	12	3	71	654.946
-0.261799	1.128190	-2.288622	4	4	79	654.941
-0.261799	1.569311	-3.003978	15	9	15	654.917
-2.617994	0.850607	-1.335383	2	2	77	654.892
0.523599	2.247462	0.191623	91	23	13	654.775
0.000000	2.455966	-0.641220	4	22	9	654.756
-2.879793	0.960688	-0.577532	3	77	76	654.750
-1.570796	2.404280	-0.174044	74	2	5	654.613
1.832596	1.128190	-2.288622	71	94	2	654.544
-2.356194	2.247462	0.191623	0	20	74	654.486
-0.523599	2.719179	-1.780644	4	18	11	654.475
0.785398	1.256302	0.062705	83	16	75	654.449
2.356194	0.929350	-2.910676	73	90	93	654.426
-0.523599	2.393226	1.857173	8	17	77	654.137
2.094395	0.379747	-1.713059	75	91	85	653.828
1.570796	2.180315	-1.357379	73	92	6	653.814
0.261799	1.433411	-1.035986	94	20	80	653.805
1.308997	2.041297	-2.664597	87	85	95	653.796
2.617994	2.343981	-1.040456	83	4	92	653.789
-2.617994	0.709924	0.218797	7	91	67	653.695
-1.570796	0.733948	3.021411	17	10	90	653.595
-3.141593	1.909857	-0.381669	85	85	3	653.574
-1.570796	1.574060	2.783565	2	13	82	653.500
1.047198	1.545873	-1.877082	74	0	12	653.372
2.617994	2.187132	-0.479875	79	85	8	653.248
2.617994	1.135834	-1.431087	90	87	76	653.145
-2.617994	1.683268	0.374177	2	25	81	653.134
2.094395	2.299159	2.264663	8	77	3	653.084
0.785398	2.063651	-2.044600	78	12	16	653.002
-1.047198	1.824694	1.850876	21	6	12	652.982
-2.879793	0.615174	-0.666022	87	87	92	652.972
-1.308997	1.194549	-0.801900	7	15	17	652.917
-1.570796	0.619654	-2.216909	92	1	81	652.655
-0.523599	2.073035	2.027405	14	12	17	652.590
0.523599	0.866955	-0.931351	1	12	73	652.547
1.047198	0.929350	-2.910676	3	86	83	652.496
0.785398	2.393226	1.857173	95	19	17	652.408
-2.356194	1.836682	-0.676006	6	77	1	652.366
2.356194	1.982574	-1.115518	76	86	6	652.328
1.570796	1.658653	-2.409879	8	11	20	652.114
0.261799	0.685216	-1.712745	1	24	79	652.112
0.523599	1.555207	1.708892	94	21	78	652.031
-0.261799	1.870545	-2.976234	13	15	15	652.015
-1.308997	1.982574	-1.115518	16	14	17	651.924
-0.523599	2.704512	1.488683	9	7	25	651.812
-2.356194	1.168678	2.108595	11	68	81	651.737
-2.617994	1.134497	-1.109631	14	16	89	651.592
-1.832596	2.579248	-2.364801	12	93	24	651.573
2.094395	1.545873	-1.877082	92	14	82	651.536
-2.879793	2.164094	-2.991358	7	82	21	651.531
0.261799	2.073035	2.027405	2	24	15	651.497
-1.570796	1.391910	3.030322	90	12	81	651.470
2.094395	1.025536	1.576859	79	5	76	651.316
1.832596	1.555207	1.708892	75	3	7	651.313
2.879793	2.979456	-1.009304	6	95	27	651.301
1.308997	2.719179	-1.780644	84	2	23	651.254
1.570796	2.063651	-2.044600	79	82	8	651.201
-0.785398	1.448123	-2.163292	14	18	11	651.137
1.832596	0.992645	-1.723759	85	74	86	651.109
-1.832596	1.045978	0.343692	13	11	72	651.062
-0.261799	1.134497	-1.109631	9	24	2	650.969
-1.832596	0.866395	-2.492918	6	10	82	650.939
0.523599	1.948085	-2.363031	3	11	78	650.917
1.047198	2.089241	-0.114193	74	5	15	650.896
2.356194	2.164094	-2.991358	77	88	17	650.828
-1.570796	2.881233	-2.582574	7	95	27	650.695
-1.570796	0.906588	1.252948	6	4	68	650.622
1.570796	1.325504	-1.671296	81	78	93	650.290
0.523599	1.135813	-2.658866	0	26	85	650.238
-1.832596	0.850607	-1.335383	7	81	84	650.189
0.261799	1.448123	-2.163292	86	20	84	650.048
1.047198	1.325504	-1.671296	77	13	81	650.029
-0.523599	0.733948	3.021411	13	22	82	649.965
1.570796	0.290380	-0.796960	95	16	94	649.930
1.047198	0.866395	-2.492918	80	0	79	649.913
0.785398	2.979456	-1.009304	14	12	95	649.844
0.000000	0.762244	-0.273349	8	12	72	649.787
1.832596	1.836682	-0.676006	87	73	91	649.734
-2.356194	2.033014	2.977192	74	89	4	649.716
-2.617994	0.929350	-2.910676	0	12	19	649.631
1.047198	0.640596	-2.797608	2	22	81	649.378
1.047198	0.458961	-0.107937	85	90	72	649.246
-1.047198	1.448123	-2.163292	14	17	12	649.219
-1.570796	1.599406	1.426070	24	80	84	649.190
-2.356194	1.413347	-1.339188	7	78	86	649.168
1.570796	1.606104	-0.451151	90	10	85	649.117
-0.523599	1.504028	0.636812	94	23	82	649.066
-0.261799	0.297065	2.160177	9	16	74	649.024
0.261799	1.869911	2.701025	3	18	16	648.971
0.785398	1.214854	-1.966664	19	6	84	648.964
-0.261799	0.831641	0.616218	83	15	79	648.941
-2.617994	1.599406	1.426070	14	86	8	648.836
0.000000	1.301460	-0.509251	88	25	81	648.708
1.832596	1.756530	-2.105156	80	83	18	648.686
0.523599	1.195355	1.200319	93	19	72	648.631
0.000000	1.506530	1.988858	7	28	91	648.439
-0.523599	0.992645	-1.723759	14	25	86	648.419
-2.879793	1.569311	-3.003978	93	19	15	648.333
2.617994	2.089241	-0.114193	78	85	2	648.197
0.785398	1.135813	-2.658866	92	25	85	648.097
1.047198	1.662363	0.915448	83	11	75	648.085
-0.523599	1.683268	0.374177	7	24	80	648.070
2.879793	2.588535	-2.976617	3	89	24	648.034
-2.879793	1.135834	-1.431087	92	91	82	648.004
2.617994	1.135813	-2.658866	75	85	1	647.996
0.523599	2.001437	0.381215	7	1	11	647.825
2.094395	1.168678	2.108595	79	6	77	647.795
-2.879793	0.571433	-1.188419	0	4	74	647.551
0.261799	0.496451	0.593859	6	13	93	647.508
0.261799	1.247695	1.809890	3	27	84	647.449
-2.879793	1.045978	0.343692	94	74	87	647.407
2.617994	2.455966	-0.641220	84	85	20	647.371
-0.785398	1.128190	-2.288622	3	3	80	647.264
-2.356194	2.251330	-2.330739	14	87	21	647.150
1.832596	1.658653	-2.409879	72	95	11	647.139
-2.356194	1.506530	1.988858	13	89	9	647.114
-1.047198	1.555207	1.708892	21	7	8	647.095
0.523599	1.504028	0.636812	1	6	11	646.983
1.047198	0.571433	-1.188419	84	90	73	646.887
0.261799	1.662363	0.915448	78	0	80	646.875
1.308997	0.685216	-1.712745	82	89	75	646.875
2.356194	1.335669	0.897240	80	90	77	646.847
-0.261799	0.640596	-2.797608	10	23	80	646.799
0.000000	1.569311	-3.003978	15	11	15	646.704
2.356194	2.187132	-0.479875	86	73	0	646.647
2.879793	1.869911	2.701025	78	78	8	646.598
-0.523599	0.899350	-2.069907	11	23	3	646.594
-2.879793	1.247695	1.809890	3	67	81	646.588
0.523599	1.310100	1.488307	0	26	86	646.393
-0.523599	1.658653	-2.409879	5	8	81	646.304
-0.523599	2.984978	1.954446	87	95	14	646.107
-1.570796	1.310100	1.488307	15	5	73	645.991
0.523599	0.458961	-0.107937	78	5	78	645.985
1.308997	2.180315	-1.357379	77	6	93	645.864
-2.356194	2.343981	-1.040456	13	4	20	645.797
0.261799	2.393226	1.857173	77	93	88	645.707
-2.617994	0.864993	2.278281	2	74	74	645.637
-1.832596	2.664082	-1.071402	11	10	22	645.615
2.356194	1.128190	-2.288622	75	86	3	645.551
-2.617994	0.618092	2.539118	94	81	72	645.509
0.785398	2.115563	0.685730	88	22	12	645.497
2.617994	1.448123	-2.163292	88	19	82	645.480
2.094395	1.335669	0.897240	4	16	77	645.447
2.617994	1.875281	0.107086	87	71	91	645.390
-2.094395	1.050534	3.042579	72	4	10	645.256
0.523599	1.325504	-1.671296	14	11	86	645.025
1.832596	0.496451	0.593859	94	8	67	645.000
0.261799	1.812176	0.656819	94	29	90	644.976
-1.047198	1.699788	2.452890	20	8	12	644.937
1.570796	2.407836	1.410646	86	79	87	644.827
1.308997	0.615174	-0.666022	78	85	85	644.770
-1.570796	1.506530	1.988858	19	5	5	644.605
-0.785398	1.504028	0.636812	3	22	81	644.504
0.785398	2.704512	1.488683	95	17	20	644.468
0.785398	2.349581	-2.702517	83	13	20	644.456
-2.617994	2.247462	0.191623	4	20	74	644.374
0.261799	2.881233	-2.582574	88	5	24	644.336
2.094395	2.579248	-2.364801	91	90	28	644.095
2.094395	2.104282	-0.813972	83	75	0	644.087
1.832596	0.297065	2.160177	84	10	71	643.937
-2.094395	1.135813	-2.658866	0	11	82	643.870
0.261799	2.164094	-2.991358	7	17	18	643.860
-3.141593	0.850607	-1.335383	95	0	78	643.763
-1.047198	1.504028	0.636812	94	2	16	643.711
0.000000	0.685216	-1.712745	79	92	9	643.668
1.308997	1.218453	2.777284	74	7	1	643.653
-0.261799	1.218453	2.777284	11	25	1	643.649
-1.308997	0.733948	3.021411	17	13	90	643.624
-1.308997	2.579248	-2.364801	12	2	25	643.621
-1.047198	1.391910	3.030322	18	17	6	643.443
-3.141593	1.367556	0.358405	91	76	80	643.438
1.308997	0.203748	0.590255	6	1	66	643.433
-2.879793	1.325504	-1.671296	89	6	81	643.409
0.000000	0.458961	-0.107937	2	89	69	643.337
2.356194	2.247462	0.191623	84	75	0	643.252
0.261799	2.041297	-2.664597	2	10	77	643.229
0.785398	2.295480	1.008277	89	21	16	643.181
0.261799	1.194549	-0.801900	87	22	76	643.134
-0.523599	2.379497	0.561089	8	24	90	643.119
-1.308997	0.961715	0.014085	7	21	79	643.099
1.308997	2.587733	0.232235	74	94	10	643.070
0.261799	0.458961	-0.107937	79	10	77	642.976
-1.047198	2.478122	2.609777	78	88	90	642.945
2.879793	2.881233	-2.582574	2	7	23	642.810
0.000000	1.870545	-2.976234	14	8	17	642.788
-0.523599	0.709924	0.218797	75	85	11	642.761
-1.308997	0.618092	2.539118	16	10	87	642.708
-1.308997	1.683268	0.374177	82	13	77	642.655
1.047198	2.251330	-2.330739	79	9	19	642.597
-2.356194	1.113094	-0.272241	7	76	87	642.580
-2.879793	1.450119	-2.739050	74	93	4	642.550
-1.047198	1.433411	-1.035986	10	24	88	642.444
-1.832596	1.413347	-1.339188	26	1	83	642.436
0.000000	1.721184	-0.153948	88	27	88	642.397
-0.261799	1.555207	1.708892	11	27	91	642.326
-3.141593	1.812176	0.656819	2	68	85	642.280
-1.308997	0.866955	-0.931351	9	18	76	642.201
1.047198	1.721184	-0.153948	78	14	83	642.197
-3.141593	1.554776	0.100351	93	73	85	642.194
-2.879793	0.992645	-1.723759	89	7	84	642.121
-2.879793	1.872854	1.543456	14	91	8	642.115
0.523599	1.433411	-1.035986	91	19	80	641.929
-0.523599	2.863997	0.549740	8	14	21	641.884
1.832596	1.168678	2.108595	79	10	77	641.854
-0.261799	2.153910	-1.714959	9	94	76	641.844
0.523599	1.510910	-0.740472	83	21	81	641.785
0.000000	0.700570	1.559208	10	9	70	641.753
-0.261799	2.343981	-1.040456	6	23	8	641.656
-2.879793	1.134796	2.434290	94	76	76	641.605
-1.570796	0.914445	2.687814	19	9	92	641.520
-2.617994	0.906588	1.252948	6	72	74	641.489
-1.570796	1.413430	2.550734	90	14	78	641.482
-1.308997	1.904882	-1.478089	16	13	17	641.479
-0.785398	2.404280	-0.174044	12	23	7	641.289
0.523599	1.448123	-2.163292	75	9	94	641.136
-2.094395	0.571433	-1.188419	91	82	92	641.010
1.047198	0.419640	2.974122	87	92	74	640.941
-2.094395	0.929350	-2.910676	73	3	14	640.909
-2.356194	2.724429	-0.348782	10	91	25	640.830
2.356194	1.554776	0.100351	93	72	80	640.671
2.094395	2.587733	0.232235	76	92	10	640.614
-0.261799	0.618092	2.539118	10	21	78	640.512
0.261799	1.606104	-0.451151	88	22	83	640.475
-1.570796	1.569311	-3.003978	2	10	80	640.312
1.570796	1.310100	1.488307	91	88	11	640.237
1.570796	0.080730	-2.622036	81	2	75	640.236
2.879793	0.850607	-1.335383	92	0	79	640.151
-1.832596	0.203748	0.590255	92	7	67	640.137
1.832596	2.108018	1.311430	79	80	94	640.118
2.617994	1.335669	0.897240	87	73	79	640.020
-0.261799	2.984978	1.954446	6	1	27	639.977
2.356194	0.615174	-0.666022	88	6	77	639.911
-1.308997	1.242974	-2.977882	0	8	81	639.793
0.261799	2.478122	2.609777	9	17	18	639.750
0.785398	2.881233	-2.582574	88	3	24	639.743
2.356194	1.846342	-1.796954	2	88	82	639.698
-3.141593	2.089241	-0.114193	84	86	5	639.544
0.785398	2.407836	1.410646	92	19	18	639.490
0.261799	1.335669	0.897240	0	21	75	639.432
-1.047198	2.251330	-2.330739	5	88	24	639.361
-2.356194	2.719179	-1.780644	10	7	21	639.314
2.356194	1.948085	-2.363031	76	90	15	639.309
1.308997	2.592629	0.909713	73	2	10	639.258
1.047198	2.407836	1.410646	89	18	18	639.218
1.832596	1.904882	-1.478089	78	79	3	639.207
-0.523599	1.662363	0.915448	0	23	82	639.199
2.879793	0.762244	-0.273349	82	95	4	639.102
2.879793	1.504028	0.636812	92	70	81	638.960
1.308997	0.899350	-2.069907	80	91	78	638.912
-0.785398	0.685216	-1.712745	4	81	85	638.790
2.617994	1.374601	-2.456031	11	21	13	638.675
-2.879793	1.870545	-2.976234	78	85	92	638.584
-0.785398	2.041297	-2.664597	95	12	86	638.569
0.523599	1.135834	-1.431087	9	8	83	638.527
1.832596	0.960688	-0.577532	83	0	71	638.517
0.261799	0.866395	-2.492918	5	26	83	638.460
1.308997	2.295480	1.008277	70	3	5	638.364
-0.261799	1.506530	1.988858	12	27	91	638.219
-0.785398	0.733948	3.021411	16	19	82	638.168
1.570796	1.128190	-2.288622	70	2	2	638.159
0.000000	1.214854	-1.966664	90	23	81	638.052
-0.261799	0.203748	0.590255	81	6	76	637.802
2.356194	2.664082	-1.071402	81	89	13	637.755
-1.047198	2.979456	-1.009304	5	14	21	637.716
0.000000	2.407836	1.410646	6	21	17	637.510
-0.523599	1.413347	-1.339188	13	27	87	637.472
2.617994	1.433411	-1.035986	87	10	87	637.421
0.261799	1.134796	2.434290	5	26	86	637.340
0.261799	1.045978	0.343692	85	18	74	637.216
2.356194	0.619654	-2.216909	91	22	90	637.188
0.785398	0.640596	-2.797608	0	24	83	637.111
2.879793	1.195355	1.200319	88	86	74	637.081
2.094395	2.404280	-0.174044	93	7	75	636.972
2.617994	0.591903	2.010408	78	91	80	636.945
2.617994	2.174483	2.653697	76	87	13	636.875
1.570796	2.041297	-2.664597	3	85	80	636.837
0.000000	1.135813	-2.658866	12	24	1	636.781
0.000000	1.128190	-2.288622	94	1	81	636.676
-3.141593	0.762244	-0.273349	94	93	70	636.661
-0.785398	0.709924	0.218797	80	9	76	636.653
-0.523599	2.356369	3.005869	9	3	24	636.531
0.261799	0.418037	1.360082	13	1	71	636.514
0.261799	1.741644	-2.695914	89	26	89	636.476
-1.832596	0.640596	-2.797608	86	12	88	636.451
-0.785398	1.134796	2.434290	16	19	1	636.404
0.785398	2.592629	0.909713	91	18	19	636.365
-0.785398	2.356369	3.005869	9	93	24	636.349
-0.523599	0.379747	-1.713059	0	20	75	636.226
0.523599	2.073035	2.027405	93	22	16	636.194
-2.879793	1.875281	0.107086	83	8	5	636.191
-2.879793	1.184361	0.625864	3	27	89	636.171
1.570796	1.812176	0.656819	14	13	79	636.084
1.570796	2.984978	1.954446	1	12	22	636.058
-0.261799	2.404280	-0.174044	6	23	15	635.912
1.570796	0.571433	-1.188419	6	15	89	635.816
-2.879793	2.247462	0.191623	87	88	9	635.681
0.261799	0.992645	-1.723759	86	17	75	635.602
2.879793	1.824694	1.850876	76	81	2	635.587
2.617994	2.073035	2.027405	78	85	15	635.435
-1.308997	0.203748	0.590255	82	12	75	635.407
-1.832596	2.396274	-1.959260	13	5	21	635.338
1.308997	0.458961	-0.107937	84	83	79	635.283
0.523599	1.846342	-1.796954	82	17	90	635.275
-1.047198	2.863997	0.549740	5	18	74	635.252
-0.523599	1.325504	-1.671296	9	19	13	635.208
2.617994	2.984978	1.954446	1	11	19	635.206
-3.141593	1.506530	1.988858	86	73	90	635.114
0.523599	1.391910	3.030322	78	12	0	635.103
0.785398	0.080730	-2.622036	79	3	6	634.985
0.785398	0.619654	-2.216909	94	22	79	634.866
-2.094395	0.297065	2.160177	8	78	69	634.863
0.523599	2.760637	2.781135	1	17	23	634.838
-2.356194	1.732874	-0.951685	8	79	90	634.789
1.308997	2.247462	0.191623	16	6	5	634.766
-2.094395	2.379497	0.561089	23	75	6	634.647
-0.523599	1.367556	0.358405	15	23	79	634.556
-2.879793	1.195355	1.200319	5	71	75	634.511
0.523599	1.574060	2.783565	84	92	91	634.492
-0.523599	2.396274	-1.959260	4	13	89	634.484
-2.879793	1.982574	-1.115518	7	74	90	634.454
-0.785398	2.407836	1.410646	14	8	21	634.417
2.617994	1.413347	-1.339188	9	16	18	634.339
0.523599	0.080730	-2.622036	6	16	73	634.202
0.523599	1.113094	-0.272241	85	19	74	634.186
-1.047198	2.379497	0.561089	16	21	5	634.082
0.261799	2.001437	0.381215	0	26	9	634.053
0.261799	0.290380	-0.796960	80	7	76	633.995
0.000000	0.910508	1.903534	11	13	71	633.975
-0.261799	1.310100	1.488307	10	20	75	633.931
-1.832596	1.869911	2.701025	78	83	86	633.927
0.261799	1.756530	-2.105156	86	20	89	633.874
-3.141593	0.961715	0.014085	94	77	76	633.839
0.000000	1.732874	-0.951685	88	24	87	633.777
2.356194	2.343981	-1.040456	78	86	9	633.738
2.617994	1.683268	0.374177	91	71	83	633.699
2.879793	2.108018	1.311430	16	7	5	633.500
-0.523599	0.864993	2.278281	7	0	15	633.378
-2.356194	1.606104	-0.451151	5	79	91	633.350
0.523599	1.909857	-0.381669	92	24	1	633.176
0.000000	1.218453	2.777284	83	91	86	633.111
2.879793	2.407836	1.410646	78	83	8	633.036
0.000000	0.640596	-2.797608	1	82	85	632.938
1.308997	0.866395	-2.492918	72	1	92	632.850
1.047198	1.128190	-2.288622	78	2	81	632.700
2.879793	0.496451	0.593859	90	95	68	632.657
-1.832596	1.569311	-3.003978	16	7	87	632.637
-2.879793	0.619654	-2.216909	6	66	93	632.527
0.261799	1.214854	-1.966664	85	22	81	632.417
0.523599	0.297065	2.160177	3	15	67	632.267
-0.785398	0.864993	2.278281	15	17	92	632.248
-0.261799	1.325504	-1.671296	93	24	82	632.228
1.308997	2.979456	-1.009304	87	84	22	632.219
2.617994	1.554776	0.100351	2	70	80	632.108
-1.047198	1.310100	1.488307	21	7	3	632.079
2.094395	1.325504	-1.671296	86	90	78	632.004
-1.832596	1.982574	-1.115518	95	16	79	631.980
2.879793	0.080730	-2.622036	81	93	76	631.978
0.523599	1.662363	0.915448	88	25	85	631.964
0.523599	0.762244	-0.273349	4	11	72	631.959
1.832596	1.014500	0.906702	86	7	71	631.921
0.000000	1.391910	3.030322	9	27	1	631.910
1.570796	0.910508	1.903534	80	15	78	631.733
-2.879793	1.218453	2.777284	88	81	78	631.715
-2.094395	1.433411	-1.035986	26	92	83	631.648
2.879793	0.591903	2.010408	89	77	76	631.592
1.047198	0.762244	-0.273349	80	94	74	631.339
