<svg width="67" height="77" viewBox="0 0 67 77" fill="none" xmlns="http://www.w3.org/2000/svg">
<path d="M33.4973 4.70865e-09C21.2053 0.000160052 8.36789 4.07948 0.838673 12.9203L0.0486743 13.8479L0.00997206 15.0652L3.49254 15.1757C0.00997206 15.0652 0.00987617 15.0682 0.00987617 15.0682L0.00975274 15.0722L0.00943018 15.0832L0.00852421 15.1165C0.00782071 15.1438 0.00694037 15.1811 0.00601447 15.2283C0.00416265 15.3226 0.00212785 15.4563 0.000963164 15.6272C-0.00136572 15.9689 -0.000217182 16.4597 0.0128568 17.083C0.0389934 18.329 0.112858 20.1075 0.302534 22.284C0.681198 26.6292 1.52501 32.6029 3.39342 39.1122C7.11547 52.0794 15.0436 67.6072 31.9155 76.1948L33.4973 77L35.0792 76.1948C51.9509 67.6073 59.8804 52.0797 63.6038 39.1126C65.473 32.6033 66.3175 26.6296 66.6967 22.2845C66.8866 20.1079 66.9607 18.3294 66.987 17.0834C67.0001 16.4602 67.0014 15.9693 66.9991 15.6276C66.9979 15.4567 66.9959 15.3231 66.9941 15.2288C66.9932 15.1816 66.9923 15.1442 66.9916 15.117L66.9907 15.0836L66.9904 15.0727L66.9902 15.0687C66.9902 15.0687 66.9901 15.0656 63.5076 15.1757L66.9901 15.0656L66.9516 13.8477L66.161 12.9197C58.6288 4.07918 45.7898 -0.000160033 33.4973 4.70865e-09Z" fill="#ACACAC"/>
<path d="M28.909 41.1149C28.5823 40.0369 28.419 39.1549 28.419 38.4689C28.419 37.7829 28.5497 37.0642 28.811 36.3129C29.0723 35.5615 29.693 34.6959 30.673 33.7159C31.6857 32.7032 32.7147 31.8539 33.76 31.1679C34.838 30.4819 35.7853 29.6325 36.602 28.6199C37.4187 27.6072 37.827 26.5292 37.827 25.3859C37.827 22.9359 36.161 21.7109 32.829 21.7109C31.457 21.7109 30.1503 21.9722 28.909 22.4949C28.811 24.1935 28.5007 25.5492 27.978 26.5619H23.323C22.8983 25.7125 22.5717 24.6345 22.343 23.3279C22.1143 21.9885 22 21.0412 22 20.4859C22 19.9305 22 19.5549 22 19.3589C23.4047 18.4115 25.1197 17.6765 27.145 17.1539C29.203 16.6312 31.1793 16.3699 33.074 16.3699C36.7 16.3699 39.6727 17.2029 41.992 18.8689C44.3113 20.5022 45.471 22.8542 45.471 25.9249C45.471 27.2642 45.177 28.5055 44.589 29.6489C44.0337 30.7595 43.3313 31.6742 42.482 32.3929C41.6653 33.0789 40.767 33.7812 39.787 34.4999C38.8397 35.2185 37.9577 35.8719 37.141 36.4599C35.4097 37.6359 34.544 39.0405 34.544 40.6739C34.544 40.8045 34.5603 40.9515 34.593 41.1149H28.909ZM31.604 50.9639C28.8927 50.9639 27.537 49.7389 27.537 47.2889C27.537 44.8062 28.8927 43.5649 31.604 43.5649C34.348 43.5649 35.72 44.8062 35.72 47.2889C35.72 49.7389 34.348 50.9639 31.604 50.9639Z" fill="white"/>
</svg>
