<svg width="67" height="77" viewBox="0 0 67 77" fill="none" xmlns="http://www.w3.org/2000/svg">
<path d="M33.4973 4.70865e-09C21.2053 0.000160052 8.36789 4.07948 0.838673 12.9203L0.0486743 13.8479L0.00997206 15.0652L3.49254 15.1757C0.00997206 15.0652 0.00987617 15.0682 0.00987617 15.0682L0.00975274 15.0722L0.00943018 15.0832L0.00852422 15.1165C0.00782071 15.1438 0.00694037 15.1811 0.00601447 15.2283C0.00416265 15.3226 0.00212785 15.4563 0.000963164 15.6272C-0.00136572 15.9689 -0.000217182 16.4597 0.0128568 17.083C0.0389934 18.329 0.112858 20.1075 0.302534 22.284C0.681198 26.6292 1.52501 32.6029 3.39342 39.1122C7.11547 52.0794 15.0436 67.6072 31.9155 76.1948L33.4973 77L35.0792 76.1948C51.9509 67.6073 59.8804 52.0797 63.6038 39.1126C65.473 32.6033 66.3175 26.6296 66.6967 22.2845C66.8866 20.1079 66.9607 18.3294 66.987 17.0834C67.0001 16.4602 67.0014 15.9693 66.9991 15.6276C66.9979 15.4567 66.9959 15.3231 66.9941 15.2287C66.9932 15.1816 66.9923 15.1442 66.9916 15.117L66.9907 15.0836L66.9904 15.0727L66.9902 15.0687C66.9902 15.0687 66.9901 15.0656 63.5076 15.1757L66.9901 15.0656L66.9516 13.8477L66.161 12.9197C58.6288 4.07918 45.7898 -0.000160033 33.4973 4.70865e-09Z" fill="#F4B514"/>
<g clip-path="url(#clip0)">
<path fill-rule="evenodd" clip-rule="evenodd" d="M25.4501 30.4015C25.9367 31.133 26.843 31.3566 27.8131 31.3566C28.5237 31.3566 29.2681 31.2368 29.9064 31.1082C30.2554 31.0383 30.492 30.712 30.4512 30.3579C30.1045 27.3818 28.6329 25.2436 26.0774 24.0028C25.737 23.8373 25.3275 23.98 25.1632 24.3196C24.9981 24.6596 25.1396 25.0691 25.48 25.2346C25.8502 25.4146 26.1922 25.6151 26.5058 25.8371C25.1435 27.9792 24.8094 29.4374 25.4501 30.4015ZM26.5907 29.6434C26.483 29.4818 26.2676 28.8219 27.5411 26.762C28.2792 27.596 28.7603 28.6309 28.9953 29.8808C27.1119 30.1696 26.6819 29.7809 26.5907 29.6434Z" fill="black"/>
<path d="M27.2556 37.8901C27.4005 38.8386 27.6067 39.6814 27.8737 40.418C25.598 40.2302 24.0142 39.4078 23.0439 37.9145C22.8379 37.5985 22.415 37.5081 22.0966 37.714C21.7798 37.92 21.6902 38.3437 21.8962 38.6613C23.2079 40.6793 25.4409 41.7433 28.5331 41.8244C29.4946 43.4198 30.9046 44.2236 32.7527 44.2236C32.8311 44.2236 32.9095 44.2223 32.989 44.2192C33.0686 44.2223 33.1476 44.2236 33.226 44.2236C35.0872 44.2236 36.5026 43.4197 37.4611 41.8242C40.5664 41.7443 42.7951 40.6779 44.0842 38.6555C44.2878 38.3363 44.1942 37.9134 43.8751 37.7106C43.5567 37.5062 43.1338 37.6005 42.9302 37.9197C41.979 39.4118 40.4 40.2329 38.1162 40.4186C38.3807 39.6819 38.5831 38.8388 38.7231 37.8901C40.5884 37.1465 41.4233 36.3934 41.4178 35.4713C41.4099 34.2442 39.8605 33.536 38.5116 33.0557C38.1579 32.9268 37.764 33.1138 37.6375 33.4707C37.5101 33.8268 37.6964 34.2183 38.0525 34.3449C39.9376 35.0162 40.0484 35.4768 40.0484 35.4792C40.0484 35.4839 39.9415 35.9838 37.8615 36.755C37.6225 36.843 37.452 37.0584 37.4205 37.3115C36.7363 42.784 34.144 42.888 33.1258 42.8545C33.0789 42.8465 33.0305 42.8442 32.9811 42.8483C32.9532 42.8475 32.9252 42.849 32.8974 42.8526C31.9303 42.8862 29.2821 42.8679 28.5558 37.3076C28.5236 37.0561 28.3546 36.8438 28.1164 36.755C26.0625 35.9886 25.9505 35.4932 25.9484 35.484C25.9492 35.4793 26.0553 35.0193 27.9474 34.3449C28.3035 34.2183 28.4898 33.8268 28.3625 33.4707C28.2351 33.1138 27.8429 32.9268 27.4883 33.0557C26.244 33.4982 24.5892 34.2309 24.5798 35.4729C24.5727 36.3934 25.4021 37.1465 27.2556 37.8901Z" fill="black"/>
<path fill-rule="evenodd" clip-rule="evenodd" d="M38.187 31.3566C37.4764 31.3566 36.732 31.2368 36.0937 31.1082C35.7446 31.0383 35.508 30.712 35.5489 30.3579C35.7981 28.2209 36.6266 26.5159 38.0203 25.2649C38.062 25.213 38.1123 25.1658 38.1705 25.1261C38.1831 25.1175 38.1964 25.1092 38.2098 25.1014C38.7121 24.6796 39.2836 24.3133 39.9227 24.0028C40.263 23.8373 40.6726 23.98 40.8369 24.3196C41.002 24.6596 40.8605 25.0691 40.5201 25.2346C40.1443 25.417 39.7977 25.621 39.4809 25.847C40.8471 27.9816 41.1859 29.437 40.5476 30.4008C40.0634 31.133 39.157 31.3566 38.187 31.3566ZM37.0047 29.8808C38.8827 30.1696 39.315 29.7825 39.4062 29.6449C39.5131 29.4838 39.7254 28.8258 38.4472 26.7745C37.7161 27.6066 37.239 28.6372 37.0047 29.8808Z" fill="black"/>
<path fill-rule="evenodd" clip-rule="evenodd" d="M48.5417 36.1022C48.8319 35.5212 49.0251 34.9774 49.1223 34.4682C50.6359 33.3156 52.0476 31.1595 50.9813 27.2449C52.2272 25.8602 52.9056 24.2381 52.9992 22.4176C53.0086 22.2254 52.9371 22.0379 52.8019 21.9007C52.6666 21.7643 52.4788 21.6944 52.287 21.6987C49.6212 21.8095 47.306 23.3542 45.3926 26.2941C43.1316 22.1335 39.0276 20.032 33.1348 20.032L33.0038 20.0324L32.9925 20.0322C27.0279 20.0077 22.8829 22.1028 20.6068 26.2934C18.6936 23.3548 16.3793 21.8105 13.7138 21.6987C13.5024 21.694 13.3333 21.764 13.1981 21.9007C13.0629 22.0375 12.9914 22.2254 13.0008 22.4176C13.0952 24.2602 13.7736 25.8834 15.0171 27.2481C14.1377 30.4645 14.7612 32.8958 16.8742 34.4833C16.9736 34.9884 17.1674 35.528 17.4568 36.1046C16.4665 37.281 15.9427 38.99 15.8983 41.1942C15.8976 41.2297 15.8997 41.2647 15.9043 41.299C15.9171 41.3944 15.9502 41.4886 16.0052 41.5752C19.1559 46.5252 24.1404 49.025 30.8434 49.025C31.5399 49.025 32.2551 48.998 32.9877 48.9439C33.7239 48.9981 34.4406 49.0251 35.1393 49.0251C41.8511 49.0251 46.8307 46.5309 49.9609 41.5918C50.0367 41.4803 50.0804 41.3453 50.0789 41.2003C50.057 38.9973 49.5404 37.2859 48.5417 36.1022ZM45.9794 38.6402C46.1052 38.74 46.2561 38.7887 46.4047 38.7887C46.6067 38.7887 46.8064 38.6999 46.9416 38.5301C47.2569 38.1333 47.5388 37.7502 47.7875 37.3805C48.3592 38.2638 48.6672 39.4806 48.706 41.013C45.5281 45.9019 40.2734 48.1103 33.0696 47.5778C33.0464 47.5751 33.0228 47.5736 32.9991 47.5733C32.9657 47.5725 32.9326 47.5742 32.9002 47.5782C25.7259 48.1085 20.4716 45.9011 17.2734 41.014C17.3279 39.4789 17.6429 38.2621 18.2124 37.3815C18.4613 37.7508 18.7432 38.1334 19.0584 38.5299C19.1936 38.6997 19.3933 38.7886 19.5953 38.7886C19.7438 38.7886 19.8948 38.7398 20.0206 38.64C20.3161 38.4042 20.3656 37.9742 20.1306 37.6778C19.6321 37.0507 19.2263 36.4636 18.9157 35.9225C18.9005 35.8898 18.8826 35.858 18.8619 35.8274C18.2659 34.761 18.0479 33.8782 18.2275 33.2255C18.3996 32.6029 18.9483 32.1238 19.905 31.7622C20.1275 31.678 20.2902 31.4851 20.335 31.2516C21.6132 24.6241 25.7039 21.4008 32.84 21.4008C32.8816 21.4008 32.9177 21.4008 32.9622 21.4012C32.971 21.4016 32.9798 21.4017 32.9886 21.4017C33.015 21.4017 33.0417 21.4 33.0673 21.3971L33.09 21.3986C33.106 21.3997 33.1221 21.4008 33.1379 21.4009C40.2882 21.4009 44.3868 24.6247 45.665 31.2518C45.7098 31.4845 45.8717 31.6774 46.0934 31.7619C47.0461 32.1247 47.5925 32.6054 47.7638 33.2311C47.8216 33.442 47.8384 33.6765 47.8148 33.933C47.8036 33.9813 47.7976 34.0308 47.7971 34.0805C47.7221 34.5909 47.4975 35.182 47.1279 35.8429C47.1145 35.8638 47.1023 35.8854 47.0914 35.9074C46.7806 36.453 46.3724 37.0452 45.8694 37.678C45.6343 37.9744 45.6839 38.4044 45.9794 38.6402ZM49.5608 27.2598C50.2796 29.6166 50.1066 31.4051 49.0283 32.687C48.7252 31.8075 48.0233 31.1169 46.9361 30.6292C46.7197 29.6057 46.4365 28.6557 46.0869 27.7795C47.6624 25.054 49.4548 23.5323 51.541 23.1549C51.3146 24.4346 50.7069 25.5839 49.7275 26.5803C49.5514 26.7591 49.4877 27.0197 49.5608 27.2598ZM19.9128 27.7792C19.5638 28.6549 19.281 29.6045 19.0647 30.6278C17.9664 31.1163 17.2597 31.8099 16.959 32.695C15.8864 31.4172 15.7178 29.626 16.4392 27.2599C16.5131 27.0178 16.447 26.7548 16.2686 26.576C15.2907 25.5985 14.6838 24.4516 14.4582 23.1577C16.5266 23.5444 18.358 25.0947 19.9128 27.7792Z" fill="black"/>
</g>
<defs>
<clipPath id="clip0">
<rect width="40" height="40" fill="black" transform="translate(13 13)"/>
</clipPath>
</defs>
</svg>
