<svg width="67" height="77" viewBox="0 0 67 77" fill="none" xmlns="http://www.w3.org/2000/svg">
<path d="M33.4973 4.70865e-09C21.2053 0.000160052 8.36789 4.07948 0.838673 12.9203L0.0486743 13.8479L0.00997206 15.0652L3.49254 15.1757C0.00997206 15.0652 0.00987617 15.0682 0.00987617 15.0682L0.00975274 15.0722L0.00943018 15.0832L0.00852421 15.1165C0.00782071 15.1438 0.00694037 15.1811 0.00601447 15.2283C0.00416265 15.3226 0.00212785 15.4563 0.000963164 15.6272C-0.00136572 15.9689 -0.000217182 16.4597 0.0128568 17.083C0.0389934 18.329 0.112858 20.1075 0.302534 22.284C0.681198 26.6292 1.52501 32.6029 3.39342 39.1122C7.11547 52.0794 15.0436 67.6072 31.9155 76.1948L33.4973 77L35.0792 76.1948C51.9509 67.6073 59.8804 52.0797 63.6038 39.1126C65.473 32.6033 66.3175 26.6296 66.6967 22.2845C66.8866 20.1079 66.9607 18.3294 66.987 17.0834C67.0001 16.4602 67.0014 15.9693 66.9991 15.6276C66.9979 15.4567 66.9959 15.3231 66.9941 15.2288C66.9932 15.1816 66.9923 15.1442 66.9916 15.117L66.9907 15.0836L66.9904 15.0727L66.9902 15.0687C66.9902 15.0687 66.9901 15.0656 63.5076 15.1757L66.9901 15.0656L66.9516 13.8477L66.161 12.9197C58.6288 4.07918 45.7898 -0.000160033 33.4973 4.70865e-09Z" fill="black"/>
<path d="M32.7422 28.384C32.7422 29.8347 32.2836 31.0507 31.3662 32.032C30.4702 33.0134 29.3396 33.76 27.9742 34.272C29.0409 34.72 29.7449 35.264 30.0862 35.904L32.4222 40.352C33.4249 40.6934 34.1076 41.088 34.4702 41.536L34.1502 44H28.7422L25.0622 36.16C24.7209 35.3707 24.3262 34.976 23.8782 34.976H21.7982V40.096C23.3556 40.4374 24.3262 40.8534 24.7102 41.344L24.3902 44H15.7502L15.4302 41.344C15.7076 40.9814 16.2942 40.6294 17.1902 40.288V25.664C16.3156 25.344 15.7289 24.9814 15.4302 24.576L15.7502 21.92H23.9102C26.8969 21.9627 29.1156 22.4427 30.5662 23.36C32.0169 24.2774 32.7422 25.952 32.7422 28.384ZM23.6862 25.408H21.7982V31.488H23.6222C25.0729 31.488 26.1502 31.2747 26.8542 30.848C27.5796 30.4 27.9422 29.6107 27.9422 28.48C27.9422 27.3494 27.5796 26.56 26.8542 26.112C26.1289 25.6427 25.0729 25.408 23.6862 25.408Z" fill="white"/>
<path d="M52.836 28.384C52.836 29.8347 52.3773 31.0507 51.46 32.032C50.564 33.0134 49.4333 33.76 48.068 34.272C49.1347 34.72 49.8387 35.264 50.18 35.904L52.516 40.352C53.5187 40.6934 54.2013 41.088 54.564 41.536L54.244 44H48.836L45.156 36.16C44.8147 35.3707 44.42 34.976 43.972 34.976H41.892V40.096C43.4493 40.4374 44.42 40.8534 44.804 41.344L44.484 44H35.844L35.524 41.344C35.8013 40.9814 36.388 40.6294 37.284 40.288V25.664C36.4093 25.344 35.8227 24.9814 35.524 24.576L35.844 21.92H44.004C46.9907 21.9627 49.2093 22.4427 50.66 23.36C52.1107 24.2774 52.836 25.952 52.836 28.384ZM43.78 25.408H41.892V31.488H43.716C45.1667 31.488 46.244 31.2747 46.948 30.848C47.6733 30.4 48.036 29.6107 48.036 28.48C48.036 27.3494 47.6733 26.56 46.948 26.112C46.2227 25.6427 45.1667 25.408 43.78 25.408Z" fill="white"/>
</svg>
