<svg width="67" height="77" viewBox="0 0 67 77" fill="none" xmlns="http://www.w3.org/2000/svg">
<path d="M33.4973 4.70865e-09C21.2053 0.000160052 8.36789 4.07948 0.838673 12.9203L0.0486743 13.8479L0.00997206 15.0652L3.49254 15.1757C0.00997206 15.0652 0.00987617 15.0682 0.00987617 15.0682L0.00975274 15.0722L0.00943018 15.0832L0.00852421 15.1165C0.00782071 15.1438 0.00694037 15.1811 0.00601447 15.2283C0.00416265 15.3226 0.00212785 15.4563 0.000963164 15.6272C-0.00136572 15.9689 -0.000217182 16.4597 0.0128568 17.083C0.0389934 18.329 0.112858 20.1075 0.302534 22.284C0.681198 26.6292 1.52501 32.6029 3.39342 39.1122C7.11547 52.0794 15.0436 67.6072 31.9155 76.1948L33.4973 77L35.0792 76.1948C51.9509 67.6073 59.8804 52.0797 63.6038 39.1126C65.473 32.6033 66.3175 26.6296 66.6967 22.2845C66.8866 20.1079 66.9607 18.3294 66.987 17.0834C67.0001 16.4602 67.0014 15.9693 66.9991 15.6276C66.9979 15.4567 66.9959 15.3231 66.9941 15.2288C66.9932 15.1816 66.9923 15.1442 66.9916 15.117L66.9907 15.0836L66.9904 15.0727L66.9902 15.0687C66.9902 15.0687 66.9901 15.0656 63.5076 15.1757L66.9901 15.0656L66.9516 13.8477L66.161 12.9197C58.6288 4.07918 45.7898 -0.000160033 33.4973 4.70865e-09Z" fill="#309FDD"/>
<path d="M54.9251 32.3641L49.1234 19.3513C49.8624 19.047 50.32 18.2624 50.1742 17.4398C50.0082 16.4942 49.1044 15.8604 48.1563 16.0264C47.5542 16.1329 47.0814 16.536 46.8583 17.0582L36.4984 18.8848C35.852 17.5906 34.4133 16.8149 32.9176 17.0798C31.4206 17.3422 30.3342 18.5628 30.1707 20.0015L19.8096 21.8294C19.4205 21.4136 18.8387 21.1956 18.2378 21.3021C17.2897 21.4706 16.6559 22.3744 16.8245 23.3226C16.931 23.931 17.3442 24.4063 17.8766 24.6269L12.0749 37.6398H11C11 41.4475 14.3755 44.5341 18.5395 44.5341C22.7035 44.5341 26.0777 41.4463 26.0777 37.6398H25.0041L19.2037 24.6269C19.6322 24.4507 19.9643 24.1148 20.1404 23.7016L30.5003 21.8775C30.9161 22.7091 31.6563 23.3238 32.5335 23.5887V45.7738H25.3679C23.5768 45.7738 22.1229 47.2264 22.1229 49.0175V49.2507H45.4766V49.0175C45.4766 47.2277 44.0253 45.7738 42.2329 45.7738H35.0686V23.3428C36.0421 22.8282 36.7051 21.8572 36.8293 20.7608L47.1904 18.9342C47.3602 19.1155 47.5669 19.2562 47.7976 19.3525L41.9972 32.3654H40.9223C40.9223 36.1732 44.2965 39.2597 48.4605 39.2597C52.6245 39.2597 56 36.1719 56 32.3654H54.9251V32.3641ZM13.4616 37.6398L18.5395 26.2519L23.6174 37.6398H13.4616ZM43.3813 32.3641L48.4592 20.9763L53.5371 32.3641H43.3813Z" fill="white"/>
</svg>
