<svg width="67" height="77" viewBox="0 0 67 77" fill="none" xmlns="http://www.w3.org/2000/svg">
<path d="M33.4973 4.70865e-09C21.2053 0.000160052 8.36789 4.07948 0.838673 12.9203L0.0486743 13.8479L0.00997206 15.0652L3.49254 15.1757C0.00997206 15.0652 0.00987617 15.0682 0.00987617 15.0682L0.00975274 15.0722L0.00943018 15.0832L0.00852422 15.1165C0.00782071 15.1438 0.00694037 15.1811 0.00601447 15.2283C0.00416265 15.3226 0.00212785 15.4563 0.000963164 15.6272C-0.00136572 15.9689 -0.000217182 16.4597 0.0128568 17.083C0.0389934 18.329 0.112858 20.1075 0.302534 22.284C0.681198 26.6292 1.52501 32.6029 3.39342 39.1122C7.11547 52.0794 15.0436 67.6072 31.9155 76.1948L33.4973 77L35.0792 76.1948C51.9509 67.6073 59.8804 52.0797 63.6038 39.1126C65.473 32.6033 66.3175 26.6296 66.6967 22.2845C66.8866 20.1079 66.9607 18.3294 66.987 17.0834C67.0001 16.4602 67.0014 15.9693 66.9991 15.6276C66.9979 15.4567 66.9959 15.3231 66.9941 15.2287C66.9932 15.1816 66.9923 15.1442 66.9916 15.117L66.9907 15.0836L66.9904 15.0727L66.9902 15.0687C66.9902 15.0687 66.9901 15.0656 63.5076 15.1757L66.9901 15.0656L66.9516 13.8477L66.161 12.9197C58.6288 4.07918 45.7898 -0.000160033 33.4973 4.70865e-09Z" fill="#F4B514"/>
<path d="M54.281 40.9844C54.1634 40.9179 54.0127 40.9535 53.9385 41.068C53.9359 41.0722 53.6748 41.4679 53.145 42.0746C52.3546 42.9712 51.5379 43.7152 50.648 44.3477C49.7271 45.006 48.2536 45.8645 46.4639 46.2137C45.6508 46.3752 44.813 46.4263 43.9638 46.3618C43.2844 46.3148 42.56 46.1735 41.8109 45.9403C41.7217 45.9135 41.6231 45.9357 41.555 46.0012C41.4869 46.0672 41.4606 46.1642 41.4859 46.2555C41.653 46.8617 41.6876 47.5118 41.587 48.1871C41.5762 48.2557 41.5947 48.3259 41.6365 48.3811C41.6788 48.4363 41.7413 48.4724 41.8104 48.4806C42.3248 48.5441 42.8257 48.5766 43.2988 48.5766C43.5186 48.5766 43.7378 48.5694 43.954 48.5555C44.9802 48.4961 45.9857 48.299 46.9427 47.9704C48.5446 47.423 50.0397 46.5052 51.3847 45.2438C52.238 44.4436 52.9933 43.5449 53.6949 42.494C54.167 41.7805 54.379 41.3384 54.3878 41.3198C54.4456 41.1975 54.3986 41.051 54.281 40.9844ZM39.497 44.2538C39.4078 44.2811 39.3392 44.3554 39.3191 44.4467C39.3015 44.5272 39.0002 45.6669 38.8021 46.4139C38.7841 46.4825 38.7975 46.5594 38.8346 46.6198C38.8547 46.6523 39.3098 47.4287 37.9999 48.8423C35.9151 51.0943 32.2789 52.4387 28.2739 52.4387C22.7206 52.4387 17.6631 50.1512 17.6631 47.6392C17.6631 47.2801 17.7679 46.9035 17.9747 46.5197C18.0186 46.4382 18.0155 46.3386 17.966 46.2607C17.5042 45.5219 17.2674 44.7454 17.2628 43.9535C17.2623 43.8503 17.1998 43.7575 17.1049 43.7172C17.01 43.677 16.9006 43.6976 16.8258 43.7693C15.6315 44.9183 15 46.256 15 47.6392C15 51.7082 20.9547 55.0183 28.2739 55.0183C33.6285 55.0183 38.2945 53.1837 40.161 50.3446C40.5815 49.7049 40.8493 49.028 40.955 48.3346C40.9927 48.0906 41.0107 47.8631 41.0107 47.6392C41.0107 46.2111 40.8864 45.4177 39.7514 44.3152C39.6854 44.2491 39.5878 44.2285 39.497 44.2538ZM54.8356 29.6292C54.7035 29.5776 54.5529 29.6421 54.5013 29.7752C54.2542 30.4062 53.7759 30.9025 53.1553 31.1734C52.9974 31.242 52.8354 31.2936 52.6709 31.3292L52.8313 30.9206C52.8643 30.8359 52.8421 30.74 52.7746 30.6796L48.4053 26.7484C48.3522 26.7004 48.2794 26.6813 48.2098 26.6983C48.1401 26.7148 48.0834 26.7639 48.0571 26.8304L47.3657 28.5917C45.3645 28.4385 43.5681 28.8579 42.0008 29.8557C41.3368 30.2782 40.7559 30.7828 40.2446 31.3348C40.0511 29.2 39.2783 26.9785 37.5355 24.9932L38.9662 23.8376C39.0214 23.7927 39.0518 23.7236 39.0467 23.6524C39.041 23.5812 39.0013 23.5172 38.9399 23.4806L33.8762 20.4971C33.7978 20.4512 33.6987 20.4584 33.6291 20.5151L33.2901 20.7891C33.2143 19.9714 33.5331 19.1309 34.2182 18.5774C34.3292 18.4881 34.3462 18.3256 34.2564 18.2147C34.1666 18.1043 34.0046 18.0862 33.8937 18.1765C32.9873 18.9091 32.6117 20.0575 32.817 21.1296C32.5436 21.014 32.2583 20.9253 31.9549 20.8933C31.1429 20.8071 30.3484 21.0419 29.7138 21.5547C29.6034 21.6439 29.5859 21.8065 29.6756 21.9174C29.7649 22.0283 29.9274 22.0458 30.0383 21.9556C30.7234 21.402 31.6118 21.2663 32.3955 21.5124L32.0571 21.7858C31.9864 21.8431 31.9591 21.9375 31.9874 22.0237L33.8406 27.6012C33.8633 27.6688 33.9175 27.7214 33.9861 27.7415C34.0057 27.7472 34.0263 27.7503 34.047 27.7503C34.0965 27.7503 34.1445 27.7333 34.1837 27.7018L35.5256 26.6173C37.7264 29.0617 37.9442 31.8642 37.6 34.0697C35.199 31.9699 29.7133 26.4739 29.0008 19.5906L30.3422 20.0389C30.3649 20.0467 30.3881 20.0503 30.4113 20.0503C30.4149 20.0498 30.418 20.0503 30.4216 20.0503C30.5418 20.0503 30.6388 19.9528 30.6388 19.8326C30.6388 19.8068 30.6342 19.7815 30.6259 19.7588L30.416 13.9517C30.4129 13.8609 30.3535 13.782 30.2674 13.7531L29.8541 13.6148C30.5026 13.1102 31.3828 12.9271 32.2175 13.2062C32.3532 13.2511 32.4987 13.1783 32.5441 13.0437C32.589 12.9085 32.5162 12.7625 32.3816 12.7171C31.2806 12.3482 30.1162 12.6454 29.3238 13.3878C29.137 12.3183 28.3848 11.3809 27.2849 11.0131C27.1508 10.9687 27.0037 11.0409 26.9583 11.1756C26.9129 11.3107 26.9862 11.4567 27.1208 11.5021C27.9566 11.7818 28.5494 12.4571 28.764 13.2501L28.3508 13.1118C28.2646 13.0829 28.1697 13.1102 28.1129 13.1809L24.4113 17.7457C24.3664 17.8009 24.3514 17.8752 24.3715 17.9433C24.3917 18.0119 24.4438 18.0661 24.5114 18.0888L26.5549 18.7719C26.7912 24.9282 30.3618 30.0378 33.3288 33.2499C31.0015 32.3759 28.6763 32.2475 27.6429 32.2387V30.19C27.6429 30.1188 27.6079 30.0518 27.549 30.011C27.4902 29.9708 27.4154 29.9615 27.3489 29.9862L21.8456 32.0499C21.7605 32.0819 21.7043 32.1629 21.7043 32.2537V32.6891C21.0202 32.2341 20.5677 31.4581 20.5677 30.577C20.5677 30.4346 20.4522 30.319 20.3098 30.319C20.1674 30.319 20.0518 30.4346 20.0518 30.577C20.0518 31.7372 20.7024 32.7479 21.6578 33.2638C20.7024 33.7803 20.0518 34.7909 20.0518 35.9507C20.0518 36.0931 20.1674 36.2087 20.3098 36.2087C20.4522 36.2087 20.5677 36.0931 20.5677 35.9507C20.5677 35.0695 21.0202 34.2936 21.7043 33.8386V34.274C21.7043 34.3643 21.7605 34.4458 21.8456 34.4778L27.3489 36.5409C27.3736 36.5507 27.3994 36.5548 27.4252 36.5548C27.4686 36.5548 27.5119 36.5419 27.549 36.5161C27.6079 36.4754 27.6429 36.4088 27.6429 36.3371V34.8028C27.7301 34.8007 27.8271 34.7997 27.9349 34.7997C29.5353 34.7997 33.4624 35.0659 35.3615 37.5258C37.875 40.7827 36.6797 44.5375 35.0282 46.1627C33.708 47.4612 31.1083 48.2676 28.2429 48.2676C24.4685 48.2676 21.0888 46.724 20.3815 44.6773C20.2907 44.4137 20.2463 44.1681 20.2463 43.9251C20.2463 43.3417 20.4826 42.7623 20.9495 42.203C22.2785 40.6114 25.1413 39.5832 28.2429 39.5832C31.6516 39.5832 34.8998 40.8142 35.9667 42.51C36.0219 42.5987 36.125 42.6447 36.2313 42.6266C36.335 42.6075 36.4165 42.5275 36.4377 42.4233C36.4511 42.3557 36.7612 40.7513 35.8078 39.3521C35.7969 39.3361 35.784 39.3206 35.7696 39.3077C33.9252 37.6068 31.9554 37.0037 28.2429 37.0037C22.3125 37.0037 17.6667 40.0439 17.6688 43.954C17.6745 44.8424 17.9268 45.7076 18.4195 46.5274C19.9982 49.1513 23.8536 50.8471 28.2429 50.8471C31.6438 50.8471 34.7352 49.8468 36.7245 48.1025C37.2673 47.6263 38.2501 46.2643 38.3285 46.0497C38.6747 45.105 39.4176 42.7148 39.1653 40.2111C39.2087 40.1038 39.2427 39.9913 39.2561 39.8711C39.2623 39.8154 39.9082 34.2441 43.386 32.0298C44.2538 31.4772 45.2495 31.1868 46.3613 31.1501L45.8113 32.5519C45.785 32.6179 45.7938 32.6932 45.833 32.7526C45.8727 32.8119 45.9392 32.848 46.0104 32.849L51.8872 32.9378C51.8887 32.9378 51.8898 32.9378 51.8908 32.9378C51.9801 32.9378 52.0605 32.8831 52.0936 32.7995L52.254 32.3909C52.3505 32.5287 52.4341 32.6767 52.5027 32.8341C52.7735 33.4552 52.7869 34.1445 52.5388 34.7749C52.4867 34.9075 52.5522 35.0571 52.6848 35.1092C52.7157 35.1211 52.7477 35.1268 52.7792 35.1268C52.8819 35.1268 52.9794 35.0649 53.0196 34.9632C53.3173 34.2043 53.3018 33.3747 52.9758 32.6277C52.854 32.3486 52.6838 32.1035 52.4918 31.8776C52.788 31.843 53.081 31.7661 53.3622 31.6433C54.1092 31.3173 54.6845 30.7193 54.9827 29.9604C55.0337 29.8309 54.9682 29.6813 54.8356 29.6292ZM34.8528 41.9616C34.8286 41.9322 34.7986 41.909 34.7636 41.893C34.6335 41.8321 34.501 41.7733 34.3658 41.716C32.5921 40.9643 30.4774 40.5666 28.2491 40.5666C27.2312 40.5666 26.2257 40.6507 25.261 40.8168C23.9707 41.0391 22.7846 41.4008 21.7347 41.8925C21.7007 41.9084 21.6702 41.9317 21.6465 41.9611C21.1734 42.527 20.934 43.126 20.934 43.7405C20.934 43.9984 20.9815 44.2672 21.0754 44.5396C21.1022 44.6165 21.1636 44.6768 21.241 44.7011C21.2668 44.7093 21.2931 44.7129 21.3189 44.7129C21.3725 44.7129 21.4252 44.6964 21.4695 44.6639C22.4787 43.9375 23.9382 43.3757 25.5783 43.0832C29.0524 42.462 32.8557 43.1343 34.9766 44.6294C35.0452 44.6784 35.1345 44.6897 35.2124 44.6619C35.2913 44.633 35.3522 44.568 35.3739 44.487C35.4409 44.2409 35.6174 43.451 35.6478 43.2808C35.6592 43.2168 35.6463 43.1508 35.6112 43.0961L35.5462 42.9944C35.2836 42.5802 34.9957 42.1329 34.8528 41.9616Z" fill="black"/>
</svg>
