<svg width="67" height="77" viewBox="0 0 67 77" fill="none" xmlns="http://www.w3.org/2000/svg">
<path d="M33.4973 4.70865e-09C21.2053 0.000160052 8.36789 4.07948 0.838673 12.9203L0.0486743 13.8479L0.00997206 15.0652L3.49254 15.1757C0.00997206 15.0652 0.00987617 15.0682 0.00987617 15.0682L0.00975274 15.0722L0.00943018 15.0832L0.00852421 15.1165C0.00782071 15.1438 0.00694037 15.1811 0.00601447 15.2283C0.00416265 15.3226 0.00212785 15.4563 0.000963164 15.6272C-0.00136572 15.9689 -0.000217182 16.4597 0.0128568 17.083C0.0389934 18.329 0.112858 20.1075 0.302534 22.284C0.681198 26.6292 1.52501 32.6029 3.39342 39.1122C7.11547 52.0794 15.0436 67.6072 31.9155 76.1948L33.4973 77L35.0792 76.1948C51.9509 67.6073 59.8804 52.0797 63.6038 39.1126C65.473 32.6033 66.3175 26.6296 66.6967 22.2845C66.8866 20.1079 66.9607 18.3294 66.987 17.0834C67.0001 16.4602 67.0014 15.9693 66.9991 15.6276C66.9979 15.4567 66.9959 15.3231 66.9941 15.2288C66.9932 15.1816 66.9923 15.1442 66.9916 15.117L66.9907 15.0836L66.9904 15.0727L66.9902 15.0687C66.9902 15.0687 66.9901 15.0656 63.5076 15.1757L66.9901 15.0656L66.9516 13.8477L66.161 12.9197C58.6288 4.07918 45.7898 -0.000160033 33.4973 4.70865e-09Z" fill="#E42E2E"/>
<path fill-rule="evenodd" clip-rule="evenodd" d="M26.1644 15.0157L16 25.1802V39.5549L26.1644 49.7193H40.5391L50.7036 39.5549V25.1802L40.5391 15.0157L26.1644 15.0157ZM41.3676 13.0157H25.336L14 24.3518V40.3833L25.336 51.7193H41.3676L52.7036 40.3833V24.3518L41.3676 13.0157Z" fill="white"/>
<path d="M20.16 34.655H18V35.09C18 36.08 18.26 36.84 18.78 37.37C19.31 37.9 20.185 38.165 21.405 38.165C22.575 38.165 23.485 37.91 24.135 37.4C24.795 36.88 25.125 36.055 25.125 34.925C25.125 34.595 25.095 34.295 25.035 34.025C24.975 33.755 24.865 33.51 24.705 33.29C24.555 33.06 24.35 32.85 24.09 32.66C23.83 32.46 23.495 32.27 23.085 32.09L21.42 31.37C20.96 31.18 20.66 30.975 20.52 30.755C20.38 30.525 20.31 30.245 20.31 29.915C20.31 29.755 20.325 29.6 20.355 29.45C20.395 29.3 20.46 29.17 20.55 29.06C20.65 28.94 20.78 28.845 20.94 28.775C21.1 28.705 21.3 28.67 21.54 28.67C21.96 28.67 22.26 28.81 22.44 29.09C22.62 29.36 22.71 29.75 22.71 30.26H24.78V29.96C24.78 29.45 24.695 29.015 24.525 28.655C24.365 28.285 24.135 27.985 23.835 27.755C23.545 27.515 23.195 27.345 22.785 27.245C22.385 27.135 21.945 27.08 21.465 27.08C20.435 27.08 19.625 27.34 19.035 27.86C18.445 28.38 18.15 29.17 18.15 30.23C18.15 30.67 18.205 31.06 18.315 31.4C18.425 31.73 18.595 32.025 18.825 32.285C19.065 32.535 19.36 32.755 19.71 32.945C20.06 33.135 20.475 33.31 20.955 33.47C21.315 33.59 21.615 33.71 21.855 33.83C22.105 33.94 22.305 34.065 22.455 34.205C22.605 34.345 22.71 34.505 22.77 34.685C22.84 34.855 22.875 35.06 22.875 35.3C22.875 35.75 22.74 36.085 22.47 36.305C22.21 36.515 21.915 36.62 21.585 36.62C21.305 36.62 21.07 36.58 20.88 36.5C20.7 36.42 20.555 36.31 20.445 36.17C20.335 36.03 20.26 35.86 20.22 35.66C20.18 35.45 20.16 35.22 20.16 34.97V34.655Z" fill="white"/>
<path d="M32.4683 27.29H25.6283V29.06H27.9683V38H30.1283V29.06H32.4683V27.29Z" fill="white"/>
<path d="M35.3404 32.645C35.3404 31.925 35.3554 31.315 35.3854 30.815C35.4254 30.315 35.4954 29.905 35.5954 29.585C35.7054 29.265 35.8554 29.035 36.0454 28.895C36.2454 28.745 36.5054 28.67 36.8254 28.67C37.1454 28.67 37.4004 28.745 37.5904 28.895C37.7904 29.035 37.9404 29.265 38.0404 29.585C38.1504 29.905 38.2204 30.315 38.2504 30.815C38.2904 31.315 38.3104 31.925 38.3104 32.645C38.3104 33.365 38.2904 33.98 38.2504 34.49C38.2204 34.99 38.1504 35.4 38.0404 35.72C37.9404 36.03 37.7904 36.26 37.5904 36.41C37.4004 36.55 37.1454 36.62 36.8254 36.62C36.5054 36.62 36.2454 36.55 36.0454 36.41C35.8554 36.26 35.7054 36.03 35.5954 35.72C35.4954 35.4 35.4254 34.99 35.3854 34.49C35.3554 33.98 35.3404 33.365 35.3404 32.645ZM33.1804 32.645C33.1804 33.465 33.2154 34.215 33.2854 34.895C33.3654 35.575 33.5304 36.16 33.7804 36.65C34.0404 37.14 34.4104 37.515 34.8904 37.775C35.3704 38.035 36.0154 38.165 36.8254 38.165C37.6354 38.165 38.2804 38.035 38.7604 37.775C39.2404 37.515 39.6054 37.14 39.8554 36.65C40.1154 36.16 40.2804 35.575 40.3504 34.895C40.4304 34.215 40.4704 33.465 40.4704 32.645C40.4704 31.835 40.4304 31.09 40.3504 30.41C40.2804 29.72 40.1154 29.13 39.8554 28.64C39.6054 28.15 39.2404 27.77 38.7604 27.5C38.2804 27.22 37.6354 27.08 36.8254 27.08C36.0154 27.08 35.3704 27.22 34.8904 27.5C34.4104 27.77 34.0404 28.15 33.7804 28.64C33.5304 29.13 33.3654 29.72 33.2854 30.41C33.2154 31.09 33.1804 31.835 33.1804 32.645Z" fill="white"/>
<path d="M43.9003 32.135V28.88H44.8003C45.3403 28.88 45.7253 29.02 45.9553 29.3C46.1853 29.58 46.3003 29.99 46.3003 30.53C46.3003 31.08 46.1653 31.485 45.8953 31.745C45.6353 32.005 45.2903 32.135 44.8603 32.135H43.9003ZM41.7403 27.29V38H43.9003V33.725H45.0553C45.5653 33.725 46.0303 33.66 46.4503 33.53C46.8703 33.4 47.2253 33.205 47.5153 32.945C47.8153 32.685 48.0453 32.35 48.2053 31.94C48.3753 31.53 48.4603 31.05 48.4603 30.5C48.4603 30.1 48.4103 29.71 48.3103 29.33C48.2103 28.94 48.0453 28.595 47.8153 28.295C47.5853 27.995 47.2803 27.755 46.9003 27.575C46.5303 27.385 46.0703 27.29 45.5203 27.29H41.7403Z" fill="white"/>
</svg>
