{
  "content": null,
  "embeds": [
    {
      "title": "Rules",
      "description": "This server is governed by the [Contributor Covenant](https://www.contributor-covenant.org/version/2/0/code_of_conduct/).\n\nBelow are some important snippets.",
      "color": 14493222
    },
    {
      "color": 13205264,
      "fields": [
        {
          "name": "Examples of behavior that contributes to a positive environment for our community include:",
          "value": "Demonstrating empathy and kindness toward other people\n\nBeing respectful of differing opinions, viewpoints, and experiences\n\nGiving and gracefully accepting constructive feedback\n\nAccepting responsibility and apologizing to those affected by our mistakes, and learning from the experience\n\nFocusing on what is best not just for us as individuals, but for the overall community"
        }
      ]
    },
    {
      "color": 14735649,
      "fields": [
        {
          "name": "Examples of unacceptable behavior include:",
          "value": "The use of sexualized language or imagery, and sexual attention or advances of any kind\n\nTrolling, insulting or derogatory comments, and personal or political attacks\n\nPublic or private harassment\n\nPublishing others’ private information, such as a physical or email address, without their explicit permission\n\nOther conduct which could reasonably be considered inappropriate in a professional setting"
        }
      ]
    },
    {
      "title": "If you have any issues",
      "description": "Please feel free to contact a Firekeeper, or <@258543837528457217> if the issue is with a Firekeeper. It's our goal to keep this community healthy and empowering. We're not perfect, so please help us keep this community as fantastic as it can be!",
      "color": 3991068
    },
    {
      "title": "Invitations",
      "description": "Please feel free to invite people! Please note that this is a semi-closed community, and we must respect that we often share deep, non-public things here. It's alright to invite new voices who we are missing, but we don't want to create a space where folks feel unsafe.\n\nWe do regular prunes of people who haven't been active for at least a month, but everyone is welcome back if they wish!",
      "color": 2969557
    },
    {
      "title": "Community Bots and Services",
      "description": "From game servers to Discord bots and more, we welcome services hosted by our members for our members. We have a few conditions on that, though",
      "color": 10628570,
      "fields": [
        {
          "name": "Discord Bots",
          "value": "Bots must be OSS and hosted by a member of the community. The project must be open to PRs for improvements, and it must not persist user content.",
          "inline": true
        },
        {
          "name": "Game Servers",
          "value": "Game servers may be open to more than this community, but if they are, they must be explicitly so. The rules of the community apply to multiplayer activities, within reason (ie, we're not expecting empathy and kindness as you mow down legions of undead or reaving blood for the blood god).",
          "inline": true
        }
      ]
    }
  ],
  "username": "Firepit",
  "avatar_url": "https://cdn.discordapp.com/icons/736240421398904903/8e4cdcb96324c07d985c41c7fbdf5c63.webp"
}