{
  "required": true,
  "minVersion": "0.8",
  "package": "net.brdle.rottenleather.rottenleather.mixin",
  "compatibilityLevel": "JAVA_17",
  "mixins": [
  ],
  "client": [
  ],
  "injectors": {
    "defaultRequire": 1
  }
}
