{
  "type": "minecraft:crafting_shapeless",
  "category": "building",
  "ingredients": [
    {
      "item": "kirasextras:ruby_block"
    }
  ],
  "result": {
    "item": "kirasextras:ruby",
    "count": 9
  }
}