{
  "parent": "minecraft:recipes/root",
  "criteria": {
    "has_chorus": {
      "conditions": {
        "items": [
          {
            "items": [
              "minecraft:chorus_fruit"
            ]
          }
        ]
      },
      "trigger": "minecraft:inventory_changed"
    },
    "has_the_recipe": {
      "conditions": {
        "recipe": "kilnreborn:popped_chorus_fruit_from_firing"
      },
      "trigger": "minecraft:recipe_unlocked"
    }
  },
  "requirements": [
    [
      "has_chorus",
      "has_the_recipe"
    ]
  ],
  "rewards": {
    "recipes": [
      "kilnreborn:popped_chorus_fruit_from_firing"
    ]
  },
  "sends_telemetry_event": false
}