{ "fabric:load_conditions": [ { "condition": "fabric:all_mods_loaded", "values": [ "botania" ] } ],
	"type": "kilnreborn:firing",
	"ingredient": {
		"item": "botania:metamorphic_swamp_cobblestone"
	},
	"result": "botania:metamorphic_swamp_stone",
	"experience": 0.1,
	"cookingtime": 100
}
