{
  "parent": "minecraft:recipes/root",
  "criteria": {
    "has_regular": {
      "conditions": {
        "items": [
          {
            "items": [
              "minecraft:deepslate_bricks"
            ]
          }
        ]
      },
      "trigger": "minecraft:inventory_changed"
    },
    "has_the_recipe": {
      "conditions": {
        "recipe": "kilnreborn:cracked_deepslate_bricks_from_firing"
      },
      "trigger": "minecraft:recipe_unlocked"
    }
  },
  "requirements": [
    [
      "has_regular",
      "has_the_recipe"
    ]
  ],
  "rewards": {
    "recipes": [
      "kilnreborn:cracked_deepslate_bricks_from_firing"
    ]
  },
  "sends_telemetry_event": false
}