{
  "parent": "minecraft:recipes/root",
  "criteria": {
    "has_cobbled_dripstone_block": {
      "conditions": {
        "items": [
          {
            "items": [
              "natprog:cobbled_dripstone_block"
            ]
          }
        ]
      },
      "trigger": "minecraft:inventory_changed"
    },
    "has_the_recipe": {
      "conditions": {
        "recipe": "kilnreborn:natprog_cobbled_dripstone_block_to_dripstone_block_from_firing"
      },
      "trigger": "minecraft:recipe_unlocked"
    }
  },
  "requirements": [
    [
      "has_cobbled_dripstone_block",
      "has_the_recipe"
    ]
  ],
  "rewards": {
    "recipes": [
      "kilnreborn:natprog_cobbled_dripstone_block_to_dripstone_block_from_firing"
    ]
  },
  "sends_telemetry_event": false
}