{
  "type": "kilnreborn:firing",
  "category": "blocks",
  "cookingtime": 100,
  "experience": 0.1,
  "ingredient": {
    "item": "minecraft:white_terracotta"
  },
  "result": "minecraft:white_glazed_terracotta"
}