-- Merging decision tree log ---
manifest
ADDED from /home/mital/Mital_Qtm/mowom_my/Mowom/mowom-french/app/src/main/AndroidManifest.xml:2:1-208:12
	package
		ADDED from /home/mital/Mital_Qtm/mowom_my/Mowom/mowom-french/app/src/main/AndroidManifest.xml:3:5-32
		INJECTED from /home/mital/Mital_Qtm/mowom_my/Mowom/mowom-french/app/src/main/AndroidManifest.xml
		INJECTED from /home/mital/Mital_Qtm/mowom_my/Mowom/mowom-french/app/src/main/AndroidManifest.xml
	android:versionName
		INJECTED from /home/mital/Mital_Qtm/mowom_my/Mowom/mowom-french/app/src/main/AndroidManifest.xml
		INJECTED from /home/mital/Mital_Qtm/mowom_my/Mowom/mowom-french/app/src/main/AndroidManifest.xml
	xmlns:android
		ADDED from /home/mital/Mital_Qtm/mowom_my/Mowom/mowom-french/app/src/main/AndroidManifest.xml:2:11-69
	android:versionCode
		INJECTED from /home/mital/Mital_Qtm/mowom_my/Mowom/mowom-french/app/src/main/AndroidManifest.xml
		INJECTED from /home/mital/Mital_Qtm/mowom_my/Mowom/mowom-french/app/src/main/AndroidManifest.xml
uses-sdk
ADDED from /home/mital/Mital_Qtm/mowom_my/Mowom/mowom-french/app/src/main/AndroidManifest.xml:5:5-7:41
MERGED from [com.android.support:multidex:1.0.1] /home/mital/.android/build-cache/92f89c6aabdad61da07539f95a019a487f61f615/output/AndroidManifest.xml:18:5-42
MERGED from [mowom-french:Persianmaterialdatetimepicker:unspecified] /home/mital/Mital_Qtm/mowom_my/Mowom/mowom-french/Persianmaterialdatetimepicker/build/intermediates/bundles/default/AndroidManifest.xml:7:5-9:41
MERGED from [com.wdullaer:materialdatetimepicker:2.5.0] /home/mital/.android/build-cache/b543e9677e0334bf8ffaaeaa22abd4b16c046a75/output/AndroidManifest.xml:22:5-24:41
MERGED from [mowom-french:materialdatetimepicker:unspecified] /home/mital/Mital_Qtm/mowom_my/Mowom/mowom-french/materialdatetimepicker/build/intermediates/bundles/default/AndroidManifest.xml:7:5-9:41
MERGED from [com.android.support:appcompat-v7:24.2.0] /home/mital/.android/build-cache/49f4c958d6a3de61596a8e34c083640b9cc63c60/output/AndroidManifest.xml:21:5-23:78
MERGED from [com.android.support:animated-vector-drawable:24.2.0] /home/mital/.android/build-cache/ddd61572c86022d413be207150ce35b30a368664/output/AndroidManifest.xml:20:5-44
MERGED from [com.android.support:support-vector-drawable:24.2.0] /home/mital/.android/build-cache/a834c590ccebbadb34848ea56046d5d419a96f34/output/AndroidManifest.xml:21:5-43
MERGED from [com.google.android.gms:play-services-gcm:9.6.1] /home/mital/.android/build-cache/0c240251ac1470570233410719de241295a2623b/output/AndroidManifest.xml:17:5-42
MERGED from [com.google.android.gms:play-services-iid:9.6.1] /home/mital/.android/build-cache/2284ea1411b01a9b2d9c083335afa21081d384e6/output/AndroidManifest.xml:17:5-42
MERGED from [com.google.android.gms:play-services-location:9.6.1] /home/mital/.android/build-cache/32bb09bcb0c819fce23feac1280308602ce1898b/output/AndroidManifest.xml:3:5-42
MERGED from [com.google.android.gms:play-services-maps:9.6.1] /home/mital/.android/build-cache/0f6aad8de112173b49be01b33b65a2c4713d1669/output/AndroidManifest.xml:23:5-42
MERGED from [com.google.android.gms:play-services-analytics:9.6.1] /home/mital/.android/build-cache/7d44cc0d8f9b3af1c3a463b2e7cc0e948de2514c/output/AndroidManifest.xml:17:5-42
MERGED from [com.google.android.gms:play-services-analytics-impl:9.6.1] /home/mital/.android/build-cache/39e6bd93db2b1e0b75dcabb1aba54e962f15208e/output/AndroidManifest.xml:17:5-42
MERGED from [com.google.android.gms:play-services-base:9.6.1] /home/mital/.android/build-cache/01558cd0aafae75528f9d13d89e402d14c763ddb/output/AndroidManifest.xml:17:5-42
MERGED from [com.google.firebase:firebase-messaging:9.6.1] /home/mital/.android/build-cache/f2e029fd0c9132591384287f0f3ae099d8f7840e/output/AndroidManifest.xml:17:5-42
MERGED from [com.google.firebase:firebase-core:9.6.1] /home/mital/.android/build-cache/203b968c5066455f742e238d2ec77db977b2fcfe/output/AndroidManifest.xml:4:5-42
MERGED from [com.google.firebase:firebase-analytics:9.6.1] /home/mital/.android/build-cache/0a6618c6e1d2c28805ef48d2a1901a6ec6e1f4f3/output/AndroidManifest.xml:17:5-42
MERGED from [com.google.firebase:firebase-analytics-impl:9.6.1] /home/mital/.android/build-cache/1eae94826d50cd4ccda38d47b67e7152e97b411f/output/AndroidManifest.xml:17:5-42
MERGED from [com.google.firebase:firebase-iid:9.6.1] /home/mital/.android/build-cache/d859aa7feafdadd165d66c232ec0a0e2571ec06e/output/AndroidManifest.xml:17:5-42
MERGED from [com.google.firebase:firebase-common:9.6.1] /home/mital/.android/build-cache/0c4f62836d162f9dd108b0058c2f1afdf2d8188f/output/AndroidManifest.xml:3:5-42
MERGED from [com.google.android.gms:play-services-tasks:9.6.1] /home/mital/.android/build-cache/58fc8b10fc76fa7cc4368c5589cf06c4af30da71/output/AndroidManifest.xml:3:5-42
MERGED from [com.google.android.gms:play-services-basement:9.6.1] /home/mital/.android/build-cache/593aa3aa3608ae066608c38631ec66ca2b30cd23/output/AndroidManifest.xml:17:5-42
MERGED from [com.android.support:support-v4:24.2.0] /home/mital/.android/build-cache/860cdd8eefb584f997b9ed064e7ddd2c7d60071c/output/AndroidManifest.xml:21:5-23:54
MERGED from [com.android.support:support-fragment:24.2.0] /home/mital/.android/build-cache/dbef7fd62c53a8957065a9e3ff0791ea5c03f814/output/AndroidManifest.xml:21:5-23:60
MERGED from [com.android.support:support-core-utils:24.2.0] /home/mital/.android/build-cache/a5acdcacc9422abe345c22b156ef6c4e9034eb01/output/AndroidManifest.xml:21:5-23:61
MERGED from [com.android.support:support-media-compat:24.2.0] /home/mital/.android/build-cache/2c75b1abe41a9c029580cec247264d9042a1d028/output/AndroidManifest.xml:21:5-23:63
MERGED from [com.android.support:support-core-ui:24.2.0] /home/mital/.android/build-cache/304acd813faec7445590610c1a399b2f0e93e7b5/output/AndroidManifest.xml:21:5-23:58
MERGED from [com.android.support:support-compat:24.2.0] /home/mital/.android/build-cache/eed61c1888909027014f6ce4d8c0dd7a2d43b360/output/AndroidManifest.xml:21:5-23:58
	tools:overrideLibrary
		ADDED from [com.android.support:appcompat-v7:24.2.0] /home/mital/.android/build-cache/49f4c958d6a3de61596a8e34c083640b9cc63c60/output/AndroidManifest.xml:23:9-75
	android:targetSdkVersion
		ADDED from /home/mital/Mital_Qtm/mowom_my/Mowom/mowom-french/app/src/main/AndroidManifest.xml:7:9-38
		INJECTED from /home/mital/Mital_Qtm/mowom_my/Mowom/mowom-french/app/src/main/AndroidManifest.xml
		INJECTED from /home/mital/Mital_Qtm/mowom_my/Mowom/mowom-french/app/src/main/AndroidManifest.xml
	android:minSdkVersion
		ADDED from /home/mital/Mital_Qtm/mowom_my/Mowom/mowom-french/app/src/main/AndroidManifest.xml:6:9-35
		INJECTED from /home/mital/Mital_Qtm/mowom_my/Mowom/mowom-french/app/src/main/AndroidManifest.xml
		INJECTED from /home/mital/Mital_Qtm/mowom_my/Mowom/mowom-french/app/src/main/AndroidManifest.xml
permission#com.asrapps.mowom.permission.MAPS_RECEIVE
ADDED from /home/mital/Mital_Qtm/mowom_my/Mowom/mowom-french/app/src/main/AndroidManifest.xml:9:5-11:47
	android:protectionLevel
		ADDED from /home/mital/Mital_Qtm/mowom_my/Mowom/mowom-french/app/src/main/AndroidManifest.xml:11:9-44
	android:name
		ADDED from /home/mital/Mital_Qtm/mowom_my/Mowom/mowom-french/app/src/main/AndroidManifest.xml:10:9-65
uses-permission#com.google.android.providers.gsf.permission.READ_GSERVICES
ADDED from /home/mital/Mital_Qtm/mowom_my/Mowom/mowom-french/app/src/main/AndroidManifest.xml:13:5-98
	android:name
		ADDED from /home/mital/Mital_Qtm/mowom_my/Mowom/mowom-french/app/src/main/AndroidManifest.xml:13:22-95
uses-permission#android.permission.INTERNET
ADDED from /home/mital/Mital_Qtm/mowom_my/Mowom/mowom-french/app/src/main/AndroidManifest.xml:14:5-67
MERGED from [com.google.android.gms:play-services-gcm:9.6.1] /home/mital/.android/build-cache/0c240251ac1470570233410719de241295a2623b/output/AndroidManifest.xml:21:5-66
MERGED from [com.google.android.gms:play-services-iid:9.6.1] /home/mital/.android/build-cache/2284ea1411b01a9b2d9c083335afa21081d384e6/output/AndroidManifest.xml:21:5-66
MERGED from [com.google.android.gms:play-services-maps:9.6.1] /home/mital/.android/build-cache/0f6aad8de112173b49be01b33b65a2c4713d1669/output/AndroidManifest.xml:20:5-66
MERGED from [com.google.android.gms:play-services-analytics:9.6.1] /home/mital/.android/build-cache/7d44cc0d8f9b3af1c3a463b2e7cc0e948de2514c/output/AndroidManifest.xml:20:5-66
MERGED from [com.google.android.gms:play-services-analytics-impl:9.6.1] /home/mital/.android/build-cache/39e6bd93db2b1e0b75dcabb1aba54e962f15208e/output/AndroidManifest.xml:20:5-66
MERGED from [com.google.firebase:firebase-analytics:9.6.1] /home/mital/.android/build-cache/0a6618c6e1d2c28805ef48d2a1901a6ec6e1f4f3/output/AndroidManifest.xml:20:5-66
MERGED from [com.google.firebase:firebase-analytics-impl:9.6.1] /home/mital/.android/build-cache/1eae94826d50cd4ccda38d47b67e7152e97b411f/output/AndroidManifest.xml:20:5-66
MERGED from [com.google.firebase:firebase-iid:9.6.1] /home/mital/.android/build-cache/d859aa7feafdadd165d66c232ec0a0e2571ec06e/output/AndroidManifest.xml:20:5-66
	android:name
		ADDED from /home/mital/Mital_Qtm/mowom_my/Mowom/mowom-french/app/src/main/AndroidManifest.xml:14:22-64
uses-permission#android.permission.CALL_PHONE
ADDED from /home/mital/Mital_Qtm/mowom_my/Mowom/mowom-french/app/src/main/AndroidManifest.xml:15:5-69
	android:name
		ADDED from /home/mital/Mital_Qtm/mowom_my/Mowom/mowom-french/app/src/main/AndroidManifest.xml:15:22-66
uses-permission#android.permission.ACCESS_NETWORK_STATE
ADDED from /home/mital/Mital_Qtm/mowom_my/Mowom/mowom-french/app/src/main/AndroidManifest.xml:16:5-79
MERGED from [com.google.android.gms:play-services-maps:9.6.1] /home/mital/.android/build-cache/0f6aad8de112173b49be01b33b65a2c4713d1669/output/AndroidManifest.xml:19:5-78
MERGED from [com.google.android.gms:play-services-analytics:9.6.1] /home/mital/.android/build-cache/7d44cc0d8f9b3af1c3a463b2e7cc0e948de2514c/output/AndroidManifest.xml:21:5-78
MERGED from [com.google.android.gms:play-services-analytics-impl:9.6.1] /home/mital/.android/build-cache/39e6bd93db2b1e0b75dcabb1aba54e962f15208e/output/AndroidManifest.xml:21:5-78
MERGED from [com.google.firebase:firebase-analytics:9.6.1] /home/mital/.android/build-cache/0a6618c6e1d2c28805ef48d2a1901a6ec6e1f4f3/output/AndroidManifest.xml:21:5-78
MERGED from [com.google.firebase:firebase-analytics-impl:9.6.1] /home/mital/.android/build-cache/1eae94826d50cd4ccda38d47b67e7152e97b411f/output/AndroidManifest.xml:21:5-78
MERGED from [com.google.firebase:firebase-iid:9.6.1] /home/mital/.android/build-cache/d859aa7feafdadd165d66c232ec0a0e2571ec06e/output/AndroidManifest.xml:19:5-78
	android:name
		ADDED from /home/mital/Mital_Qtm/mowom_my/Mowom/mowom-french/app/src/main/AndroidManifest.xml:16:22-76
uses-permission#android.permission.ACCESS_COARSE_LOCATION
ADDED from /home/mital/Mital_Qtm/mowom_my/Mowom/mowom-french/app/src/main/AndroidManifest.xml:17:5-81
	android:name
		ADDED from /home/mital/Mital_Qtm/mowom_my/Mowom/mowom-french/app/src/main/AndroidManifest.xml:17:22-78
uses-permission#android.permission.ACCESS_FINE_LOCATION
ADDED from /home/mital/Mital_Qtm/mowom_my/Mowom/mowom-french/app/src/main/AndroidManifest.xml:18:5-79
	android:name
		ADDED from /home/mital/Mital_Qtm/mowom_my/Mowom/mowom-french/app/src/main/AndroidManifest.xml:18:22-76
uses-permission#android.permission.BATTERY_STATS
ADDED from /home/mital/Mital_Qtm/mowom_my/Mowom/mowom-french/app/src/main/AndroidManifest.xml:21:5-72
	android:name
		ADDED from /home/mital/Mital_Qtm/mowom_my/Mowom/mowom-french/app/src/main/AndroidManifest.xml:21:22-69
uses-permission#android.permission.READ_EXTERNAL_STORAGE
ADDED from /home/mital/Mital_Qtm/mowom_my/Mowom/mowom-french/app/src/main/AndroidManifest.xml:22:5-80
	android:name
		ADDED from /home/mital/Mital_Qtm/mowom_my/Mowom/mowom-french/app/src/main/AndroidManifest.xml:22:22-77
uses-permission#android.permission.WRITE_EXTERNAL_STORAGE
ADDED from /home/mital/Mital_Qtm/mowom_my/Mowom/mowom-french/app/src/main/AndroidManifest.xml:23:5-81
	android:name
		ADDED from /home/mital/Mital_Qtm/mowom_my/Mowom/mowom-french/app/src/main/AndroidManifest.xml:23:22-78
uses-permission#android.permission.CAMERA
ADDED from /home/mital/Mital_Qtm/mowom_my/Mowom/mowom-french/app/src/main/AndroidManifest.xml:24:5-65
	android:name
		ADDED from /home/mital/Mital_Qtm/mowom_my/Mowom/mowom-french/app/src/main/AndroidManifest.xml:24:22-62
uses-permission#android.permission.RECEIVE_BOOT_COMPLETED
ADDED from /home/mital/Mital_Qtm/mowom_my/Mowom/mowom-french/app/src/main/AndroidManifest.xml:26:5-81
	android:name
		ADDED from /home/mital/Mital_Qtm/mowom_my/Mowom/mowom-french/app/src/main/AndroidManifest.xml:26:22-78
uses-permission#android.permission.VIBRATE
ADDED from /home/mital/Mital_Qtm/mowom_my/Mowom/mowom-french/app/src/main/AndroidManifest.xml:27:5-66
MERGED from [com.wdullaer:materialdatetimepicker:2.5.0] /home/mital/.android/build-cache/b543e9677e0334bf8ffaaeaa22abd4b16c046a75/output/AndroidManifest.xml:26:5-66
	android:name
		ADDED from /home/mital/Mital_Qtm/mowom_my/Mowom/mowom-french/app/src/main/AndroidManifest.xml:27:22-63
uses-permission#android.permission.WAKE_LOCK
ADDED from /home/mital/Mital_Qtm/mowom_my/Mowom/mowom-french/app/src/main/AndroidManifest.xml:28:5-68
MERGED from [com.google.android.gms:play-services-analytics:9.6.1] /home/mital/.android/build-cache/7d44cc0d8f9b3af1c3a463b2e7cc0e948de2514c/output/AndroidManifest.xml:24:5-67
MERGED from [com.google.android.gms:play-services-analytics-impl:9.6.1] /home/mital/.android/build-cache/39e6bd93db2b1e0b75dcabb1aba54e962f15208e/output/AndroidManifest.xml:24:5-67
MERGED from [com.google.firebase:firebase-analytics:9.6.1] /home/mital/.android/build-cache/0a6618c6e1d2c28805ef48d2a1901a6ec6e1f4f3/output/AndroidManifest.xml:22:5-67
MERGED from [com.google.firebase:firebase-analytics-impl:9.6.1] /home/mital/.android/build-cache/1eae94826d50cd4ccda38d47b67e7152e97b411f/output/AndroidManifest.xml:22:5-67
MERGED from [com.google.firebase:firebase-iid:9.6.1] /home/mital/.android/build-cache/d859aa7feafdadd165d66c232ec0a0e2571ec06e/output/AndroidManifest.xml:21:5-67
	android:name
		ADDED from /home/mital/Mital_Qtm/mowom_my/Mowom/mowom-french/app/src/main/AndroidManifest.xml:28:22-65
uses-permission#android.permission.GET_ACCOUNTS
ADDED from /home/mital/Mital_Qtm/mowom_my/Mowom/mowom-french/app/src/main/AndroidManifest.xml:29:5-71
	android:name
		ADDED from /home/mital/Mital_Qtm/mowom_my/Mowom/mowom-french/app/src/main/AndroidManifest.xml:29:22-68
uses-permission#com.google.android.c2dm.permission.RECEIVE
ADDED from /home/mital/Mital_Qtm/mowom_my/Mowom/mowom-french/app/src/main/AndroidManifest.xml:30:5-82
MERGED from [com.google.android.gms:play-services-gcm:9.6.1] /home/mital/.android/build-cache/0c240251ac1470570233410719de241295a2623b/output/AndroidManifest.xml:20:5-81
MERGED from [com.google.android.gms:play-services-iid:9.6.1] /home/mital/.android/build-cache/2284ea1411b01a9b2d9c083335afa21081d384e6/output/AndroidManifest.xml:20:5-81
MERGED from [com.google.firebase:firebase-iid:9.6.1] /home/mital/.android/build-cache/d859aa7feafdadd165d66c232ec0a0e2571ec06e/output/AndroidManifest.xml:22:5-81
	android:name
		ADDED from /home/mital/Mital_Qtm/mowom_my/Mowom/mowom-french/app/src/main/AndroidManifest.xml:30:22-79
permission#com.asrapps.mowom.permission.C2D_MESSAGE
ADDED from /home/mital/Mital_Qtm/mowom_my/Mowom/mowom-french/app/src/main/AndroidManifest.xml:32:5-34:47
MERGED from [com.google.firebase:firebase-iid:9.6.1] /home/mital/.android/build-cache/d859aa7feafdadd165d66c232ec0a0e2571ec06e/output/AndroidManifest.xml:24:5-109
	android:protectionLevel
		ADDED from /home/mital/Mital_Qtm/mowom_my/Mowom/mowom-french/app/src/main/AndroidManifest.xml:34:9-44
	android:name
		ADDED from /home/mital/Mital_Qtm/mowom_my/Mowom/mowom-french/app/src/main/AndroidManifest.xml:33:9-64
uses-permission#com.asrapps.mowom.permission.C2D_MESSAGE
ADDED from /home/mital/Mital_Qtm/mowom_my/Mowom/mowom-french/app/src/main/AndroidManifest.xml:36:5-80
MERGED from [com.google.firebase:firebase-iid:9.6.1] /home/mital/.android/build-cache/d859aa7feafdadd165d66c232ec0a0e2571ec06e/output/AndroidManifest.xml:26:5-78
	android:name
		ADDED from /home/mital/Mital_Qtm/mowom_my/Mowom/mowom-french/app/src/main/AndroidManifest.xml:36:22-77
application
ADDED from /home/mital/Mital_Qtm/mowom_my/Mowom/mowom-french/app/src/main/AndroidManifest.xml:38:5-206:19
MERGED from [mowom-french:Persianmaterialdatetimepicker:unspecified] /home/mital/Mital_Qtm/mowom_my/Mowom/mowom-french/Persianmaterialdatetimepicker/build/intermediates/bundles/default/AndroidManifest.xml:11:5-15:19
MERGED from [com.wdullaer:materialdatetimepicker:2.5.0] /home/mital/.android/build-cache/b543e9677e0334bf8ffaaeaa22abd4b16c046a75/output/AndroidManifest.xml:28:5-20
MERGED from [mowom-french:materialdatetimepicker:unspecified] /home/mital/Mital_Qtm/mowom_my/Mowom/mowom-french/materialdatetimepicker/build/intermediates/bundles/default/AndroidManifest.xml:11:5-15:19
MERGED from [com.android.support:appcompat-v7:24.2.0] /home/mital/.android/build-cache/49f4c958d6a3de61596a8e34c083640b9cc63c60/output/AndroidManifest.xml:25:5-20
MERGED from [com.android.support:animated-vector-drawable:24.2.0] /home/mital/.android/build-cache/ddd61572c86022d413be207150ce35b30a368664/output/AndroidManifest.xml:22:5-20
MERGED from [com.android.support:support-vector-drawable:24.2.0] /home/mital/.android/build-cache/a834c590ccebbadb34848ea56046d5d419a96f34/output/AndroidManifest.xml:23:5-20
MERGED from [com.google.android.gms:play-services-gcm:9.6.1] /home/mital/.android/build-cache/0c240251ac1470570233410719de241295a2623b/output/AndroidManifest.xml:23:5-19
MERGED from [com.google.android.gms:play-services-iid:9.6.1] /home/mital/.android/build-cache/2284ea1411b01a9b2d9c083335afa21081d384e6/output/AndroidManifest.xml:23:5-19
MERGED from [com.google.android.gms:play-services-location:9.6.1] /home/mital/.android/build-cache/32bb09bcb0c819fce23feac1280308602ce1898b/output/AndroidManifest.xml:4:5-19
MERGED from [com.google.android.gms:play-services-maps:9.6.1] /home/mital/.android/build-cache/0f6aad8de112173b49be01b33b65a2c4713d1669/output/AndroidManifest.xml:24:5-19
MERGED from [com.google.android.gms:play-services-analytics:9.6.1] /home/mital/.android/build-cache/7d44cc0d8f9b3af1c3a463b2e7cc0e948de2514c/output/AndroidManifest.xml:26:5-19
MERGED from [com.google.android.gms:play-services-analytics-impl:9.6.1] /home/mital/.android/build-cache/39e6bd93db2b1e0b75dcabb1aba54e962f15208e/output/AndroidManifest.xml:26:5-19
MERGED from [com.google.android.gms:play-services-base:9.6.1] /home/mital/.android/build-cache/01558cd0aafae75528f9d13d89e402d14c763ddb/output/AndroidManifest.xml:18:5-20:19
MERGED from [com.google.firebase:firebase-messaging:9.6.1] /home/mital/.android/build-cache/f2e029fd0c9132591384287f0f3ae099d8f7840e/output/AndroidManifest.xml:19:5-29:19
MERGED from [com.google.firebase:firebase-core:9.6.1] /home/mital/.android/build-cache/203b968c5066455f742e238d2ec77db977b2fcfe/output/AndroidManifest.xml:5:5-20
MERGED from [com.google.firebase:firebase-analytics:9.6.1] /home/mital/.android/build-cache/0a6618c6e1d2c28805ef48d2a1901a6ec6e1f4f3/output/AndroidManifest.xml:24:5-33:19
MERGED from [com.google.firebase:firebase-analytics-impl:9.6.1] /home/mital/.android/build-cache/1eae94826d50cd4ccda38d47b67e7152e97b411f/output/AndroidManifest.xml:24:5-28:19
MERGED from [com.google.firebase:firebase-iid:9.6.1] /home/mital/.android/build-cache/d859aa7feafdadd165d66c232ec0a0e2571ec06e/output/AndroidManifest.xml:28:5-50:19
MERGED from [com.google.firebase:firebase-common:9.6.1] /home/mital/.android/build-cache/0c4f62836d162f9dd108b0058c2f1afdf2d8188f/output/AndroidManifest.xml:4:5-7:19
MERGED from [com.google.android.gms:play-services-tasks:9.6.1] /home/mital/.android/build-cache/58fc8b10fc76fa7cc4368c5589cf06c4af30da71/output/AndroidManifest.xml:4:5-19
MERGED from [com.google.android.gms:play-services-basement:9.6.1] /home/mital/.android/build-cache/593aa3aa3608ae066608c38631ec66ca2b30cd23/output/AndroidManifest.xml:19:5-21:19
MERGED from [com.android.support:support-v4:24.2.0] /home/mital/.android/build-cache/860cdd8eefb584f997b9ed064e7ddd2c7d60071c/output/AndroidManifest.xml:25:5-20
MERGED from [com.android.support:support-fragment:24.2.0] /home/mital/.android/build-cache/dbef7fd62c53a8957065a9e3ff0791ea5c03f814/output/AndroidManifest.xml:25:5-20
MERGED from [com.android.support:support-core-utils:24.2.0] /home/mital/.android/build-cache/a5acdcacc9422abe345c22b156ef6c4e9034eb01/output/AndroidManifest.xml:25:5-20
MERGED from [com.android.support:support-media-compat:24.2.0] /home/mital/.android/build-cache/2c75b1abe41a9c029580cec247264d9042a1d028/output/AndroidManifest.xml:25:5-20
MERGED from [com.android.support:support-core-ui:24.2.0] /home/mital/.android/build-cache/304acd813faec7445590610c1a399b2f0e93e7b5/output/AndroidManifest.xml:25:5-20
MERGED from [com.android.support:support-compat:24.2.0] /home/mital/.android/build-cache/eed61c1888909027014f6ce4d8c0dd7a2d43b360/output/AndroidManifest.xml:25:5-20
	android:label
		ADDED from /home/mital/Mital_Qtm/mowom_my/Mowom/mowom-french/app/src/main/AndroidManifest.xml:43:9-41
	android:supportsRtl
		ADDED from /home/mital/Mital_Qtm/mowom_my/Mowom/mowom-french/app/src/main/AndroidManifest.xml:45:9-35
	android:hardwareAccelerated
		ADDED from /home/mital/Mital_Qtm/mowom_my/Mowom/mowom-french/app/src/main/AndroidManifest.xml:41:9-44
	android:allowBackup
		ADDED from /home/mital/Mital_Qtm/mowom_my/Mowom/mowom-french/app/src/main/AndroidManifest.xml:40:9-35
	android:icon
		ADDED from /home/mital/Mital_Qtm/mowom_my/Mowom/mowom-french/app/src/main/AndroidManifest.xml:42:9-45
	android:largeHeap
		ADDED from /home/mital/Mital_Qtm/mowom_my/Mowom/mowom-french/app/src/main/AndroidManifest.xml:44:9-33
	android:theme
		ADDED from /home/mital/Mital_Qtm/mowom_my/Mowom/mowom-french/app/src/main/AndroidManifest.xml:46:9-67
	android:name
		ADDED from /home/mital/Mital_Qtm/mowom_my/Mowom/mowom-french/app/src/main/AndroidManifest.xml:39:9-36
receiver#com.asrapps.mowom.broadcost.AlarmNotiBroadcastReceiver
ADDED from /home/mital/Mital_Qtm/mowom_my/Mowom/mowom-french/app/src/main/AndroidManifest.xml:47:9-48:20
	android:name
		ADDED from /home/mital/Mital_Qtm/mowom_my/Mowom/mowom-french/app/src/main/AndroidManifest.xml:47:19-71
activity#com.asrapps.mowom.base.AppMainTabActivity
ADDED from /home/mital/Mital_Qtm/mowom_my/Mowom/mowom-french/app/src/main/AndroidManifest.xml:49:9-54:58
	android:screenOrientation
		ADDED from /home/mital/Mital_Qtm/mowom_my/Mowom/mowom-french/app/src/main/AndroidManifest.xml:53:13-49
	android:label
		ADDED from /home/mital/Mital_Qtm/mowom_my/Mowom/mowom-french/app/src/main/AndroidManifest.xml:52:13-45
	android:windowSoftInputMode
		ADDED from /home/mital/Mital_Qtm/mowom_my/Mowom/mowom-french/app/src/main/AndroidManifest.xml:54:13-55
	android:configChanges
		ADDED from /home/mital/Mital_Qtm/mowom_my/Mowom/mowom-french/app/src/main/AndroidManifest.xml:51:13-74
	android:name
		ADDED from /home/mital/Mital_Qtm/mowom_my/Mowom/mowom-french/app/src/main/AndroidManifest.xml:50:13-52
activity#com.asrapps.mowom.Splash_Sceen_Activity
ADDED from /home/mital/Mital_Qtm/mowom_my/Mowom/mowom-french/app/src/main/AndroidManifest.xml:56:9-65:20
	android:screenOrientation
		ADDED from /home/mital/Mital_Qtm/mowom_my/Mowom/mowom-french/app/src/main/AndroidManifest.xml:58:13-49
	android:windowSoftInputMode
		ADDED from /home/mital/Mital_Qtm/mowom_my/Mowom/mowom-french/app/src/main/AndroidManifest.xml:59:13-67
	android:name
		ADDED from /home/mital/Mital_Qtm/mowom_my/Mowom/mowom-french/app/src/main/AndroidManifest.xml:57:13-50
intent-filter#android.intent.action.MAIN+android.intent.category.LAUNCHER
ADDED from /home/mital/Mital_Qtm/mowom_my/Mowom/mowom-french/app/src/main/AndroidManifest.xml:60:13-64:29
action#android.intent.action.MAIN
ADDED from /home/mital/Mital_Qtm/mowom_my/Mowom/mowom-french/app/src/main/AndroidManifest.xml:61:17-69
	android:name
		ADDED from /home/mital/Mital_Qtm/mowom_my/Mowom/mowom-french/app/src/main/AndroidManifest.xml:61:25-66
category#android.intent.category.LAUNCHER
ADDED from /home/mital/Mital_Qtm/mowom_my/Mowom/mowom-french/app/src/main/AndroidManifest.xml:63:17-77
	android:name
		ADDED from /home/mital/Mital_Qtm/mowom_my/Mowom/mowom-french/app/src/main/AndroidManifest.xml:63:27-74
activity#com.asrapps.mowom.LoginActivity
ADDED from /home/mital/Mital_Qtm/mowom_my/Mowom/mowom-french/app/src/main/AndroidManifest.xml:67:9-71:70
	android:screenOrientation
		ADDED from /home/mital/Mital_Qtm/mowom_my/Mowom/mowom-french/app/src/main/AndroidManifest.xml:70:13-49
	android:label
		ADDED from /home/mital/Mital_Qtm/mowom_my/Mowom/mowom-french/app/src/main/AndroidManifest.xml:69:13-45
	android:windowSoftInputMode
		ADDED from /home/mital/Mital_Qtm/mowom_my/Mowom/mowom-french/app/src/main/AndroidManifest.xml:71:13-67
	android:name
		ADDED from /home/mital/Mital_Qtm/mowom_my/Mowom/mowom-french/app/src/main/AndroidManifest.xml:68:13-42
activity#com.asrapps.mowom.Forget_Password_Activity
ADDED from /home/mital/Mital_Qtm/mowom_my/Mowom/mowom-french/app/src/main/AndroidManifest.xml:73:9-77:70
	android:screenOrientation
		ADDED from /home/mital/Mital_Qtm/mowom_my/Mowom/mowom-french/app/src/main/AndroidManifest.xml:76:13-49
	android:label
		ADDED from /home/mital/Mital_Qtm/mowom_my/Mowom/mowom-french/app/src/main/AndroidManifest.xml:75:13-45
	android:windowSoftInputMode
		ADDED from /home/mital/Mital_Qtm/mowom_my/Mowom/mowom-french/app/src/main/AndroidManifest.xml:77:13-67
	android:name
		ADDED from /home/mital/Mital_Qtm/mowom_my/Mowom/mowom-french/app/src/main/AndroidManifest.xml:74:13-53
activity#com.asrapps.mowom.Dashboard_Activity
ADDED from /home/mital/Mital_Qtm/mowom_my/Mowom/mowom-french/app/src/main/AndroidManifest.xml:79:9-83:70
	android:screenOrientation
		ADDED from /home/mital/Mital_Qtm/mowom_my/Mowom/mowom-french/app/src/main/AndroidManifest.xml:82:13-49
	android:label
		ADDED from /home/mital/Mital_Qtm/mowom_my/Mowom/mowom-french/app/src/main/AndroidManifest.xml:81:13-45
	android:windowSoftInputMode
		ADDED from /home/mital/Mital_Qtm/mowom_my/Mowom/mowom-french/app/src/main/AndroidManifest.xml:83:13-67
	android:name
		ADDED from /home/mital/Mital_Qtm/mowom_my/Mowom/mowom-french/app/src/main/AndroidManifest.xml:80:13-47
activity#com.asrapps.mowom.LogoScreenActivity
ADDED from /home/mital/Mital_Qtm/mowom_my/Mowom/mowom-french/app/src/main/AndroidManifest.xml:85:9-89:70
	android:screenOrientation
		ADDED from /home/mital/Mital_Qtm/mowom_my/Mowom/mowom-french/app/src/main/AndroidManifest.xml:88:13-49
	android:label
		ADDED from /home/mital/Mital_Qtm/mowom_my/Mowom/mowom-french/app/src/main/AndroidManifest.xml:87:13-45
	android:windowSoftInputMode
		ADDED from /home/mital/Mital_Qtm/mowom_my/Mowom/mowom-french/app/src/main/AndroidManifest.xml:89:13-67
	android:name
		ADDED from /home/mital/Mital_Qtm/mowom_my/Mowom/mowom-french/app/src/main/AndroidManifest.xml:86:13-47
meta-data#com.google.android.maps.v2.API_KEY
ADDED from /home/mital/Mital_Qtm/mowom_my/Mowom/mowom-french/app/src/main/AndroidManifest.xml:106:9-108:78
	android:value
		ADDED from /home/mital/Mital_Qtm/mowom_my/Mowom/mowom-french/app/src/main/AndroidManifest.xml:108:20-75
	android:name
		ADDED from /home/mital/Mital_Qtm/mowom_my/Mowom/mowom-french/app/src/main/AndroidManifest.xml:107:20-69
meta-data#com.google.android.gms.version
ADDED from /home/mital/Mital_Qtm/mowom_my/Mowom/mowom-french/app/src/main/AndroidManifest.xml:119:9-121:69
MERGED from [com.google.android.gms:play-services-basement:9.6.1] /home/mital/.android/build-cache/593aa3aa3608ae066608c38631ec66ca2b30cd23/output/AndroidManifest.xml:20:9-121
	android:value
		ADDED from /home/mital/Mital_Qtm/mowom_my/Mowom/mowom-french/app/src/main/AndroidManifest.xml:121:13-66
	android:name
		ADDED from /home/mital/Mital_Qtm/mowom_my/Mowom/mowom-french/app/src/main/AndroidManifest.xml:120:13-58
service#com.asrapps.mowom.broadcost.UpdaterService
ADDED from /home/mital/Mital_Qtm/mowom_my/Mowom/mowom-french/app/src/main/AndroidManifest.xml:147:9-149:38
	android:enabled
		ADDED from /home/mital/Mital_Qtm/mowom_my/Mowom/mowom-french/app/src/main/AndroidManifest.xml:149:13-35
	android:name
		ADDED from /home/mital/Mital_Qtm/mowom_my/Mowom/mowom-french/app/src/main/AndroidManifest.xml:148:13-53
service#com.asrapps.mowom.broadcost.MowomService
ADDED from /home/mital/Mital_Qtm/mowom_my/Mowom/mowom-french/app/src/main/AndroidManifest.xml:161:9-163:38
	android:enabled
		ADDED from /home/mital/Mital_Qtm/mowom_my/Mowom/mowom-french/app/src/main/AndroidManifest.xml:163:13-35
	android:name
		ADDED from /home/mital/Mital_Qtm/mowom_my/Mowom/mowom-french/app/src/main/AndroidManifest.xml:162:13-51
service#com.asrapps.mowom.FCM.RegistrationIntentService
ADDED from /home/mital/Mital_Qtm/mowom_my/Mowom/mowom-french/app/src/main/AndroidManifest.xml:167:9-173:19
	android:name
		ADDED from /home/mital/Mital_Qtm/mowom_my/Mowom/mowom-french/app/src/main/AndroidManifest.xml:167:18-63
intent-filter#com.google.firebase.MESSAGING_EVENT
ADDED from /home/mital/Mital_Qtm/mowom_my/Mowom/mowom-french/app/src/main/AndroidManifest.xml:170:13-172:29
action#com.google.firebase.MESSAGING_EVENT
ADDED from /home/mital/Mital_Qtm/mowom_my/Mowom/mowom-french/app/src/main/AndroidManifest.xml:171:17-78
	android:name
		ADDED from /home/mital/Mital_Qtm/mowom_my/Mowom/mowom-french/app/src/main/AndroidManifest.xml:171:25-75
service#com.asrapps.mowom.FCM.MyInstanceIDListenerService
ADDED from /home/mital/Mital_Qtm/mowom_my/Mowom/mowom-french/app/src/main/AndroidManifest.xml:176:9-180:19
	android:name
		ADDED from /home/mital/Mital_Qtm/mowom_my/Mowom/mowom-french/app/src/main/AndroidManifest.xml:176:18-65
intent-filter#com.google.firebase.INSTANCE_ID_EVENT
ADDED from /home/mital/Mital_Qtm/mowom_my/Mowom/mowom-french/app/src/main/AndroidManifest.xml:177:13-179:29
action#com.google.firebase.INSTANCE_ID_EVENT
ADDED from /home/mital/Mital_Qtm/mowom_my/Mowom/mowom-french/app/src/main/AndroidManifest.xml:178:17-80
	android:name
		ADDED from /home/mital/Mital_Qtm/mowom_my/Mowom/mowom-french/app/src/main/AndroidManifest.xml:178:25-77
receiver#com.asrapps.mowom.broadcost.BatteryLevelReceiver
ADDED from /home/mital/Mital_Qtm/mowom_my/Mowom/mowom-french/app/src/main/AndroidManifest.xml:184:9-194:20
	android:name
		ADDED from /home/mital/Mital_Qtm/mowom_my/Mowom/mowom-french/app/src/main/AndroidManifest.xml:184:19-65
intent-filter#android.intent.action.ACTION_POWER_CONNECTED+android.intent.action.ACTION_POWER_DISCONNECTED+android.intent.action.BATTERY_CHANGED+android.intent.action.BATTERY_LOW+android.intent.action.BATTERY_OKAY
ADDED from /home/mital/Mital_Qtm/mowom_my/Mowom/mowom-french/app/src/main/AndroidManifest.xml:185:13-191:29
	android:priority
		ADDED from /home/mital/Mital_Qtm/mowom_my/Mowom/mowom-french/app/src/main/AndroidManifest.xml:185:28-50
action#android.intent.action.BATTERY_LOW
ADDED from /home/mital/Mital_Qtm/mowom_my/Mowom/mowom-french/app/src/main/AndroidManifest.xml:186:17-76
	android:name
		ADDED from /home/mital/Mital_Qtm/mowom_my/Mowom/mowom-french/app/src/main/AndroidManifest.xml:186:25-73
action#android.intent.action.BATTERY_OKAY
ADDED from /home/mital/Mital_Qtm/mowom_my/Mowom/mowom-french/app/src/main/AndroidManifest.xml:187:17-77
	android:name
		ADDED from /home/mital/Mital_Qtm/mowom_my/Mowom/mowom-french/app/src/main/AndroidManifest.xml:187:25-74
action#android.intent.action.ACTION_POWER_CONNECTED
ADDED from /home/mital/Mital_Qtm/mowom_my/Mowom/mowom-french/app/src/main/AndroidManifest.xml:188:17-87
	android:name
		ADDED from /home/mital/Mital_Qtm/mowom_my/Mowom/mowom-french/app/src/main/AndroidManifest.xml:188:25-84
action#android.intent.action.ACTION_POWER_DISCONNECTED
ADDED from /home/mital/Mital_Qtm/mowom_my/Mowom/mowom-french/app/src/main/AndroidManifest.xml:189:17-90
	android:name
		ADDED from /home/mital/Mital_Qtm/mowom_my/Mowom/mowom-french/app/src/main/AndroidManifest.xml:189:25-87
action#android.intent.action.BATTERY_CHANGED
ADDED from /home/mital/Mital_Qtm/mowom_my/Mowom/mowom-french/app/src/main/AndroidManifest.xml:190:17-80
	android:name
		ADDED from /home/mital/Mital_Qtm/mowom_my/Mowom/mowom-french/app/src/main/AndroidManifest.xml:190:25-77
provider#android.support.v4.content.FileProvider
ADDED from /home/mital/Mital_Qtm/mowom_my/Mowom/mowom-french/app/src/main/AndroidManifest.xml:196:9-204:20
	android:authorities
		ADDED from /home/mital/Mital_Qtm/mowom_my/Mowom/mowom-french/app/src/main/AndroidManifest.xml:198:13-61
	android:grantUriPermissions
		ADDED from /home/mital/Mital_Qtm/mowom_my/Mowom/mowom-french/app/src/main/AndroidManifest.xml:199:13-47
	android:exported
		ADDED from /home/mital/Mital_Qtm/mowom_my/Mowom/mowom-french/app/src/main/AndroidManifest.xml:200:13-37
	android:name
		ADDED from /home/mital/Mital_Qtm/mowom_my/Mowom/mowom-french/app/src/main/AndroidManifest.xml:197:13-67
meta-data#android.support.FILE_PROVIDER_PATHS
ADDED from /home/mital/Mital_Qtm/mowom_my/Mowom/mowom-french/app/src/main/AndroidManifest.xml:201:13-203:52
	android:resource
		ADDED from /home/mital/Mital_Qtm/mowom_my/Mowom/mowom-french/app/src/main/AndroidManifest.xml:203:17-50
	android:name
		ADDED from /home/mital/Mital_Qtm/mowom_my/Mowom/mowom-french/app/src/main/AndroidManifest.xml:202:17-67
uses-feature#0x00020000
ADDED from [com.google.android.gms:play-services-maps:9.6.1] /home/mital/.android/build-cache/0f6aad8de112173b49be01b33b65a2c4713d1669/output/AndroidManifest.xml:21:5-77
	android:glEsVersion
		ADDED from [com.google.android.gms:play-services-maps:9.6.1] /home/mital/.android/build-cache/0f6aad8de112173b49be01b33b65a2c4713d1669/output/AndroidManifest.xml:21:19-51
	android:required
		ADDED from [com.google.android.gms:play-services-maps:9.6.1] /home/mital/.android/build-cache/0f6aad8de112173b49be01b33b65a2c4713d1669/output/AndroidManifest.xml:21:52-75
activity#com.google.android.gms.common.api.GoogleApiActivity
ADDED from [com.google.android.gms:play-services-base:9.6.1] /home/mital/.android/build-cache/01558cd0aafae75528f9d13d89e402d14c763ddb/output/AndroidManifest.xml:19:9-172
	android:exported
		ADDED from [com.google.android.gms:play-services-base:9.6.1] /home/mital/.android/build-cache/01558cd0aafae75528f9d13d89e402d14c763ddb/output/AndroidManifest.xml:19:146-170
	android:theme
		ADDED from [com.google.android.gms:play-services-base:9.6.1] /home/mital/.android/build-cache/01558cd0aafae75528f9d13d89e402d14c763ddb/output/AndroidManifest.xml:19:86-145
	android:name
		ADDED from [com.google.android.gms:play-services-base:9.6.1] /home/mital/.android/build-cache/01558cd0aafae75528f9d13d89e402d14c763ddb/output/AndroidManifest.xml:19:19-85
service#com.google.firebase.messaging.FirebaseMessagingService
ADDED from [com.google.firebase:firebase-messaging:9.6.1] /home/mital/.android/build-cache/f2e029fd0c9132591384287f0f3ae099d8f7840e/output/AndroidManifest.xml:23:9-27:19
	android:exported
		ADDED from [com.google.firebase:firebase-messaging:9.6.1] /home/mital/.android/build-cache/f2e029fd0c9132591384287f0f3ae099d8f7840e/output/AndroidManifest.xml:23:88-111
	android:name
		ADDED from [com.google.firebase:firebase-messaging:9.6.1] /home/mital/.android/build-cache/f2e029fd0c9132591384287f0f3ae099d8f7840e/output/AndroidManifest.xml:23:18-87
receiver#com.google.android.gms.measurement.AppMeasurementReceiver
ADDED from [com.google.firebase:firebase-analytics:9.6.1] /home/mital/.android/build-cache/0a6618c6e1d2c28805ef48d2a1901a6ec6e1f4f3/output/AndroidManifest.xml:25:7-26:18
MERGED from [com.google.firebase:firebase-analytics-impl:9.6.1] /home/mital/.android/build-cache/1eae94826d50cd4ccda38d47b67e7152e97b411f/output/AndroidManifest.xml:25:7-26:18
	android:enabled
		ADDED from [com.google.firebase:firebase-analytics:9.6.1] /home/mital/.android/build-cache/0a6618c6e1d2c28805ef48d2a1901a6ec6e1f4f3/output/AndroidManifest.xml:25:90-112
	android:exported
		ADDED from [com.google.firebase:firebase-analytics:9.6.1] /home/mital/.android/build-cache/0a6618c6e1d2c28805ef48d2a1901a6ec6e1f4f3/output/AndroidManifest.xml:25:113-137
	android:name
		ADDED from [com.google.firebase:firebase-analytics:9.6.1] /home/mital/.android/build-cache/0a6618c6e1d2c28805ef48d2a1901a6ec6e1f4f3/output/AndroidManifest.xml:25:17-89
receiver#com.google.android.gms.measurement.AppMeasurementInstallReferrerReceiver
ADDED from [com.google.firebase:firebase-analytics:9.6.1] /home/mital/.android/build-cache/0a6618c6e1d2c28805ef48d2a1901a6ec6e1f4f3/output/AndroidManifest.xml:27:7-31:18
	android:enabled
		ADDED from [com.google.firebase:firebase-analytics:9.6.1] /home/mital/.android/build-cache/0a6618c6e1d2c28805ef48d2a1901a6ec6e1f4f3/output/AndroidManifest.xml:27:162-184
	android:permission
		ADDED from [com.google.firebase:firebase-analytics:9.6.1] /home/mital/.android/build-cache/0a6618c6e1d2c28805ef48d2a1901a6ec6e1f4f3/output/AndroidManifest.xml:27:105-161
	android:name
		ADDED from [com.google.firebase:firebase-analytics:9.6.1] /home/mital/.android/build-cache/0a6618c6e1d2c28805ef48d2a1901a6ec6e1f4f3/output/AndroidManifest.xml:27:17-104
intent-filter#com.android.vending.INSTALL_REFERRER
ADDED from [com.google.firebase:firebase-analytics:9.6.1] /home/mital/.android/build-cache/0a6618c6e1d2c28805ef48d2a1901a6ec6e1f4f3/output/AndroidManifest.xml:28:11-30:27
action#com.android.vending.INSTALL_REFERRER
ADDED from [com.google.firebase:firebase-analytics:9.6.1] /home/mital/.android/build-cache/0a6618c6e1d2c28805ef48d2a1901a6ec6e1f4f3/output/AndroidManifest.xml:29:15-76
	android:name
		ADDED from [com.google.firebase:firebase-analytics:9.6.1] /home/mital/.android/build-cache/0a6618c6e1d2c28805ef48d2a1901a6ec6e1f4f3/output/AndroidManifest.xml:29:23-74
service#com.google.android.gms.measurement.AppMeasurementService
ADDED from [com.google.firebase:firebase-analytics:9.6.1] /home/mital/.android/build-cache/0a6618c6e1d2c28805ef48d2a1901a6ec6e1f4f3/output/AndroidManifest.xml:32:7-137
MERGED from [com.google.firebase:firebase-analytics-impl:9.6.1] /home/mital/.android/build-cache/1eae94826d50cd4ccda38d47b67e7152e97b411f/output/AndroidManifest.xml:27:7-137
	android:enabled
		ADDED from [com.google.firebase:firebase-analytics:9.6.1] /home/mital/.android/build-cache/0a6618c6e1d2c28805ef48d2a1901a6ec6e1f4f3/output/AndroidManifest.xml:32:88-110
	android:exported
		ADDED from [com.google.firebase:firebase-analytics:9.6.1] /home/mital/.android/build-cache/0a6618c6e1d2c28805ef48d2a1901a6ec6e1f4f3/output/AndroidManifest.xml:32:111-135
	android:name
		ADDED from [com.google.firebase:firebase-analytics:9.6.1] /home/mital/.android/build-cache/0a6618c6e1d2c28805ef48d2a1901a6ec6e1f4f3/output/AndroidManifest.xml:32:16-87
receiver#com.google.firebase.iid.FirebaseInstanceIdReceiver
ADDED from [com.google.firebase:firebase-iid:9.6.1] /home/mital/.android/build-cache/d859aa7feafdadd165d66c232ec0a0e2571ec06e/output/AndroidManifest.xml:30:9-36:20
	android:exported
		ADDED from [com.google.firebase:firebase-iid:9.6.1] /home/mital/.android/build-cache/d859aa7feafdadd165d66c232ec0a0e2571ec06e/output/AndroidManifest.xml:30:85-108
	android:permission
		ADDED from [com.google.firebase:firebase-iid:9.6.1] /home/mital/.android/build-cache/d859aa7feafdadd165d66c232ec0a0e2571ec06e/output/AndroidManifest.xml:30:109-169
	android:name
		ADDED from [com.google.firebase:firebase-iid:9.6.1] /home/mital/.android/build-cache/d859aa7feafdadd165d66c232ec0a0e2571ec06e/output/AndroidManifest.xml:30:19-84
intent-filter#${applicationId}+com.google.android.c2dm.intent.RECEIVE+com.google.android.c2dm.intent.REGISTRATION
ADDED from [com.google.firebase:firebase-iid:9.6.1] /home/mital/.android/build-cache/d859aa7feafdadd165d66c232ec0a0e2571ec06e/output/AndroidManifest.xml:31:13-35:29
action#com.google.android.c2dm.intent.RECEIVE
ADDED from [com.google.firebase:firebase-iid:9.6.1] /home/mital/.android/build-cache/d859aa7feafdadd165d66c232ec0a0e2571ec06e/output/AndroidManifest.xml:32:17-80
	android:name
		ADDED from [com.google.firebase:firebase-iid:9.6.1] /home/mital/.android/build-cache/d859aa7feafdadd165d66c232ec0a0e2571ec06e/output/AndroidManifest.xml:32:25-78
action#com.google.android.c2dm.intent.REGISTRATION
ADDED from [com.google.firebase:firebase-iid:9.6.1] /home/mital/.android/build-cache/d859aa7feafdadd165d66c232ec0a0e2571ec06e/output/AndroidManifest.xml:33:17-85
	android:name
		ADDED from [com.google.firebase:firebase-iid:9.6.1] /home/mital/.android/build-cache/d859aa7feafdadd165d66c232ec0a0e2571ec06e/output/AndroidManifest.xml:33:25-83
category#${applicationId}
ADDED from [com.google.firebase:firebase-iid:9.6.1] /home/mital/.android/build-cache/d859aa7feafdadd165d66c232ec0a0e2571ec06e/output/AndroidManifest.xml:34:17-60
	android:name
		ADDED from [com.google.firebase:firebase-iid:9.6.1] /home/mital/.android/build-cache/d859aa7feafdadd165d66c232ec0a0e2571ec06e/output/AndroidManifest.xml:34:27-58
receiver#com.google.firebase.iid.FirebaseInstanceIdInternalReceiver
ADDED from [com.google.firebase:firebase-iid:9.6.1] /home/mital/.android/build-cache/d859aa7feafdadd165d66c232ec0a0e2571ec06e/output/AndroidManifest.xml:40:9-119
	android:exported
		ADDED from [com.google.firebase:firebase-iid:9.6.1] /home/mital/.android/build-cache/d859aa7feafdadd165d66c232ec0a0e2571ec06e/output/AndroidManifest.xml:40:93-117
	android:name
		ADDED from [com.google.firebase:firebase-iid:9.6.1] /home/mital/.android/build-cache/d859aa7feafdadd165d66c232ec0a0e2571ec06e/output/AndroidManifest.xml:40:19-92
service#com.google.firebase.iid.FirebaseInstanceIdService
ADDED from [com.google.firebase:firebase-iid:9.6.1] /home/mital/.android/build-cache/d859aa7feafdadd165d66c232ec0a0e2571ec06e/output/AndroidManifest.xml:44:9-48:19
	android:exported
		ADDED from [com.google.firebase:firebase-iid:9.6.1] /home/mital/.android/build-cache/d859aa7feafdadd165d66c232ec0a0e2571ec06e/output/AndroidManifest.xml:44:83-106
	android:name
		ADDED from [com.google.firebase:firebase-iid:9.6.1] /home/mital/.android/build-cache/d859aa7feafdadd165d66c232ec0a0e2571ec06e/output/AndroidManifest.xml:44:18-82
provider#com.google.firebase.provider.FirebaseInitProvider
ADDED from [com.google.firebase:firebase-common:9.6.1] /home/mital/.android/build-cache/0c4f62836d162f9dd108b0058c2f1afdf2d8188f/output/AndroidManifest.xml:6:9-175
	android:authorities
		ADDED from [com.google.firebase:firebase-common:9.6.1] /home/mital/.android/build-cache/0c4f62836d162f9dd108b0058c2f1afdf2d8188f/output/AndroidManifest.xml:6:19-78
	android:exported
		ADDED from [com.google.firebase:firebase-common:9.6.1] /home/mital/.android/build-cache/0c4f62836d162f9dd108b0058c2f1afdf2d8188f/output/AndroidManifest.xml:6:125-149
	android:initOrder
		ADDED from [com.google.firebase:firebase-common:9.6.1] /home/mital/.android/build-cache/0c4f62836d162f9dd108b0058c2f1afdf2d8188f/output/AndroidManifest.xml:6:150-173
	android:name
		ADDED from [com.google.firebase:firebase-common:9.6.1] /home/mital/.android/build-cache/0c4f62836d162f9dd108b0058c2f1afdf2d8188f/output/AndroidManifest.xml:6:79-124
