[gd_scene load_steps=2 format=2]

[ext_resource path="res://Music/bensound-adventure.wav" type="AudioStream" id=1]

[node name="BGMusic" type="AudioStreamPlayer"]
stream = ExtResource( 1 )
volume_db = -5.0
autoplay = true
