{
    "id": 1,
    "name": "Radni Prostor",
    "authors": [{
        "first_name": "Bogdan",
        "last_name": "Suboticki",
        "email": "bogdan.suboticki.19@singimail.rs",
        "web_page": "INVALID URL"
    }],
    "version": "1.0.0",
    "core_version": "1.0.0",
    "category": "editor",
    "licence": "MIT",
    "description": "Plugin za rad sa dokumentima",
    "web_page": "INVALID URL"
}
