2023-08-02 17:28:32.622 +02:00 [INF] User profile is available. Using 'C:\Users\neman\AppData\Local\ASP.NET\DataProtection-Keys' as key repository and Windows DPAPI to encrypt keys at rest.
2023-08-02 17:28:32.746 +02:00 [INF] Now listening on: https://localhost:7078
2023-08-02 17:28:32.747 +02:00 [INF] Now listening on: http://localhost:5025
2023-08-02 17:28:32.749 +02:00 [INF] Application started. Press Ctrl+C to shut down.
2023-08-02 17:28:32.750 +02:00 [INF] Hosting environment: Development
2023-08-02 17:28:32.750 +02:00 [INF] Content root path: C:\Users\neman\Desktop\NZWalks\NZWalks\NZWalks.API
2023-08-02 17:28:33.179 +02:00 [INF] Request starting HTTP/2 GET https://localhost:7078/swagger/index.html - -
2023-08-02 17:28:33.368 +02:00 [INF] Request finished HTTP/2 GET https://localhost:7078/swagger/index.html - - - 200 - text/html;charset=utf-8 192.3618ms
2023-08-02 17:28:33.376 +02:00 [INF] Request starting HTTP/2 GET https://localhost:7078/_framework/aspnetcore-browser-refresh.js - -
2023-08-02 17:28:33.381 +02:00 [INF] Request starting HTTP/2 GET https://localhost:7078/_vs/browserLink - -
2023-08-02 17:28:33.382 +02:00 [INF] Request finished HTTP/2 GET https://localhost:7078/_framework/aspnetcore-browser-refresh.js - - - 200 11992 application/javascript;+charset=utf-8 6.5586ms
2023-08-02 17:28:33.403 +02:00 [INF] Request finished HTTP/2 GET https://localhost:7078/_vs/browserLink - - - 200 - text/javascript;+charset=UTF-8 21.5087ms
2023-08-02 17:28:33.492 +02:00 [INF] Request starting HTTP/2 GET https://localhost:7078/swagger/v1/swagger.json - -
2023-08-02 17:28:33.617 +02:00 [INF] Request finished HTTP/2 GET https://localhost:7078/swagger/v1/swagger.json - - - 200 - application/json;charset=utf-8 125.6985ms
