{
  "artifactGenerations" : [ ],
  "artifactId" : "github",
  "groupId" : "org.finos.legend.showcase",
  "metamodelDependencies" : [ ],
  "projectDependencies" : [ ],
  "projectId" : "46165543",
  "projectStructureVersion" : {
    "extensionVersion" : 2,
    "version" : 12
  }
}