{
  "classifierPath" : "meta::pure::metamodel::type::Enumeration",
  "content" : {
    "_type" : "Enumeration",
    "name" : "IssuanceTypeEnumeration",
    "package" : "Model",
    "taggedValues" : [ {
      "tag" : {
        "profile" : "meta::pure::profiles::doc",
        "value" : "doc"
      },
      "value" : "Indicates if the row represents a currency issued by an authority, a natural resource precious metal, such as Gold, or a crypto-currency."
    } ],
    "values" : [ {
      "value" : "Currency"
    }, {
      "value" : "Commodity"
    }, {
      "value" : "Crypto"
    }, {
      "value" : "Fund"
    }, {
      "value" : "CurrencyMinorUnit"
    } ]
  }
}