{
  "classifierPath" : "meta::pure::metamodel::type::Class",
  "content" : {
    "_type" : "class",
    "name" : "TreatyOrganisation",
    "package" : "Model",
    "properties" : [ {
      "multiplicity" : {
        "lowerBound" : 1,
        "upperBound" : 1
      },
      "name" : "name",
      "type" : "String"
    } ],
    "superTypes" : [ "Model::IssuingAuthority" ]
  }
}