{
  "classifierPath" : "meta::pure::metamodel::diagram::Diagram",
  "content" : {
    "_type" : "diagram",
    "classViews" : [ {
      "class" : "cdm::model::TradableProduct",
      "id" : "96b6add0-de56-492e-9d7b-fc7e90dd37c9",
      "position" : {
        "x" : 84,
        "y" : 32
      },
      "rectangle" : {
        "height" : 128,
        "width" : 247.9599609375
      }
    }, {
      "class" : "cdm::model::Product",
      "id" : "ec108770-12b1-413b-ab62-f5ecf752a2f6",
      "position" : {
        "x" : 80,
        "y" : 200
      },
      "rectangle" : {
        "height" : 142,
        "width" : 257.7568359375
      }
    }, {
      "class" : "cdm::model::ContractualProduct",
      "id" : "04b5c4f8-83dc-4186-adac-eb8b7f7419e7",
      "position" : {
        "x" : 71,
        "y" : 371
      },
      "rectangle" : {
        "height" : 114,
        "width" : 273.61767578125
      }
    }, {
      "class" : "cdm::model::Payout",
      "id" : "a06a353f-4e1a-4dfc-aacc-cb244f636a55",
      "position" : {
        "x" : 73,
        "y" : 723
      },
      "rectangle" : {
        "height" : 198,
        "width" : 282.2490234375
      }
    }, {
      "class" : "cdm::model::OptionSettlement",
      "id" : "489ad762-fc89-4ef0-9f5d-f85b323f3461",
      "position" : {
        "x" : 1243.9022222222222,
        "y" : 3.7822222222222597
      },
      "rectangle" : {
        "height" : 86,
        "width" : 322.99951171875
      }
    }, {
      "class" : "cdm::model::EconomicTerms",
      "id" : "9398af98-7c7f-46b2-b51d-bf533692229e",
      "position" : {
        "x" : 46.692307692307736,
        "y" : 524
      },
      "rectangle" : {
        "height" : 156,
        "width" : 331.34619140625
      }
    }, {
      "class" : "cdm::model::OptionExercise",
      "id" : "628fe0ad-23a9-4007-bead-bb226b6e532d",
      "position" : {
        "x" : 779.3076923076924,
        "y" : 175.69230769230768
      },
      "rectangle" : {
        "height" : 100,
        "width" : 252.35888671875
      }
    }, {
      "class" : "cdm::model::OptionPayout",
      "id" : "874fe4e2-eb86-46ea-b72a-3fca6fa5d5d5",
      "position" : {
        "x" : 494.48,
        "y" : 485.4
      },
      "rectangle" : {
        "height" : 142,
        "width" : 245.1669921875
      }
    }, {
      "class" : "cdm::model::ObservationTerms",
      "id" : "60e00748-e859-4941-b18e-c292fa14295a",
      "position" : {
        "x" : 478.4118276742788,
        "y" : 736.8911111111112
      },
      "rectangle" : {
        "height" : 156,
        "width" : 299.361328125
      }
    }, {
      "class" : "cdm::model::OptionFeature",
      "id" : "ddf5d91b-6a24-49a4-8793-3d2dbb4037fc",
      "position" : {
        "x" : 777.4,
        "y" : 489.84000000000003
      },
      "rectangle" : {
        "height" : 128,
        "width" : 287.34619140625
      }
    }, {
      "class" : "cdm::model::AveragingCalculation",
      "id" : "e90beb9d-d38c-4b6f-a2d0-a353d6ea1f63",
      "position" : {
        "x" : 1147.4118276742788,
        "y" : 521.8911111111112
      },
      "rectangle" : {
        "height" : 72,
        "width" : 320.89404296875
      }
    }, {
      "class" : "cdm::model::ExerciseProcedure",
      "id" : "728a91e8-7091-42e7-949a-6d390b46e137",
      "position" : {
        "x" : 1432.448888888889,
        "y" : 137.19111111111113
      },
      "rectangle" : {
        "height" : 114,
        "width" : 250.4951171875
      }
    }, {
      "class" : "cdm::model::OptionStrike",
      "id" : "c42af5cf-6189-4dae-a6f4-51e21ebbc2c1",
      "position" : {
        "x" : 1265.5022222222224,
        "y" : 269.8666666666667
      },
      "rectangle" : {
        "height" : 100,
        "width" : 300.19921875
      }
    }, {
      "class" : "cdm::model::PriceQuantity",
      "id" : "ea5d9ccb-ed75-4bdc-baaa-293f1fc57429",
      "position" : {
        "x" : 452,
        "y" : 38
      },
      "rectangle" : {
        "height" : 100,
        "width" : 218.45703125
      }
    }, {
      "class" : "cdm::model::AveragingStrikeFeature",
      "id" : "551f9170-63a2-49cb-99d3-ba3da2310d62",
      "position" : {
        "x" : 1643.3209185833698,
        "y" : 528.6183838383839
      },
      "rectangle" : {
        "height" : 44,
        "width" : 225.775390625
      }
    }, {
      "class" : "cdm::model::ObservationDates",
      "id" : "357a7ca5-6948-4b15-934b-8fc270e8b496",
      "position" : {
        "x" : 971.8403991028501,
        "y" : 800.605396825397
      },
      "rectangle" : {
        "height" : 86,
        "width" : 264.50830078125
      }
    } ],
    "generalizationViews" : [ ],
    "name" : "OptionDiagram",
    "package" : "cdm::model",
    "propertyViews" : [ {
      "line" : {
        "points" : [ {
          "x" : 207.97998046875,
          "y" : 96
        }, {
          "x" : 208.87841796875,
          "y" : 271
        } ]
      },
      "property" : {
        "class" : "cdm::model::TradableProduct",
        "property" : "product"
      },
      "sourceView" : "96b6add0-de56-492e-9d7b-fc7e90dd37c9",
      "targetView" : "ec108770-12b1-413b-ab62-f5ecf752a2f6"
    }, {
      "line" : {
        "points" : [ {
          "x" : 207.97998046875,
          "y" : 96
        }, {
          "x" : 561.228515625,
          "y" : 88
        } ]
      },
      "property" : {
        "class" : "cdm::model::TradableProduct",
        "property" : "priceQuantity"
      },
      "sourceView" : "96b6add0-de56-492e-9d7b-fc7e90dd37c9",
      "targetView" : "ea5d9ccb-ed75-4bdc-baaa-293f1fc57429"
    }, {
      "line" : {
        "points" : [ {
          "x" : 208.87841796875,
          "y" : 271
        }, {
          "x" : 207.808837890625,
          "y" : 428
        } ]
      },
      "property" : {
        "class" : "cdm::model::Product",
        "property" : "contractualProduct"
      },
      "sourceView" : "ec108770-12b1-413b-ab62-f5ecf752a2f6",
      "targetView" : "04b5c4f8-83dc-4186-adac-eb8b7f7419e7"
    }, {
      "line" : {
        "points" : [ {
          "x" : 207.808837890625,
          "y" : 428
        }, {
          "x" : 212.36540339543274,
          "y" : 602
        } ]
      },
      "property" : {
        "class" : "cdm::model::ContractualProduct",
        "property" : "economicTerms"
      },
      "sourceView" : "04b5c4f8-83dc-4186-adac-eb8b7f7419e7",
      "targetView" : "9398af98-7c7f-46b2-b51d-bf533692229e"
    }, {
      "line" : {
        "points" : [ {
          "x" : 212.36540339543274,
          "y" : 602
        }, {
          "x" : 214.12451171875,
          "y" : 822
        } ]
      },
      "property" : {
        "class" : "cdm::model::EconomicTerms",
        "property" : "payout"
      },
      "sourceView" : "9398af98-7c7f-46b2-b51d-bf533692229e",
      "targetView" : "a06a353f-4e1a-4dfc-aacc-cb244f636a55"
    }, {
      "line" : {
        "points" : [ {
          "x" : 214.12451171875,
          "y" : 822
        }, {
          "x" : 617.06349609375,
          "y" : 556.4
        } ]
      },
      "property" : {
        "class" : "cdm::model::Payout",
        "property" : "optionPayout"
      },
      "sourceView" : "a06a353f-4e1a-4dfc-aacc-cb244f636a55",
      "targetView" : "874fe4e2-eb86-46ea-b72a-3fca6fa5d5d5"
    }, {
      "line" : {
        "points" : [ {
          "x" : 617.06349609375,
          "y" : 556.4
        }, {
          "x" : 905.4871356670674,
          "y" : 225.69230769230768
        } ]
      },
      "property" : {
        "class" : "cdm::model::OptionPayout",
        "property" : "exerciseTerms"
      },
      "sourceView" : "874fe4e2-eb86-46ea-b72a-3fca6fa5d5d5",
      "targetView" : "628fe0ad-23a9-4007-bead-bb226b6e532d"
    }, {
      "line" : {
        "points" : [ {
          "x" : 905.4871356670674,
          "y" : 225.69230769230768
        }, {
          "x" : 1415.6018315972224,
          "y" : 319.8666666666667
        } ]
      },
      "property" : {
        "class" : "cdm::model::OptionExercise",
        "property" : "strike"
      },
      "sourceView" : "628fe0ad-23a9-4007-bead-bb226b6e532d",
      "targetView" : "c42af5cf-6189-4dae-a6f4-51e21ebbc2c1"
    }, {
      "line" : {
        "points" : [ {
          "x" : 905.4871356670674,
          "y" : 225.69230769230768
        }, {
          "x" : 1405.4019780815972,
          "y" : 46.78222222222226
        } ]
      },
      "property" : {
        "class" : "cdm::model::OptionExercise",
        "property" : "settlement"
      },
      "sourceView" : "628fe0ad-23a9-4007-bead-bb226b6e532d",
      "targetView" : "489ad762-fc89-4ef0-9f5d-f85b323f3461"
    }, {
      "line" : {
        "points" : [ {
          "x" : 617.06349609375,
          "y" : 556.4
        }, {
          "x" : 921.073095703125,
          "y" : 553.84
        } ]
      },
      "property" : {
        "class" : "cdm::model::OptionPayout",
        "property" : "feature"
      },
      "sourceView" : "874fe4e2-eb86-46ea-b72a-3fca6fa5d5d5",
      "targetView" : "ddf5d91b-6a24-49a4-8793-3d2dbb4037fc"
    }, {
      "line" : {
        "points" : [ {
          "x" : 905.4871356670674,
          "y" : 225.69230769230768
        }, {
          "x" : 1557.696447482639,
          "y" : 194.19111111111113
        } ]
      },
      "property" : {
        "class" : "cdm::model::OptionExercise",
        "property" : "exerciseProcedure"
      },
      "sourceView" : "628fe0ad-23a9-4007-bead-bb226b6e532d",
      "targetView" : "728a91e8-7091-42e7-949a-6d390b46e137"
    }, {
      "line" : {
        "points" : [ {
          "x" : 617.06349609375,
          "y" : 556.4
        }, {
          "x" : 628.0924917367788,
          "y" : 814.8911111111112
        } ]
      },
      "property" : {
        "class" : "cdm::model::OptionPayout",
        "property" : "observationTerms"
      },
      "sourceView" : "874fe4e2-eb86-46ea-b72a-3fca6fa5d5d5",
      "targetView" : "60e00748-e859-4941-b18e-c292fa14295a"
    }, {
      "line" : {
        "points" : [ {
          "x" : 628.0924917367788,
          "y" : 814.8911111111112
        }, {
          "x" : 1104.0945494934751,
          "y" : 843.605396825397
        } ]
      },
      "property" : {
        "class" : "cdm::model::ObservationTerms",
        "property" : "observationDates"
      },
      "sourceView" : "60e00748-e859-4941-b18e-c292fa14295a",
      "targetView" : "357a7ca5-6948-4b15-934b-8fc270e8b496"
    }, {
      "line" : {
        "points" : [ {
          "x" : 921.073095703125,
          "y" : 553.84
        }, {
          "x" : 1307.8588491586538,
          "y" : 557.8911111111112
        } ]
      },
      "property" : {
        "class" : "cdm::model::OptionFeature",
        "property" : "averagingRateFeature"
      },
      "sourceView" : "ddf5d91b-6a24-49a4-8793-3d2dbb4037fc",
      "targetView" : "e90beb9d-d38c-4b6f-a2d0-a353d6ea1f63"
    }, {
      "line" : {
        "points" : [ {
          "x" : 1756.2086138958698,
          "y" : 550.6183838383839
        }, {
          "x" : 628.0924917367788,
          "y" : 814.8911111111112
        } ]
      },
      "property" : {
        "class" : "cdm::model::AveragingStrikeFeature",
        "property" : "observationTerms"
      },
      "sourceView" : "551f9170-63a2-49cb-99d3-ba3da2310d62",
      "targetView" : "60e00748-e859-4941-b18e-c292fa14295a"
    }, {
      "line" : {
        "points" : [ {
          "x" : 1756.2086138958698,
          "y" : 550.6183838383839
        }, {
          "x" : 1307.8588491586538,
          "y" : 557.8911111111112
        } ]
      },
      "property" : {
        "class" : "cdm::model::AveragingStrikeFeature",
        "property" : "averagingCalculation"
      },
      "sourceView" : "551f9170-63a2-49cb-99d3-ba3da2310d62",
      "targetView" : "e90beb9d-d38c-4b6f-a2d0-a353d6ea1f63"
    }, {
      "line" : {
        "points" : [ {
          "x" : 1415.6018315972224,
          "y" : 319.8666666666667
        }, {
          "x" : 1750.1395180191769,
          "y" : 314.5729292929294
        }, {
          "x" : 1756.2086138958698,
          "y" : 550.6183838383839
        } ]
      },
      "property" : {
        "class" : "cdm::model::OptionStrike",
        "property" : "averagingStrikeFeature"
      },
      "sourceView" : "c42af5cf-6189-4dae-a6f4-51e21ebbc2c1",
      "targetView" : "551f9170-63a2-49cb-99d3-ba3da2310d62"
    } ]
  }
}