{
  "classifierPath" : "meta::pure::metamodel::type::Enumeration",
  "content" : {
    "_type" : "Enumeration",
    "name" : "EnumIdentifierTypes",
    "package" : "underliers",
    "values" : [ {
      "value" : "gmiCode"
    }, {
      "value" : "iceCommodityCode"
    }, {
      "value" : "bloombergTickerRules"
    }, {
      "value" : "ric"
    }, {
      "value" : "confirmLanguage"
    } ]
  }
}