{
  "classifierPath" : "meta::pure::metamodel::type::Enumeration",
  "content" : {
    "_type" : "Enumeration",
    "name" : "EnumAssetClass",
    "package" : "underliers",
    "values" : [ {
      "value" : "COMMOD"
    }, {
      "value" : "FX"
    }, {
      "value" : "IRP"
    }, {
      "value" : "CREDIT"
    }, {
      "value" : "EQ"
    } ]
  }
}