{
  "classifierPath" : "meta::pure::metamodel::type::Enumeration",
  "content" : {
    "_type" : "Enumeration",
    "name" : "FxTenorPeriodEnum",
    "package" : "FpML::model",
    "taggedValues" : [ {
      "tag" : {
        "profile" : "meta::pure::profiles::doc",
        "value" : "doc"
      },
      "value" : "The specification of a time period containing values such as Today, Tomorrow etc."
    } ],
    "values" : [ {
      "value" : "Broken"
    }, {
      "value" : "Today"
    }, {
      "value" : "Tomorrow"
    }, {
      "value" : "TomorrowNext"
    }, {
      "value" : "Spot"
    }, {
      "value" : "SpotNext"
    } ]
  }
}