{
  "classifierPath" : "meta::pure::metamodel::type::Enumeration",
  "content" : {
    "_type" : "Enumeration",
    "name" : "FxBarrierTypeSimpleEnum",
    "package" : "FpML::model",
    "taggedValues" : [ {
      "tag" : {
        "profile" : "meta::pure::profiles::doc",
        "value" : "doc"
      },
      "value" : "Defines the outcome in the event that the barrier is triggered i.e. whether the product becomes active (Knockin) or is extinguished (Knockout). Omitting superseded values ReverseKnock[in|out]."
    } ],
    "values" : [ {
      "value" : "Knockin"
    }, {
      "value" : "Knockout"
    } ]
  }
}