{
  "classifierPath" : "meta::pure::metamodel::type::Enumeration",
  "content" : {
    "_type" : "Enumeration",
    "name" : "BreakageCalculatedByEnum",
    "package" : "FpML::model",
    "taggedValues" : [ {
      "tag" : {
        "profile" : "meta::pure::profiles::doc",
        "value" : "doc"
      },
      "value" : "When breakage cost is applicable, this defines who is calculating it."
    } ],
    "values" : [ {
      "value" : "AgentBank"
    }, {
      "value" : "Lender"
    } ]
  }
}