{
  "classifierPath" : "meta::pure::metamodel::type::Enumeration",
  "content" : {
    "_type" : "Enumeration",
    "name" : "CommodityBullionSettlementDisruptionEnum",
    "package" : "FpML::model",
    "taggedValues" : [ {
      "tag" : {
        "profile" : "meta::pure::profiles::doc",
        "value" : "doc"
      },
      "value" : "The consequences of Bullion Settlement Disruption Events."
    } ],
    "values" : [ {
      "value" : "Negotiation"
    }, {
      "value" : "Cancellation_and_Payment"
    } ]
  }
}