{
  "classifierPath" : "meta::pure::metamodel::type::Enumeration",
  "content" : {
    "_type" : "Enumeration",
    "name" : "LoadTypeEnum",
    "package" : "FpML::model",
    "taggedValues" : [ {
      "tag" : {
        "profile" : "meta::pure::profiles::doc",
        "value" : "doc"
      },
      "value" : "LoadType is a summary of the full description of the settlement periods with respect to the region. Used for describing Electricity delivery schedules."
    } ],
    "values" : [ {
      "value" : "Base"
    }, {
      "value" : "Peak"
    }, {
      "value" : "OffPeak"
    }, {
      "value" : "BlockHours"
    }, {
      "value" : "Custom"
    } ]
  }
}