{
  "classifierPath" : "meta::pure::metamodel::type::Class",
  "content" : {
    "_type" : "class",
    "constraints" : [ {
      "functionDefinition" : {
        "_type" : "lambda",
        "body" : [ {
          "_type" : "func",
          "function" : "forAll",
          "parameters" : [ {
            "_type" : "property",
            "parameters" : [ {
              "_type" : "var",
              "name" : "this",
              "sourceInformation" : {
                "endColumn" : 17,
                "endLine" : 6884,
                "sourceId" : "",
                "startColumn" : 13,
                "startLine" : 6884
              }
            } ],
            "property" : "multiplier",
            "sourceInformation" : {
              "endColumn" : 28,
              "endLine" : 6884,
              "sourceId" : "",
              "startColumn" : 19,
              "startLine" : 6884
            }
          }, {
            "_type" : "lambda",
            "body" : [ {
              "_type" : "func",
              "function" : "greaterThan",
              "parameters" : [ {
                "_type" : "var",
                "name" : "x",
                "sourceInformation" : {
                  "endColumn" : 53,
                  "endLine" : 6884,
                  "sourceId" : "",
                  "startColumn" : 52,
                  "startLine" : 6884
                }
              }, {
                "_type" : "integer",
                "multiplicity" : {
                  "lowerBound" : 1,
                  "upperBound" : 1
                },
                "sourceInformation" : {
                  "endColumn" : 57,
                  "endLine" : 6884,
                  "sourceId" : "",
                  "startColumn" : 57,
                  "startLine" : 6884
                },
                "values" : [ 0 ]
              } ],
              "sourceInformation" : {
                "endColumn" : 57,
                "endLine" : 6884,
                "sourceId" : "",
                "startColumn" : 55,
                "startLine" : 6884
              }
            } ],
            "parameters" : [ {
              "_type" : "var",
              "class" : "Decimal",
              "multiplicity" : {
                "lowerBound" : 1,
                "upperBound" : 1
              },
              "name" : "x",
              "sourceInformation" : {
                "endColumn" : 47,
                "endLine" : 6884,
                "sourceId" : "",
                "startColumn" : 41,
                "startLine" : 6884
              }
            } ],
            "sourceInformation" : {
              "endColumn" : 57,
              "endLine" : 6884,
              "sourceId" : "",
              "startColumn" : 51,
              "startLine" : 6884
            }
          } ],
          "sourceInformation" : {
            "endColumn" : 36,
            "endLine" : 6884,
            "sourceId" : "",
            "startColumn" : 31,
            "startLine" : 6884
          }
        } ],
        "parameters" : [ ]
      },
      "name" : "c1_range"
    }, {
      "functionDefinition" : {
        "_type" : "lambda",
        "body" : [ {
          "_type" : "func",
          "function" : "forAll",
          "parameters" : [ {
            "_type" : "property",
            "parameters" : [ {
              "_type" : "var",
              "name" : "this",
              "sourceInformation" : {
                "endColumn" : 18,
                "endLine" : 6885,
                "sourceId" : "",
                "startColumn" : 14,
                "startLine" : 6885
              }
            } ],
            "property" : "contractReference",
            "sourceInformation" : {
              "endColumn" : 36,
              "endLine" : 6885,
              "sourceId" : "",
              "startColumn" : 20,
              "startLine" : 6885
            }
          }, {
            "_type" : "lambda",
            "body" : [ {
              "_type" : "func",
              "function" : "greaterThanEqual",
              "parameters" : [ {
                "_type" : "func",
                "function" : "length",
                "parameters" : [ {
                  "_type" : "var",
                  "name" : "x",
                  "sourceInformation" : {
                    "endColumn" : 60,
                    "endLine" : 6885,
                    "sourceId" : "",
                    "startColumn" : 59,
                    "startLine" : 6885
                  }
                } ],
                "sourceInformation" : {
                  "endColumn" : 68,
                  "endLine" : 6885,
                  "sourceId" : "",
                  "startColumn" : 63,
                  "startLine" : 6885
                }
              }, {
                "_type" : "integer",
                "multiplicity" : {
                  "lowerBound" : 1,
                  "upperBound" : 1
                },
                "sourceInformation" : {
                  "endColumn" : 75,
                  "endLine" : 6885,
                  "sourceId" : "",
                  "startColumn" : 75,
                  "startLine" : 6885
                },
                "values" : [ 1 ]
              } ],
              "sourceInformation" : {
                "endColumn" : 75,
                "endLine" : 6885,
                "sourceId" : "",
                "startColumn" : 72,
                "startLine" : 6885
              }
            } ],
            "parameters" : [ {
              "_type" : "var",
              "class" : "String",
              "multiplicity" : {
                "lowerBound" : 1,
                "upperBound" : 1
              },
              "name" : "x",
              "sourceInformation" : {
                "endColumn" : 54,
                "endLine" : 6885,
                "sourceId" : "",
                "startColumn" : 49,
                "startLine" : 6885
              }
            } ],
            "sourceInformation" : {
              "endColumn" : 75,
              "endLine" : 6885,
              "sourceId" : "",
              "startColumn" : 58,
              "startLine" : 6885
            }
          } ],
          "sourceInformation" : {
            "endColumn" : 44,
            "endLine" : 6885,
            "sourceId" : "",
            "startColumn" : 39,
            "startLine" : 6885
          }
        } ],
        "parameters" : [ ]
      },
      "name" : "c2_length"
    } ],
    "name" : "ExchangeTradedContract",
    "package" : "FpML::model",
    "properties" : [ {
      "multiplicity" : {
        "lowerBound" : 0,
        "upperBound" : 1
      },
      "name" : "multiplier",
      "taggedValues" : [ {
        "tag" : {
          "profile" : "meta::pure::profiles::doc",
          "value" : "doc"
        },
        "value" : "Specifies the contract multiplier that can be associated with the number of units."
      } ],
      "type" : "Decimal"
    }, {
      "multiplicity" : {
        "lowerBound" : 0,
        "upperBound" : 1
      },
      "name" : "contractReference",
      "taggedValues" : [ {
        "tag" : {
          "profile" : "meta::pure::profiles::doc",
          "value" : "doc"
        },
        "value" : "Specifies the contract that can be referenced, besides the undelyer type."
      } ],
      "type" : "String"
    }, {
      "multiplicity" : {
        "lowerBound" : 0,
        "upperBound" : 1
      },
      "name" : "expirationDate",
      "taggedValues" : [ {
        "tag" : {
          "profile" : "meta::pure::profiles::doc",
          "value" : "doc"
        },
        "value" : "The date when the contract expires."
      } ],
      "type" : "FpML::model::AdjustableOrRelativeDate"
    } ],
    "superTypes" : [ "FpML::model::ExchangeTraded" ],
    "taggedValues" : [ {
      "tag" : {
        "profile" : "meta::pure::profiles::doc",
        "value" : "doc"
      },
      "value" : "An exchange traded derivative contract."
    } ]
  }
}