{
  "classifierPath" : "meta::pure::metamodel::type::Enumeration",
  "content" : {
    "_type" : "Enumeration",
    "name" : "ValuationMethodEnum",
    "package" : "FpML::model",
    "taggedValues" : [ {
      "tag" : {
        "profile" : "meta::pure::profiles::doc",
        "value" : "doc"
      },
      "value" : "The ISDA defined methodology for determining the final price of the reference obligation for purposes of cash settlement."
    } ],
    "values" : [ {
      "value" : "Market"
    }, {
      "value" : "Highest"
    }, {
      "value" : "AverageMarket"
    }, {
      "value" : "AverageHighest"
    }, {
      "value" : "BlendedMarket"
    }, {
      "value" : "BlendedHighest"
    }, {
      "value" : "AverageBlendedMarket"
    }, {
      "value" : "AverageBlendedHighest"
    } ]
  }
}