{
  "classifierPath" : "meta::pure::metamodel::type::Class",
  "content" : {
    "_type" : "class",
    "constraints" : [ {
      "functionDefinition" : {
        "_type" : "lambda",
        "body" : [ {
          "_type" : "func",
          "function" : "forAll",
          "parameters" : [ {
            "_type" : "property",
            "parameters" : [ {
              "_type" : "var",
              "name" : "this",
              "sourceInformation" : {
                "endColumn" : 18,
                "endLine" : 6654,
                "sourceId" : "",
                "startColumn" : 14,
                "startLine" : 6654
              }
            } ],
            "property" : "currencyScheme",
            "sourceInformation" : {
              "endColumn" : 33,
              "endLine" : 6654,
              "sourceId" : "",
              "startColumn" : 20,
              "startLine" : 6654
            }
          }, {
            "_type" : "lambda",
            "body" : [ {
              "_type" : "func",
              "function" : "greaterThanEqual",
              "parameters" : [ {
                "_type" : "func",
                "function" : "length",
                "parameters" : [ {
                  "_type" : "var",
                  "name" : "x",
                  "sourceInformation" : {
                    "endColumn" : 57,
                    "endLine" : 6654,
                    "sourceId" : "",
                    "startColumn" : 56,
                    "startLine" : 6654
                  }
                } ],
                "sourceInformation" : {
                  "endColumn" : 65,
                  "endLine" : 6654,
                  "sourceId" : "",
                  "startColumn" : 60,
                  "startLine" : 6654
                }
              }, {
                "_type" : "integer",
                "multiplicity" : {
                  "lowerBound" : 1,
                  "upperBound" : 1
                },
                "sourceInformation" : {
                  "endColumn" : 72,
                  "endLine" : 6654,
                  "sourceId" : "",
                  "startColumn" : 72,
                  "startLine" : 6654
                },
                "values" : [ 1 ]
              } ],
              "sourceInformation" : {
                "endColumn" : 72,
                "endLine" : 6654,
                "sourceId" : "",
                "startColumn" : 69,
                "startLine" : 6654
              }
            } ],
            "parameters" : [ {
              "_type" : "var",
              "class" : "String",
              "multiplicity" : {
                "lowerBound" : 1,
                "upperBound" : 1
              },
              "name" : "x",
              "sourceInformation" : {
                "endColumn" : 51,
                "endLine" : 6654,
                "sourceId" : "",
                "startColumn" : 46,
                "startLine" : 6654
              }
            } ],
            "sourceInformation" : {
              "endColumn" : 72,
              "endLine" : 6654,
              "sourceId" : "",
              "startColumn" : 55,
              "startLine" : 6654
            }
          } ],
          "sourceInformation" : {
            "endColumn" : 41,
            "endLine" : 6654,
            "sourceId" : "",
            "startColumn" : 36,
            "startLine" : 6654
          }
        } ],
        "parameters" : [ ]
      },
      "name" : "c1_length"
    }, {
      "functionDefinition" : {
        "_type" : "lambda",
        "body" : [ {
          "_type" : "func",
          "function" : "lessThanEqual",
          "parameters" : [ {
            "_type" : "func",
            "function" : "length",
            "parameters" : [ {
              "_type" : "property",
              "parameters" : [ {
                "_type" : "var",
                "name" : "this",
                "sourceInformation" : {
                  "endColumn" : 18,
                  "endLine" : 6655,
                  "sourceId" : "",
                  "startColumn" : 14,
                  "startLine" : 6655
                }
              } ],
              "property" : "value",
              "sourceInformation" : {
                "endColumn" : 24,
                "endLine" : 6655,
                "sourceId" : "",
                "startColumn" : 20,
                "startLine" : 6655
              }
            } ],
            "sourceInformation" : {
              "endColumn" : 32,
              "endLine" : 6655,
              "sourceId" : "",
              "startColumn" : 27,
              "startLine" : 6655
            }
          }, {
            "_type" : "integer",
            "multiplicity" : {
              "lowerBound" : 1,
              "upperBound" : 1
            },
            "sourceInformation" : {
              "endColumn" : 41,
              "endLine" : 6655,
              "sourceId" : "",
              "startColumn" : 39,
              "startLine" : 6655
            },
            "values" : [ 255 ]
          } ],
          "sourceInformation" : {
            "endColumn" : 41,
            "endLine" : 6655,
            "sourceId" : "",
            "startColumn" : 36,
            "startLine" : 6655
          }
        } ],
        "parameters" : [ ]
      },
      "name" : "c2_length"
    } ],
    "name" : "Currency",
    "package" : "FpML::model",
    "properties" : [ {
      "multiplicity" : {
        "lowerBound" : 0,
        "upperBound" : 1
      },
      "name" : "currencyScheme",
      "type" : "String"
    }, {
      "multiplicity" : {
        "lowerBound" : 1,
        "upperBound" : 1
      },
      "name" : "value",
      "type" : "String"
    } ],
    "taggedValues" : [ {
      "tag" : {
        "profile" : "meta::pure::profiles::doc",
        "value" : "doc"
      },
      "value" : "The code representation of a currency or fund. By default it is a valid currency code as defined by the ISO standard 4217 - Codes for representation of currencies and funds http://www.iso.org/iso/en/prods-services/popstds/currencycodeslist.html."
    } ]
  }
}