{
  "classifierPath" : "meta::pure::metamodel::type::Class",
  "content" : {
    "_type" : "class",
    "constraints" : [ {
      "functionDefinition" : {
        "_type" : "lambda",
        "body" : [ {
          "_type" : "func",
          "function" : "or",
          "parameters" : [ {
            "_type" : "func",
            "function" : "and",
            "parameters" : [ {
              "_type" : "func",
              "function" : "isNotEmpty",
              "parameters" : [ {
                "_type" : "property",
                "parameters" : [ {
                  "_type" : "var",
                  "name" : "this",
                  "sourceInformation" : {
                    "endColumn" : 19,
                    "endLine" : 6895,
                    "sourceId" : "",
                    "startColumn" : 15,
                    "startLine" : 6895
                  }
                } ],
                "property" : "floatingRateIndex",
                "sourceInformation" : {
                  "endColumn" : 37,
                  "endLine" : 6895,
                  "sourceId" : "",
                  "startColumn" : 21,
                  "startLine" : 6895
                }
              } ],
              "sourceInformation" : {
                "endColumn" : 49,
                "endLine" : 6895,
                "sourceId" : "",
                "startColumn" : 40,
                "startLine" : 6895
              }
            }, {
              "_type" : "func",
              "function" : "and",
              "parameters" : [ {
                "_type" : "func",
                "function" : "isEmpty",
                "parameters" : [ {
                  "_type" : "property",
                  "parameters" : [ {
                    "_type" : "var",
                    "name" : "this",
                    "sourceInformation" : {
                      "endColumn" : 61,
                      "endLine" : 6895,
                      "sourceId" : "",
                      "startColumn" : 57,
                      "startLine" : 6895
                    }
                  } ],
                  "property" : "quotedCurrencyPair",
                  "sourceInformation" : {
                    "endColumn" : 80,
                    "endLine" : 6895,
                    "sourceId" : "",
                    "startColumn" : 63,
                    "startLine" : 6895
                  }
                } ],
                "sourceInformation" : {
                  "endColumn" : 89,
                  "endLine" : 6895,
                  "sourceId" : "",
                  "startColumn" : 83,
                  "startLine" : 6895
                }
              }, {
                "_type" : "func",
                "function" : "isEmpty",
                "parameters" : [ {
                  "_type" : "property",
                  "parameters" : [ {
                    "_type" : "var",
                    "name" : "this",
                    "sourceInformation" : {
                      "endColumn" : 100,
                      "endLine" : 6895,
                      "sourceId" : "",
                      "startColumn" : 96,
                      "startLine" : 6895
                    }
                  } ],
                  "property" : "underlyingAsset",
                  "sourceInformation" : {
                    "endColumn" : 116,
                    "endLine" : 6895,
                    "sourceId" : "",
                    "startColumn" : 102,
                    "startLine" : 6895
                  }
                } ],
                "sourceInformation" : {
                  "endColumn" : 125,
                  "endLine" : 6895,
                  "sourceId" : "",
                  "startColumn" : 119,
                  "startLine" : 6895
                }
              } ],
              "sourceInformation" : {
                "endColumn" : 94,
                "endLine" : 6895,
                "sourceId" : "",
                "startColumn" : 93,
                "startLine" : 6895
              }
            } ],
            "sourceInformation" : {
              "endColumn" : 54,
              "endLine" : 6895,
              "sourceId" : "",
              "startColumn" : 53,
              "startLine" : 6895
            }
          }, {
            "_type" : "func",
            "function" : "or",
            "parameters" : [ {
              "_type" : "func",
              "function" : "and",
              "parameters" : [ {
                "_type" : "func",
                "function" : "isEmpty",
                "parameters" : [ {
                  "_type" : "property",
                  "parameters" : [ {
                    "_type" : "var",
                    "name" : "this",
                    "sourceInformation" : {
                      "endColumn" : 140,
                      "endLine" : 6895,
                      "sourceId" : "",
                      "startColumn" : 136,
                      "startLine" : 6895
                    }
                  } ],
                  "property" : "floatingRateIndex",
                  "sourceInformation" : {
                    "endColumn" : 158,
                    "endLine" : 6895,
                    "sourceId" : "",
                    "startColumn" : 142,
                    "startLine" : 6895
                  }
                } ],
                "sourceInformation" : {
                  "endColumn" : 167,
                  "endLine" : 6895,
                  "sourceId" : "",
                  "startColumn" : 161,
                  "startLine" : 6895
                }
              }, {
                "_type" : "func",
                "function" : "and",
                "parameters" : [ {
                  "_type" : "func",
                  "function" : "isEmpty",
                  "parameters" : [ {
                    "_type" : "property",
                    "parameters" : [ {
                      "_type" : "var",
                      "name" : "this",
                      "sourceInformation" : {
                        "endColumn" : 179,
                        "endLine" : 6895,
                        "sourceId" : "",
                        "startColumn" : 175,
                        "startLine" : 6895
                      }
                    } ],
                    "property" : "indexTenor",
                    "sourceInformation" : {
                      "endColumn" : 190,
                      "endLine" : 6895,
                      "sourceId" : "",
                      "startColumn" : 181,
                      "startLine" : 6895
                    }
                  } ],
                  "sourceInformation" : {
                    "endColumn" : 199,
                    "endLine" : 6895,
                    "sourceId" : "",
                    "startColumn" : 193,
                    "startLine" : 6895
                  }
                }, {
                  "_type" : "func",
                  "function" : "and",
                  "parameters" : [ {
                    "_type" : "func",
                    "function" : "isNotEmpty",
                    "parameters" : [ {
                      "_type" : "property",
                      "parameters" : [ {
                        "_type" : "var",
                        "name" : "this",
                        "sourceInformation" : {
                          "endColumn" : 211,
                          "endLine" : 6895,
                          "sourceId" : "",
                          "startColumn" : 207,
                          "startLine" : 6895
                        }
                      } ],
                      "property" : "quotedCurrencyPair",
                      "sourceInformation" : {
                        "endColumn" : 230,
                        "endLine" : 6895,
                        "sourceId" : "",
                        "startColumn" : 213,
                        "startLine" : 6895
                      }
                    } ],
                    "sourceInformation" : {
                      "endColumn" : 242,
                      "endLine" : 6895,
                      "sourceId" : "",
                      "startColumn" : 233,
                      "startLine" : 6895
                    }
                  }, {
                    "_type" : "func",
                    "function" : "isEmpty",
                    "parameters" : [ {
                      "_type" : "property",
                      "parameters" : [ {
                        "_type" : "var",
                        "name" : "this",
                        "sourceInformation" : {
                          "endColumn" : 253,
                          "endLine" : 6895,
                          "sourceId" : "",
                          "startColumn" : 249,
                          "startLine" : 6895
                        }
                      } ],
                      "property" : "underlyingAsset",
                      "sourceInformation" : {
                        "endColumn" : 269,
                        "endLine" : 6895,
                        "sourceId" : "",
                        "startColumn" : 255,
                        "startLine" : 6895
                      }
                    } ],
                    "sourceInformation" : {
                      "endColumn" : 278,
                      "endLine" : 6895,
                      "sourceId" : "",
                      "startColumn" : 272,
                      "startLine" : 6895
                    }
                  } ],
                  "sourceInformation" : {
                    "endColumn" : 247,
                    "endLine" : 6895,
                    "sourceId" : "",
                    "startColumn" : 246,
                    "startLine" : 6895
                  }
                } ],
                "sourceInformation" : {
                  "endColumn" : 204,
                  "endLine" : 6895,
                  "sourceId" : "",
                  "startColumn" : 203,
                  "startLine" : 6895
                }
              } ],
              "sourceInformation" : {
                "endColumn" : 172,
                "endLine" : 6895,
                "sourceId" : "",
                "startColumn" : 171,
                "startLine" : 6895
              }
            }, {
              "_type" : "func",
              "function" : "and",
              "parameters" : [ {
                "_type" : "func",
                "function" : "isEmpty",
                "parameters" : [ {
                  "_type" : "property",
                  "parameters" : [ {
                    "_type" : "var",
                    "name" : "this",
                    "sourceInformation" : {
                      "endColumn" : 293,
                      "endLine" : 6895,
                      "sourceId" : "",
                      "startColumn" : 289,
                      "startLine" : 6895
                    }
                  } ],
                  "property" : "floatingRateIndex",
                  "sourceInformation" : {
                    "endColumn" : 311,
                    "endLine" : 6895,
                    "sourceId" : "",
                    "startColumn" : 295,
                    "startLine" : 6895
                  }
                } ],
                "sourceInformation" : {
                  "endColumn" : 320,
                  "endLine" : 6895,
                  "sourceId" : "",
                  "startColumn" : 314,
                  "startLine" : 6895
                }
              }, {
                "_type" : "func",
                "function" : "and",
                "parameters" : [ {
                  "_type" : "func",
                  "function" : "isEmpty",
                  "parameters" : [ {
                    "_type" : "property",
                    "parameters" : [ {
                      "_type" : "var",
                      "name" : "this",
                      "sourceInformation" : {
                        "endColumn" : 332,
                        "endLine" : 6895,
                        "sourceId" : "",
                        "startColumn" : 328,
                        "startLine" : 6895
                      }
                    } ],
                    "property" : "indexTenor",
                    "sourceInformation" : {
                      "endColumn" : 343,
                      "endLine" : 6895,
                      "sourceId" : "",
                      "startColumn" : 334,
                      "startLine" : 6895
                    }
                  } ],
                  "sourceInformation" : {
                    "endColumn" : 352,
                    "endLine" : 6895,
                    "sourceId" : "",
                    "startColumn" : 346,
                    "startLine" : 6895
                  }
                }, {
                  "_type" : "func",
                  "function" : "and",
                  "parameters" : [ {
                    "_type" : "func",
                    "function" : "isEmpty",
                    "parameters" : [ {
                      "_type" : "property",
                      "parameters" : [ {
                        "_type" : "var",
                        "name" : "this",
                        "sourceInformation" : {
                          "endColumn" : 364,
                          "endLine" : 6895,
                          "sourceId" : "",
                          "startColumn" : 360,
                          "startLine" : 6895
                        }
                      } ],
                      "property" : "quotedCurrencyPair",
                      "sourceInformation" : {
                        "endColumn" : 383,
                        "endLine" : 6895,
                        "sourceId" : "",
                        "startColumn" : 366,
                        "startLine" : 6895
                      }
                    } ],
                    "sourceInformation" : {
                      "endColumn" : 392,
                      "endLine" : 6895,
                      "sourceId" : "",
                      "startColumn" : 386,
                      "startLine" : 6895
                    }
                  }, {
                    "_type" : "func",
                    "function" : "isNotEmpty",
                    "parameters" : [ {
                      "_type" : "property",
                      "parameters" : [ {
                        "_type" : "var",
                        "name" : "this",
                        "sourceInformation" : {
                          "endColumn" : 403,
                          "endLine" : 6895,
                          "sourceId" : "",
                          "startColumn" : 399,
                          "startLine" : 6895
                        }
                      } ],
                      "property" : "underlyingAsset",
                      "sourceInformation" : {
                        "endColumn" : 419,
                        "endLine" : 6895,
                        "sourceId" : "",
                        "startColumn" : 405,
                        "startLine" : 6895
                      }
                    } ],
                    "sourceInformation" : {
                      "endColumn" : 431,
                      "endLine" : 6895,
                      "sourceId" : "",
                      "startColumn" : 422,
                      "startLine" : 6895
                    }
                  } ],
                  "sourceInformation" : {
                    "endColumn" : 397,
                    "endLine" : 6895,
                    "sourceId" : "",
                    "startColumn" : 396,
                    "startLine" : 6895
                  }
                } ],
                "sourceInformation" : {
                  "endColumn" : 357,
                  "endLine" : 6895,
                  "sourceId" : "",
                  "startColumn" : 356,
                  "startLine" : 6895
                }
              } ],
              "sourceInformation" : {
                "endColumn" : 325,
                "endLine" : 6895,
                "sourceId" : "",
                "startColumn" : 324,
                "startLine" : 6895
              }
            } ],
            "sourceInformation" : {
              "endColumn" : 286,
              "endLine" : 6895,
              "sourceId" : "",
              "startColumn" : 285,
              "startLine" : 6895
            }
          } ],
          "sourceInformation" : {
            "endColumn" : 132,
            "endLine" : 6895,
            "sourceId" : "",
            "startColumn" : 131,
            "startLine" : 6895
          }
        } ],
        "parameters" : [ ]
      },
      "name" : "c1_choice"
    } ],
    "name" : "ExchangeTradedContractUnderlyer",
    "package" : "FpML::model",
    "properties" : [ {
      "multiplicity" : {
        "lowerBound" : 0,
        "upperBound" : 1
      },
      "name" : "floatingRateIndex",
      "taggedValues" : [ {
        "tag" : {
          "profile" : "meta::pure::profiles::doc",
          "value" : "doc"
        },
        "value" : "The ISDA Floating Rate Option, i.e. the name of the floating rate."
      } ],
      "type" : "FpML::model::FloatingRateIndex"
    }, {
      "multiplicity" : {
        "lowerBound" : 0,
        "upperBound" : 1
      },
      "name" : "indexTenor",
      "taggedValues" : [ {
        "tag" : {
          "profile" : "meta::pure::profiles::doc",
          "value" : "doc"
        },
        "value" : "The ISDA Designated Maturity, i.e. the tenor of the floating rate."
      } ],
      "type" : "FpML::model::Period"
    }, {
      "multiplicity" : {
        "lowerBound" : 0,
        "upperBound" : 1
      },
      "name" : "quotedCurrencyPair",
      "taggedValues" : [ {
        "tag" : {
          "profile" : "meta::pure::profiles::doc",
          "value" : "doc"
        },
        "value" : "Defines the two currencies for an FX trade and the quotation relationship between the two currencies."
      } ],
      "type" : "FpML::model::QuotedCurrencyPair"
    }, {
      "multiplicity" : {
        "lowerBound" : 0
      },
      "name" : "underlyingAsset",
      "taggedValues" : [ {
        "tag" : {
          "profile" : "meta::pure::profiles::doc",
          "value" : "doc"
        },
        "value" : "Define the underlying asset, either a listed security or other instrument."
      } ],
      "type" : "FpML::model::Asset"
    } ],
    "taggedValues" : [ {
      "tag" : {
        "profile" : "meta::pure::profiles::doc",
        "value" : "doc"
      },
      "value" : "A type describing a single underlyer"
    } ]
  }
}