{
  "classifierPath" : "meta::pure::metamodel::type::Enumeration",
  "content" : {
    "_type" : "Enumeration",
    "name" : "DayTypeEnum",
    "package" : "FpML::model",
    "taggedValues" : [ {
      "tag" : {
        "profile" : "meta::pure::profiles::doc",
        "value" : "doc"
      },
      "value" : "A day type classification used in counting the number of days between two dates."
    } ],
    "values" : [ {
      "value" : "Business"
    }, {
      "value" : "Calendar"
    }, {
      "value" : "CommodityBusiness"
    }, {
      "value" : "CurrencyBusiness"
    }, {
      "value" : "ExchangeBusiness"
    }, {
      "value" : "ScheduledTradingDay"
    } ]
  }
}