{
  "classifierPath" : "meta::pure::metamodel::type::Class",
  "content" : {
    "_type" : "class",
    "constraints" : [ {
      "functionDefinition" : {
        "_type" : "lambda",
        "body" : [ {
          "_type" : "func",
          "function" : "forAll",
          "parameters" : [ {
            "_type" : "property",
            "parameters" : [ {
              "_type" : "var",
              "name" : "this",
              "sourceInformation" : {
                "endColumn" : 18,
                "endLine" : 9151,
                "sourceId" : "",
                "startColumn" : 14,
                "startLine" : 9151
              }
            } ],
            "property" : "settlementPriceSourceScheme",
            "sourceInformation" : {
              "endColumn" : 46,
              "endLine" : 9151,
              "sourceId" : "",
              "startColumn" : 20,
              "startLine" : 9151
            }
          }, {
            "_type" : "lambda",
            "body" : [ {
              "_type" : "func",
              "function" : "greaterThanEqual",
              "parameters" : [ {
                "_type" : "func",
                "function" : "length",
                "parameters" : [ {
                  "_type" : "var",
                  "name" : "x",
                  "sourceInformation" : {
                    "endColumn" : 70,
                    "endLine" : 9151,
                    "sourceId" : "",
                    "startColumn" : 69,
                    "startLine" : 9151
                  }
                } ],
                "sourceInformation" : {
                  "endColumn" : 78,
                  "endLine" : 9151,
                  "sourceId" : "",
                  "startColumn" : 73,
                  "startLine" : 9151
                }
              }, {
                "_type" : "integer",
                "multiplicity" : {
                  "lowerBound" : 1,
                  "upperBound" : 1
                },
                "sourceInformation" : {
                  "endColumn" : 85,
                  "endLine" : 9151,
                  "sourceId" : "",
                  "startColumn" : 85,
                  "startLine" : 9151
                },
                "values" : [ 1 ]
              } ],
              "sourceInformation" : {
                "endColumn" : 85,
                "endLine" : 9151,
                "sourceId" : "",
                "startColumn" : 82,
                "startLine" : 9151
              }
            } ],
            "parameters" : [ {
              "_type" : "var",
              "class" : "String",
              "multiplicity" : {
                "lowerBound" : 1,
                "upperBound" : 1
              },
              "name" : "x",
              "sourceInformation" : {
                "endColumn" : 64,
                "endLine" : 9151,
                "sourceId" : "",
                "startColumn" : 59,
                "startLine" : 9151
              }
            } ],
            "sourceInformation" : {
              "endColumn" : 85,
              "endLine" : 9151,
              "sourceId" : "",
              "startColumn" : 68,
              "startLine" : 9151
            }
          } ],
          "sourceInformation" : {
            "endColumn" : 54,
            "endLine" : 9151,
            "sourceId" : "",
            "startColumn" : 49,
            "startLine" : 9151
          }
        } ],
        "parameters" : [ ]
      },
      "name" : "c1_length"
    }, {
      "functionDefinition" : {
        "_type" : "lambda",
        "body" : [ {
          "_type" : "func",
          "function" : "lessThanEqual",
          "parameters" : [ {
            "_type" : "func",
            "function" : "length",
            "parameters" : [ {
              "_type" : "property",
              "parameters" : [ {
                "_type" : "var",
                "name" : "this",
                "sourceInformation" : {
                  "endColumn" : 18,
                  "endLine" : 9152,
                  "sourceId" : "",
                  "startColumn" : 14,
                  "startLine" : 9152
                }
              } ],
              "property" : "value",
              "sourceInformation" : {
                "endColumn" : 24,
                "endLine" : 9152,
                "sourceId" : "",
                "startColumn" : 20,
                "startLine" : 9152
              }
            } ],
            "sourceInformation" : {
              "endColumn" : 32,
              "endLine" : 9152,
              "sourceId" : "",
              "startColumn" : 27,
              "startLine" : 9152
            }
          }, {
            "_type" : "integer",
            "multiplicity" : {
              "lowerBound" : 1,
              "upperBound" : 1
            },
            "sourceInformation" : {
              "endColumn" : 41,
              "endLine" : 9152,
              "sourceId" : "",
              "startColumn" : 39,
              "startLine" : 9152
            },
            "values" : [ 255 ]
          } ],
          "sourceInformation" : {
            "endColumn" : 41,
            "endLine" : 9152,
            "sourceId" : "",
            "startColumn" : 36,
            "startLine" : 9152
          }
        } ],
        "parameters" : [ ]
      },
      "name" : "c2_length"
    } ],
    "name" : "SettlementPriceSource",
    "package" : "FpML::model",
    "properties" : [ {
      "multiplicity" : {
        "lowerBound" : 0,
        "upperBound" : 1
      },
      "name" : "settlementPriceSourceScheme",
      "type" : "String"
    }, {
      "multiplicity" : {
        "lowerBound" : 1,
        "upperBound" : 1
      },
      "name" : "value",
      "type" : "String"
    } ],
    "taggedValues" : [ {
      "tag" : {
        "profile" : "meta::pure::profiles::doc",
        "value" : "doc"
      },
      "value" : "The source from which the settlement price is to be obtained, e.g. a Reuters page, Prezzo di Riferimento, etc."
    } ]
  }
}