{
  "classifierPath" : "meta::pure::metamodel::type::Enumeration",
  "content" : {
    "_type" : "Enumeration",
    "name" : "SecLendCallingPartyEnum",
    "package" : "FpML::model",
    "taggedValues" : [ {
      "tag" : {
        "profile" : "meta::pure::profiles::doc",
        "value" : "doc"
      },
      "value" : "Party in a security lending arrangement who can demand closure (temrination) of the agreement"
    } ],
    "values" : [ {
      "value" : "Borrower"
    }, {
      "value" : "Lender"
    }, {
      "value" : "Either"
    }, {
      "value" : "AsDefinedInMasterAgreement"
    } ]
  }
}