{
  "classifierPath" : "meta::pure::metamodel::type::Class",
  "content" : {
    "_type" : "class",
    "constraints" : [ {
      "functionDefinition" : {
        "_type" : "lambda",
        "body" : [ {
          "_type" : "func",
          "function" : "or",
          "parameters" : [ {
            "_type" : "func",
            "function" : "and",
            "parameters" : [ {
              "_type" : "func",
              "function" : "isNotEmpty",
              "parameters" : [ {
                "_type" : "property",
                "parameters" : [ {
                  "_type" : "var",
                  "name" : "this",
                  "sourceInformation" : {
                    "endColumn" : 19,
                    "endLine" : 5945,
                    "sourceId" : "",
                    "startColumn" : 15,
                    "startLine" : 5945
                  }
                } ],
                "property" : "averagingDateTimes",
                "sourceInformation" : {
                  "endColumn" : 38,
                  "endLine" : 5945,
                  "sourceId" : "",
                  "startColumn" : 21,
                  "startLine" : 5945
                }
              } ],
              "sourceInformation" : {
                "endColumn" : 50,
                "endLine" : 5945,
                "sourceId" : "",
                "startColumn" : 41,
                "startLine" : 5945
              }
            }, {
              "_type" : "func",
              "function" : "isEmpty",
              "parameters" : [ {
                "_type" : "property",
                "parameters" : [ {
                  "_type" : "var",
                  "name" : "this",
                  "sourceInformation" : {
                    "endColumn" : 61,
                    "endLine" : 5945,
                    "sourceId" : "",
                    "startColumn" : 57,
                    "startLine" : 5945
                  }
                } ],
                "property" : "averagingObservations",
                "sourceInformation" : {
                  "endColumn" : 83,
                  "endLine" : 5945,
                  "sourceId" : "",
                  "startColumn" : 63,
                  "startLine" : 5945
                }
              } ],
              "sourceInformation" : {
                "endColumn" : 92,
                "endLine" : 5945,
                "sourceId" : "",
                "startColumn" : 86,
                "startLine" : 5945
              }
            } ],
            "sourceInformation" : {
              "endColumn" : 55,
              "endLine" : 5945,
              "sourceId" : "",
              "startColumn" : 54,
              "startLine" : 5945
            }
          }, {
            "_type" : "func",
            "function" : "and",
            "parameters" : [ {
              "_type" : "func",
              "function" : "isEmpty",
              "parameters" : [ {
                "_type" : "property",
                "parameters" : [ {
                  "_type" : "var",
                  "name" : "this",
                  "sourceInformation" : {
                    "endColumn" : 105,
                    "endLine" : 5945,
                    "sourceId" : "",
                    "startColumn" : 101,
                    "startLine" : 5945
                  }
                } ],
                "property" : "averagingDateTimes",
                "sourceInformation" : {
                  "endColumn" : 124,
                  "endLine" : 5945,
                  "sourceId" : "",
                  "startColumn" : 107,
                  "startLine" : 5945
                }
              } ],
              "sourceInformation" : {
                "endColumn" : 133,
                "endLine" : 5945,
                "sourceId" : "",
                "startColumn" : 127,
                "startLine" : 5945
              }
            }, {
              "_type" : "func",
              "function" : "isNotEmpty",
              "parameters" : [ {
                "_type" : "property",
                "parameters" : [ {
                  "_type" : "var",
                  "name" : "this",
                  "sourceInformation" : {
                    "endColumn" : 144,
                    "endLine" : 5945,
                    "sourceId" : "",
                    "startColumn" : 140,
                    "startLine" : 5945
                  }
                } ],
                "property" : "averagingObservations",
                "sourceInformation" : {
                  "endColumn" : 166,
                  "endLine" : 5945,
                  "sourceId" : "",
                  "startColumn" : 146,
                  "startLine" : 5945
                }
              } ],
              "sourceInformation" : {
                "endColumn" : 178,
                "endLine" : 5945,
                "sourceId" : "",
                "startColumn" : 169,
                "startLine" : 5945
              }
            } ],
            "sourceInformation" : {
              "endColumn" : 138,
              "endLine" : 5945,
              "sourceId" : "",
              "startColumn" : 137,
              "startLine" : 5945
            }
          } ],
          "sourceInformation" : {
            "endColumn" : 98,
            "endLine" : 5945,
            "sourceId" : "",
            "startColumn" : 97,
            "startLine" : 5945
          }
        } ],
        "parameters" : [ ]
      },
      "name" : "c1_choice"
    } ],
    "name" : "AveragingPeriod",
    "package" : "FpML::model",
    "properties" : [ {
      "multiplicity" : {
        "lowerBound" : 0
      },
      "name" : "schedule",
      "taggedValues" : [ {
        "tag" : {
          "profile" : "meta::pure::profiles::doc",
          "value" : "doc"
        },
        "value" : "A schedule for generating averaging observation dates."
      } ],
      "type" : "FpML::model::AveragingSchedule"
    }, {
      "multiplicity" : {
        "lowerBound" : 0,
        "upperBound" : 1
      },
      "name" : "averagingDateTimes",
      "taggedValues" : [ {
        "tag" : {
          "profile" : "meta::pure::profiles::doc",
          "value" : "doc"
        },
        "value" : "An unweighted list of averaging observation date and times."
      } ],
      "type" : "FpML::model::DateTimeList"
    }, {
      "multiplicity" : {
        "lowerBound" : 0,
        "upperBound" : 1
      },
      "name" : "averagingObservations",
      "taggedValues" : [ {
        "tag" : {
          "profile" : "meta::pure::profiles::doc",
          "value" : "doc"
        },
        "value" : "A weighted list of averaging observation date and times."
      } ],
      "type" : "FpML::model::AveragingObservationList"
    }, {
      "multiplicity" : {
        "lowerBound" : 0,
        "upperBound" : 1
      },
      "name" : "marketDisruption",
      "taggedValues" : [ {
        "tag" : {
          "profile" : "meta::pure::profiles::doc",
          "value" : "doc"
        },
        "value" : "The market disruption event as defined by ISDA 2002 Definitions."
      } ],
      "type" : "FpML::model::MarketDisruption"
    } ],
    "taggedValues" : [ {
      "tag" : {
        "profile" : "meta::pure::profiles::doc",
        "value" : "doc"
      },
      "value" : "Period over which an average value is taken."
    } ]
  }
}