{
  "classifierPath" : "meta::pure::metamodel::type::Class",
  "content" : {
    "_type" : "class",
    "constraints" : [ {
      "functionDefinition" : {
        "_type" : "lambda",
        "body" : [ {
          "_type" : "func",
          "function" : "or",
          "parameters" : [ {
            "_type" : "func",
            "function" : "and",
            "parameters" : [ {
              "_type" : "func",
              "function" : "isNotEmpty",
              "parameters" : [ {
                "_type" : "property",
                "parameters" : [ {
                  "_type" : "var",
                  "name" : "this",
                  "sourceInformation" : {
                    "endColumn" : 19,
                    "endLine" : 7268,
                    "sourceId" : "",
                    "startColumn" : 15,
                    "startLine" : 7268
                  }
                } ],
                "property" : "settlementRateOption",
                "sourceInformation" : {
                  "endColumn" : 40,
                  "endLine" : 7268,
                  "sourceId" : "",
                  "startColumn" : 21,
                  "startLine" : 7268
                }
              } ],
              "sourceInformation" : {
                "endColumn" : 52,
                "endLine" : 7268,
                "sourceId" : "",
                "startColumn" : 43,
                "startLine" : 7268
              }
            }, {
              "_type" : "func",
              "function" : "isEmpty",
              "parameters" : [ {
                "_type" : "property",
                "parameters" : [ {
                  "_type" : "var",
                  "name" : "this",
                  "sourceInformation" : {
                    "endColumn" : 63,
                    "endLine" : 7268,
                    "sourceId" : "",
                    "startColumn" : 59,
                    "startLine" : 7268
                  }
                } ],
                "property" : "nonstandardSettlementRate",
                "sourceInformation" : {
                  "endColumn" : 89,
                  "endLine" : 7268,
                  "sourceId" : "",
                  "startColumn" : 65,
                  "startLine" : 7268
                }
              } ],
              "sourceInformation" : {
                "endColumn" : 98,
                "endLine" : 7268,
                "sourceId" : "",
                "startColumn" : 92,
                "startLine" : 7268
              }
            } ],
            "sourceInformation" : {
              "endColumn" : 57,
              "endLine" : 7268,
              "sourceId" : "",
              "startColumn" : 56,
              "startLine" : 7268
            }
          }, {
            "_type" : "func",
            "function" : "and",
            "parameters" : [ {
              "_type" : "func",
              "function" : "isEmpty",
              "parameters" : [ {
                "_type" : "property",
                "parameters" : [ {
                  "_type" : "var",
                  "name" : "this",
                  "sourceInformation" : {
                    "endColumn" : 111,
                    "endLine" : 7268,
                    "sourceId" : "",
                    "startColumn" : 107,
                    "startLine" : 7268
                  }
                } ],
                "property" : "settlementRateOption",
                "sourceInformation" : {
                  "endColumn" : 132,
                  "endLine" : 7268,
                  "sourceId" : "",
                  "startColumn" : 113,
                  "startLine" : 7268
                }
              } ],
              "sourceInformation" : {
                "endColumn" : 141,
                "endLine" : 7268,
                "sourceId" : "",
                "startColumn" : 135,
                "startLine" : 7268
              }
            }, {
              "_type" : "func",
              "function" : "isNotEmpty",
              "parameters" : [ {
                "_type" : "property",
                "parameters" : [ {
                  "_type" : "var",
                  "name" : "this",
                  "sourceInformation" : {
                    "endColumn" : 152,
                    "endLine" : 7268,
                    "sourceId" : "",
                    "startColumn" : 148,
                    "startLine" : 7268
                  }
                } ],
                "property" : "nonstandardSettlementRate",
                "sourceInformation" : {
                  "endColumn" : 178,
                  "endLine" : 7268,
                  "sourceId" : "",
                  "startColumn" : 154,
                  "startLine" : 7268
                }
              } ],
              "sourceInformation" : {
                "endColumn" : 190,
                "endLine" : 7268,
                "sourceId" : "",
                "startColumn" : 181,
                "startLine" : 7268
              }
            } ],
            "sourceInformation" : {
              "endColumn" : 146,
              "endLine" : 7268,
              "sourceId" : "",
              "startColumn" : 145,
              "startLine" : 7268
            }
          } ],
          "sourceInformation" : {
            "endColumn" : 104,
            "endLine" : 7268,
            "sourceId" : "",
            "startColumn" : 103,
            "startLine" : 7268
          }
        } ],
        "parameters" : [ ]
      },
      "name" : "c1_choice"
    } ],
    "name" : "FxSettlementRateSource",
    "package" : "FpML::model",
    "properties" : [ {
      "multiplicity" : {
        "lowerBound" : 0,
        "upperBound" : 1
      },
      "name" : "settlementRateOption",
      "taggedValues" : [ {
        "tag" : {
          "profile" : "meta::pure::profiles::doc",
          "value" : "doc"
        },
        "value" : "Indicates that an officially defined rate settlement rate option will be the used for the fixing."
      } ],
      "type" : "FpML::model::SettlementRateOption"
    }, {
      "multiplicity" : {
        "lowerBound" : 0,
        "upperBound" : 1
      },
      "name" : "nonstandardSettlementRate",
      "taggedValues" : [ {
        "tag" : {
          "profile" : "meta::pure::profiles::doc",
          "value" : "doc"
        },
        "value" : "Indicates that a non-standard rate source will be used for the fixing."
      } ],
      "type" : "FpML::model::FxInformationSource"
    } ]
  }
}