{
  "classifierPath" : "meta::pure::metamodel::type::Enumeration",
  "content" : {
    "_type" : "Enumeration",
    "name" : "QuotationRateTypeEnum",
    "package" : "FpML::model",
    "taggedValues" : [ {
      "tag" : {
        "profile" : "meta::pure::profiles::doc",
        "value" : "doc"
      },
      "value" : "The specification of the type of quotation rate to be obtained from each cash settlement reference bank."
    } ],
    "values" : [ {
      "value" : "Bid"
    }, {
      "value" : "Ask"
    }, {
      "value" : "Mid"
    }, {
      "value" : "ExercisingPartyPays"
    } ]
  }
}