{
  "classifierPath" : "meta::pure::metamodel::type::Enumeration",
  "content" : {
    "_type" : "Enumeration",
    "name" : "DividendAmountTypeEnum",
    "package" : "FpML::model",
    "taggedValues" : [ {
      "tag" : {
        "profile" : "meta::pure::profiles::doc",
        "value" : "doc"
      },
      "value" : "Refers to one on the 3 Amounts"
    } ],
    "values" : [ {
      "value" : "RecordAmount"
    }, {
      "value" : "ExAmount"
    }, {
      "value" : "PaidAmount"
    }, {
      "value" : "AsSpecifiedInMasterConfirmation"
    } ]
  }
}