{
  "postgres.tp": {
    "driver": "pg",
    "user": "zoomsquare",
    "password": {"ENV":"ZS_PG_PASSWORD"},
    "host": "postgres.tp.zoomsquare.com",
    "database": "zoomsquare_new_realestateservice",
    "schema": "public"
  },
  "search.tp.zs": {
    "driver": "pg",
    "user": "zoomsquare",
    "password": {"ENV":"ZS_PG_PASSWORD"},
    "host": "postgres.tp.zoomsquare.com",
    "database": "zoomsquare",
    "schema": "public"
  },
  "at.index": {
    "driver": "pg",
    "user": "zoomsquare",
    "password": {
      "ENV": "ZS_PG_PASSWORD_INDEX_DE"
    },
    "host": "de.index.zoomsquare.com",
    "database": "zoomsquare_at",
    "schema": "public,bigdatamaps,postgis"
  },
  "de.index": {
    "driver": "pg",
    "user": "zoomsquare",
    "password": {
      "ENV": "ZS_PG_PASSWORD_INDEX_DE"
    },
    "host": "de.index.zoomsquare.com",
    "database": "zoomsquare",
    "schema": "public,postgis"
  },
  "test": {
    "driver": "pg",
    "user": "zoomsquare",
    "password": {
      "ENV": "ZS_PG_PASSWORD_INDEX_DE"
    },
    "host": "de.index.zoomsquare.com",
    "database": "zoomsquare_test",
    "schema": "public,postgis"
  },
  "sql-file" : true
}