<?xml version="1.0" encoding="utf-8"?>
<!-- Generator: Adobe Illustrator 19.2.0, SVG Export Plug-In . SVG Version: 6.00 Build 0)  -->
<!DOCTYPE svg PUBLIC "-//W3C//DTD SVG 1.1//EN" "http://www.w3.org/Graphics/SVG/1.1/DTD/svg11.dtd">
<svg version="1.1" id="eyes" xmlns="http://www.w3.org/2000/svg" xmlns:xlink="http://www.w3.org/1999/xlink" x="0px" y="0px"
	 width="100px" height="47.5px" viewBox="0 0 100 47.5" style="enable-background:new 0 0 100 47.5;" xml:space="preserve">
<style type="text/css">
	.st0{fill:#FFFFFF;}
	.st1{fill:#101214;}
</style>
<path class="st1" d="M47,14.5c-1.3-2.9-3-5.5-5.2-7.6c-2.2-2.1-4.8-3.8-7.8-5.1c-5.9-2.5-13.1-2.5-19.1,0C12,3.1,9.4,4.8,7.2,6.9
	C5,9.1,3.2,11.6,2,14.5c-1.3,2.9-2,6-2,9.2C0,27,0.7,30,2,33c1.3,2.9,3,5.4,5.2,7.6c2.2,2.1,4.8,3.8,7.8,5.1c3,1.2,6.2,1.9,9.5,1.9
	c3.4,0,6.6-0.6,9.6-1.9c2.9-1.2,5.5-2.9,7.8-5.1c2.2-2.1,4-4.7,5.2-7.6c1.3-2.9,2-6,2-9.2S48.3,17.4,47,14.5z M37.9,31.4H12.8v-3
	h25.1V31.4z"/>
<path class="st1" d="M98,14.5c-1.3-2.9-3-5.5-5.2-7.6c-2.2-2.1-4.8-3.8-7.8-5.1c-5.9-2.5-13.1-2.5-19.1,0c-2.9,1.2-5.5,2.9-7.8,5.1
	c-2.2,2.1-4,4.7-5.2,7.6c-1.3,2.9-2,6-2,9.2c0,3.2,0.7,6.3,2,9.2c1.3,2.9,3,5.4,5.2,7.6c2.2,2.1,4.8,3.8,7.8,5.1
	c3,1.2,6.2,1.9,9.5,1.9c3.4,0,6.6-0.6,9.6-1.9c2.9-1.2,5.5-2.9,7.8-5.1c2.2-2.1,4-4.7,5.2-7.6c1.3-2.9,2-6,2-9.2S99.3,17.4,98,14.5z
	 M85,31.4H59.9v-3H85V31.4z"/>
</svg>
