<?xml version="1.0" encoding="utf-8"?>
<!-- Generator: Adobe Illustrator 20.1.0, SVG Export Plug-In . SVG Version: 6.00 Build 0)  -->
<svg version="1.1" id="Ebene_1" xmlns="http://www.w3.org/2000/svg" xmlns:xlink="http://www.w3.org/1999/xlink" x="0px" y="0px"
	 width="301.7px" height="56.6px" viewBox="0 0 301.7 56.6" style="enable-background:new 0 0 301.7 56.6;" xml:space="preserve">
<path d="M14.2,43.2c-0.2-0.2-0.3-0.5-0.3-0.8s0.1-0.6,0.3-0.8l5.8-5.8c0.4-0.4,1.1-0.4,1.5,0l5.9,5.9l5.8-5.8V22
	c0-0.7-0.6-1.3-1.3-1.3h-2.3V15c0-7.2-5.8-13-13-13s-13,5.8-13,13v5.7H1.3C0.6,20.7,0,21.3,0,22v25.2c0,0.7,0.6,1.3,1.3,1.3h18.2
	L14.2,43.2z M9.8,15c0-3.7,3-6.8,6.8-6.8c3.7,0,6.8,3,6.8,6.8v5.7H9.8V15z"/>
<path d="M50.3,31.3L28,53.6c-0.1,0.1-0.3,0.2-0.5,0.2s-0.4-0.1-0.5-0.2L16.2,42.8c-0.1-0.1-0.2-0.3-0.2-0.5s0.1-0.4,0.2-0.5L20,38
	c0.3-0.3,0.7-0.3,1,0l6.5,6.5l17.9-17.9c0.3-0.3,0.7-0.3,1,0l3.8,3.8c0.1,0.1,0.2,0.3,0.2,0.5C50.5,31,50.4,31.2,50.3,31.3z"/>
<g>
	<path d="M76.9,15.3c0-1-0.4-1.8-1.1-2.5c-0.8-0.6-2.1-1.2-3.9-1.7c-2-0.5-3.6-1.2-4.6-2s-1.6-1.9-1.6-3.3s0.6-2.6,1.7-3.5
		S70.1,1,71.9,1c1.9,0,3.4,0.5,4.6,1.6s1.7,2.3,1.7,3.9v0.1h-1.4c0-1.2-0.4-2.3-1.3-3s-2.1-1.2-3.6-1.2s-2.6,0.3-3.5,1
		s-1.3,1.5-1.3,2.5c0,0.9,0.4,1.7,1.2,2.3s2.1,1.2,4,1.6c2,0.5,3.5,1.2,4.5,2.1s1.6,2,1.6,3.4c0,1.5-0.6,2.6-1.8,3.5
		s-2.7,1.3-4.6,1.3c-1.8,0-3.5-0.5-4.8-1.4s-2-2.3-2-4.1v-0.1h1.4c0,1.4,0.5,2.5,1.6,3.2s2.3,1,3.8,1s2.6-0.3,3.5-1
		C76.5,17.2,76.9,16.3,76.9,15.3z"/>
	<path d="M92.6,15.3c0-1-0.4-1.8-1.1-2.5c-0.8-0.6-2.1-1.2-3.9-1.7c-2-0.5-3.6-1.2-4.6-2s-1.6-1.9-1.6-3.3s0.6-2.6,1.7-3.5
		S85.8,1,87.6,1c1.9,0,3.4,0.5,4.6,1.6s1.7,2.3,1.7,3.9v0.1h-1.4c0-1.2-0.4-2.3-1.3-3s-2.1-1.2-3.6-1.2s-2.6,0.3-3.5,1
		s-1.3,1.5-1.3,2.5c0,0.9,0.4,1.7,1.2,2.3s2.1,1.2,4,1.6c2,0.5,3.5,1.2,4.5,2.1s1.6,2,1.6,3.4c0,1.5-0.6,2.6-1.8,3.5
		s-2.7,1.3-4.6,1.3c-1.8,0-3.5-0.5-4.8-1.4s-2-2.3-2-4.1v-0.1h1.4c0,1.4,0.5,2.5,1.6,3.2s2.3,1,3.8,1s2.6-0.3,3.5-1
		C92.1,17.2,92.6,16.3,92.6,15.3z"/>
	<path d="M99.1,18.5h9.1v1.3H97.6V1.3h1.5V18.5z"/>
	<path d="M122.8,16.7l0.4,1.2h0.1l0.4-1.2l5.5-15.4h1.7L124,19.8h-1.4l-6.9-18.5h1.7L122.8,16.7z"/>
	<path d="M137.8,20.1c-1.7,0-3.1-0.6-4.3-1.9s-1.7-2.9-1.7-4.8v-0.7c0-2,0.6-3.6,1.7-4.9s2.5-1.9,4.1-1.9c1.7,0,3,0.5,4,1.6
		s1.4,2.5,1.4,4.3V13h-9.7v0.4c0,1.5,0.4,2.8,1.2,3.9s1.9,1.6,3.2,1.6c0.9,0,1.8-0.1,2.4-0.4s1.2-0.6,1.7-1.1l0.6,1
		c-0.5,0.5-1.2,1-2,1.3C139.9,19.9,138.9,20.1,137.8,20.1z M137.7,7.1c-1.1,0-2.1,0.4-2.8,1.3s-1.2,1.9-1.3,3.2v0.1h8v-0.4
		c0-1.2-0.4-2.2-1.1-3S138.9,7.1,137.7,7.1z"/>
	<path d="M152.4,7.4l-1.1-0.1c-1,0-1.7,0.3-2.4,0.8c-0.6,0.5-1.1,1.3-1.3,2.2v9.5h-1.5V6.1h1.3l0.2,2.3v0.2c0.4-0.8,0.9-1.5,1.6-2
		s1.5-0.7,2.4-0.7c0.2,0,0.4,0,0.6,0c0.2,0,0.3,0.1,0.5,0.1L152.4,7.4z"/>
	<path d="M163.2,16.3c0-0.6-0.3-1.2-0.8-1.7s-1.5-0.9-2.9-1.2c-1.6-0.4-2.9-0.8-3.6-1.4c-0.8-0.6-1.2-1.4-1.2-2.5
		c0-1,0.4-1.9,1.3-2.7c0.9-0.7,2.1-1.1,3.5-1.1c1.5,0,2.8,0.4,3.7,1.1s1.3,1.7,1.3,2.9v0.1h-1.4c0-0.8-0.3-1.4-1-2
		c-0.6-0.6-1.5-0.8-2.6-0.8s-1.9,0.2-2.5,0.7s-0.8,1-0.8,1.7c0,0.6,0.2,1.2,0.7,1.6c0.5,0.4,1.4,0.8,2.9,1.1
		c1.6,0.4,2.9,0.9,3.7,1.5s1.2,1.5,1.2,2.6s-0.5,2.1-1.4,2.8c-0.9,0.7-2.2,1.1-3.7,1.1c-1.7,0-3-0.4-3.9-1.2c-1-0.8-1.4-1.7-1.4-2.8
		V16h1.4c0.1,1,0.5,1.7,1.2,2.1s1.6,0.7,2.6,0.7c1.1,0,2-0.2,2.6-0.7C162.8,17.6,163.2,17,163.2,16.3z"/>
	<path d="M173.3,18.8c1,0,1.9-0.3,2.7-0.9s1.2-1.4,1.2-2.4h1.3v0.1c0,1.3-0.5,2.3-1.5,3.2s-2.3,1.3-3.7,1.3c-1.9,0-3.3-0.6-4.3-1.9
		s-1.5-2.9-1.5-4.9v-0.5c0-2,0.5-3.6,1.5-4.9s2.5-1.9,4.3-1.9c1.5,0,2.8,0.4,3.8,1.3s1.5,2.1,1.5,3.5v0.1h-1.4c0-1.1-0.4-2-1.1-2.6
		c-0.7-0.7-1.6-1-2.7-1c-1.5,0-2.6,0.5-3.3,1.6s-1.1,2.4-1.1,4v0.5c0,1.6,0.4,3,1.1,4S171.8,18.8,173.3,18.8z"/>
	<path d="M183.2,8.4c0.5-0.8,1.1-1.5,1.8-1.9s1.7-0.7,2.7-0.7c1.4,0,2.6,0.4,3.3,1.3c0.8,0.9,1.2,2.3,1.2,4.2v8.5h-1.5v-8.5
		c0-1.5-0.3-2.6-0.9-3.2c-0.6-0.6-1.4-1-2.4-1s-1.9,0.3-2.6,0.8c-0.7,0.5-1.2,1.3-1.5,2.2v9.7h-1.5V0h1.5v8.4H183.2z"/>
	<path d="M197.8,19.8h-1.5V0h1.5V19.8z"/>
	<path d="M211,17.6c-0.4,0.8-1,1.4-1.8,1.9s-1.6,0.7-2.6,0.7c-1.4,0-2.6-0.5-3.4-1.5S202,16.1,202,14V6h1.5v8c0,1.7,0.3,2.9,0.9,3.6
		c0.6,0.7,1.4,1.1,2.4,1.1c1.2,0,2.1-0.3,2.8-0.8s1.2-1.2,1.4-2.1V6.1h1.5v13.7h-1.3L211,17.6z M205.6,3.3h-2.2v-2h2.2V3.3z
		 M211.5,3.3h-2.2v-2h2.2V3.3z"/>
	<path d="M224.7,16.3c0-0.6-0.3-1.2-0.8-1.7s-1.5-0.9-2.9-1.2c-1.6-0.4-2.9-0.8-3.6-1.4c-0.8-0.6-1.2-1.4-1.2-2.5
		c0-1,0.4-1.9,1.3-2.7c0.9-0.7,2.1-1.1,3.5-1.1c1.5,0,2.8,0.4,3.7,1.1s1.3,1.7,1.3,2.9v0.1h-1.4c0-0.8-0.3-1.4-1-2
		C223,7.2,222.1,7,221,7s-1.9,0.2-2.5,0.7s-0.8,1-0.8,1.7c0,0.6,0.2,1.2,0.7,1.6c0.5,0.4,1.4,0.8,2.9,1.1c1.6,0.4,2.9,0.9,3.7,1.5
		s1.2,1.5,1.2,2.6s-0.5,2.1-1.4,2.8c-0.9,0.7-2.2,1.1-3.7,1.1c-1.7,0-3-0.4-3.9-1.2c-1-0.8-1.4-1.7-1.4-2.8V16h1.4
		c0.1,1,0.5,1.7,1.2,2.1s1.6,0.7,2.6,0.7c1.1,0,2-0.2,2.6-0.7C224.4,17.6,224.7,17,224.7,16.3z"/>
	<path d="M238,16.3c0-0.6-0.3-1.2-0.8-1.7s-1.5-0.9-2.9-1.2c-1.6-0.4-2.9-0.8-3.6-1.4c-0.8-0.6-1.2-1.4-1.2-2.5c0-1,0.4-1.9,1.3-2.7
		c0.9-0.7,2.1-1.1,3.5-1.1c1.5,0,2.8,0.4,3.7,1.1s1.3,1.7,1.3,2.9v0.1h-1.4c0-0.8-0.3-1.4-1-2c-0.6-0.6-1.5-0.8-2.6-0.8
		s-1.9,0.2-2.5,0.7s-0.8,1-0.8,1.7c0,0.6,0.2,1.2,0.7,1.6c0.5,0.4,1.4,0.8,2.9,1.1c1.6,0.4,2.9,0.9,3.7,1.5s1.2,1.5,1.2,2.6
		s-0.5,2.1-1.4,2.8c-0.9,0.7-2.2,1.1-3.7,1.1c-1.7,0-3-0.4-3.9-1.2c-1-0.8-1.4-1.7-1.4-2.8V16h1.4c0.1,1,0.5,1.7,1.2,2.1
		s1.6,0.7,2.6,0.7c1.1,0,2-0.2,2.6-0.7C237.6,17.6,238,17,238,16.3z"/>
	<path d="M248.1,20.1c-1.7,0-3.1-0.6-4.3-1.9c-1.1-1.3-1.7-2.9-1.7-4.8v-0.7c0-2,0.6-3.6,1.7-4.9c1.1-1.3,2.5-1.9,4.1-1.9
		c1.7,0,3,0.5,4,1.6s1.4,2.5,1.4,4.3V13h-9.7v0.4c0,1.5,0.4,2.8,1.2,3.9s1.9,1.6,3.2,1.6c0.9,0,1.8-0.1,2.4-0.4s1.2-0.6,1.7-1.1
		l0.6,1c-0.5,0.5-1.2,1-2,1.3C250.2,19.9,249.2,20.1,248.1,20.1z M247.9,7.1c-1.1,0-2.1,0.4-2.8,1.3s-1.2,1.9-1.3,3.2v0.1h8v-0.4
		c0-1.2-0.4-2.2-1.1-3S249.1,7.1,247.9,7.1z"/>
	<path d="M258.1,19.8h-1.5V0h1.5V19.8z"/>
	<path d="M271.3,17.6c-0.4,0.8-1,1.4-1.8,1.9s-1.6,0.7-2.6,0.7c-1.4,0-2.6-0.5-3.4-1.5s-1.2-2.5-1.2-4.6v-8h1.5v8
		c0,1.7,0.3,2.9,0.9,3.6s1.4,1.1,2.4,1.1c1.2,0,2.1-0.3,2.8-0.8c0.7-0.5,1.2-1.2,1.4-2.1V6.1h1.5v13.7h-1.3L271.3,17.6z"/>
	<path d="M278.1,6.1l0.1,2.4c0.4-0.8,1-1.5,1.8-2c0.7-0.5,1.6-0.7,2.7-0.7c1.5,0,2.6,0.5,3.4,1.4s1.2,2.3,1.2,4.3v8.4h-1.5v-8.4
		c0-1.6-0.3-2.7-0.9-3.3c-0.6-0.7-1.4-1-2.5-1s-1.9,0.3-2.6,0.8c-0.7,0.6-1.2,1.3-1.5,2.2v9.6h-1.5V6.1H278.1z"/>
	<path d="M290.6,13.1c0-2.2,0.5-3.9,1.4-5.3c0.9-1.3,2.2-2,3.9-2c1,0,1.8,0.2,2.5,0.6s1.3,1,1.8,1.8l0.2-2.2h1.3v13.6
		c0,1.8-0.5,3.2-1.5,4.2c-1,1-2.3,1.5-4.1,1.5c-0.7,0-1.4-0.1-2.1-0.2s-1.4-0.4-2-0.7l0.4-1.3c0.5,0.3,1.1,0.5,1.7,0.6
		s1.2,0.2,1.9,0.2c1.3,0,2.3-0.4,3-1.2c0.7-0.8,1-1.8,1-3.2v-1.7c-0.5,0.7-1.1,1.2-1.8,1.6s-1.5,0.6-2.5,0.6c-1.7,0-2.9-0.6-3.9-1.8
		c-0.9-1.2-1.4-2.9-1.4-4.9v-0.2H290.6z M292.1,13.3c0,1.7,0.3,3,1,4s1.7,1.5,3,1.5c1,0,1.8-0.2,2.5-0.7s1.2-1.1,1.5-1.9V9.9
		c-0.3-0.8-0.8-1.5-1.5-2c-0.6-0.5-1.5-0.8-2.5-0.8c-1.3,0-2.3,0.6-3,1.7s-1,2.5-1,4.3V13.3z"/>
	<path d="M76.9,46.5c0-1-0.4-1.8-1.1-2.5c-0.8-0.6-2.1-1.2-3.9-1.7c-2-0.5-3.6-1.2-4.6-2s-1.6-1.9-1.6-3.3c0-1.4,0.6-2.6,1.7-3.5
		s2.7-1.3,4.5-1.3c1.9,0,3.4,0.5,4.6,1.6s1.7,2.3,1.7,3.9v0.1h-1.4c0-1.2-0.4-2.3-1.3-3s-2.1-1.2-3.6-1.2s-2.6,0.3-3.5,1
		S67.2,36,67.2,37c0,0.9,0.4,1.7,1.2,2.3c0.8,0.6,2.1,1.2,4,1.6c2,0.5,3.5,1.2,4.5,2.1s1.6,2,1.6,3.4c0,1.5-0.6,2.6-1.8,3.5
		s-2.7,1.3-4.6,1.3c-1.8,0-3.5-0.5-4.8-1.4c-1.4-0.9-2-2.3-2-4.1v-0.1h1.4c0,1.4,0.5,2.5,1.6,3.2s2.3,1,3.8,1s2.6-0.3,3.5-1
		C76.5,48.4,76.9,47.5,76.9,46.5z"/>
	<path d="M83.3,33.3h-1.5v-2.1h1.5V33.3z M83.3,51h-1.5V37.3h1.5V51z"/>
	<path d="M92.6,50c1,0,1.9-0.3,2.7-0.9s1.2-1.4,1.2-2.4h1.3v0.1c0,1.3-0.5,2.3-1.5,3.2s-2.3,1.3-3.7,1.3c-1.9,0-3.3-0.6-4.3-1.9
		c-1-1.3-1.5-2.9-1.5-4.9V44c0-2,0.5-3.6,1.5-4.9s2.5-1.9,4.3-1.9c1.5,0,2.8,0.4,3.8,1.3s1.5,2.1,1.5,3.5v0.1h-1.4
		c0-1.1-0.4-2-1.1-2.6c-0.7-0.7-1.6-1-2.7-1c-1.5,0-2.6,0.5-3.3,1.6s-1.1,2.4-1.1,4v0.5c0,1.6,0.4,3,1.1,4C90,49.5,91.1,50,92.6,50z
		"/>
	<path d="M102.5,39.6c0.5-0.8,1.1-1.5,1.8-1.9S106,37,107,37c1.4,0,2.6,0.4,3.3,1.3s1.2,2.3,1.2,4.2V51H110v-8.5
		c0-1.5-0.3-2.6-0.9-3.2c-0.6-0.6-1.4-1-2.4-1s-1.9,0.3-2.6,0.8s-1.2,1.3-1.5,2.2V51h-1.5V31.2h1.5L102.5,39.6L102.5,39.6z"/>
	<path d="M120.6,51.3c-1.7,0-3.1-0.6-4.3-1.9s-1.7-2.9-1.7-4.8v-0.7c0-2,0.6-3.6,1.7-4.9s2.5-1.9,4.1-1.9c1.7,0,3,0.5,4,1.6
		s1.4,2.5,1.4,4.3v1.3h-9.7v0.4c0,1.5,0.4,2.8,1.2,3.9c0.8,1,1.9,1.6,3.2,1.6c0.9,0,1.8-0.1,2.4-0.4s1.2-0.6,1.7-1.1l0.6,1
		c-0.5,0.5-1.2,1-2,1.3C122.6,51.1,121.7,51.3,120.6,51.3z M120.4,38.3c-1.1,0-2.1,0.4-2.8,1.3s-1.2,1.9-1.3,3.2v0.1h8v-0.4
		c0-1.2-0.4-2.2-1.1-3S121.6,38.3,120.4,38.3z"/>
	<path d="M135.1,38.6l-1.1-0.1c-1,0-1.7,0.3-2.4,0.8c-0.6,0.5-1.1,1.3-1.3,2.2V51h-1.5V37.3h1.3l0.2,2.3v0.2c0.4-0.8,0.9-1.5,1.6-2
		s1.5-0.7,2.4-0.7c0.2,0,0.4,0,0.6,0c0.2,0,0.3,0.1,0.5,0.1L135.1,38.6z"/>
	<path d="M142.6,51.3c-1.7,0-3.1-0.6-4.3-1.9s-1.7-2.9-1.7-4.8v-0.7c0-2,0.6-3.6,1.7-4.9s2.5-1.9,4.1-1.9c1.7,0,3,0.5,4,1.6
		s1.4,2.5,1.4,4.3v1.3h-9.7v0.4c0,1.5,0.4,2.8,1.2,3.9c0.8,1,1.9,1.6,3.2,1.6c0.9,0,1.8-0.1,2.4-0.4s1.2-0.6,1.7-1.1l0.6,1
		c-0.5,0.5-1.2,1-2,1.3C144.6,51.1,143.7,51.3,142.6,51.3z M142.4,38.3c-1.1,0-2.1,0.4-2.8,1.3s-1.2,1.9-1.3,3.2v0.1h8v-0.4
		c0-1.2-0.4-2.2-1.1-3S143.6,38.3,142.4,38.3z"/>
	<path d="M170.5,32.5V45c0,2-0.6,3.6-1.8,4.6c-1.2,1.1-2.8,1.6-4.8,1.6s-3.5-0.5-4.7-1.6s-1.8-2.6-1.8-4.6V32.5h1.5V45
		c0,1.6,0.5,2.8,1.4,3.6c0.9,0.9,2.1,1.3,3.6,1.3s2.8-0.4,3.7-1.3s1.4-2.1,1.4-3.7V32.5H170.5z M162.2,30.2H160v-2h2.2V30.2z
		 M168.1,30.2h-2.2v-2h2.2V30.2z"/>
	<path d="M185.6,44.5c0,2.1-0.5,3.7-1.4,4.9s-2.2,1.8-3.8,1.8c-1,0-1.9-0.2-2.6-0.6c-0.7-0.4-1.3-1-1.8-1.7l-0.2,2.1h-1.3V31.2h1.5
		v8.2c0.5-0.8,1-1.4,1.8-1.8c0.7-0.4,1.6-0.6,2.5-0.6c1.7,0,2.9,0.7,3.9,2c0.9,1.3,1.4,3.1,1.4,5.3L185.6,44.5L185.6,44.5z
		 M184.1,44.3c0-1.8-0.3-3.2-1-4.3s-1.7-1.7-3-1.7c-1.1,0-1.9,0.3-2.6,0.8c-0.6,0.5-1.1,1.2-1.4,2v6.2c0.3,0.8,0.8,1.4,1.5,1.9
		s1.5,0.7,2.5,0.7c1.3,0,2.3-0.5,3-1.5s1-2.3,1-4V44.3z"/>
	<path d="M194.2,51.3c-1.7,0-3.1-0.6-4.3-1.9c-1.1-1.3-1.7-2.9-1.7-4.8v-0.7c0-2,0.6-3.6,1.7-4.9c1.1-1.3,2.5-1.9,4.1-1.9
		c1.7,0,3,0.5,4,1.6s1.4,2.5,1.4,4.3v1.3h-9.7v0.4c0,1.5,0.4,2.8,1.2,3.9c0.8,1,1.9,1.6,3.2,1.6c0.9,0,1.8-0.1,2.4-0.4
		s1.2-0.6,1.7-1.1l0.6,1c-0.5,0.5-1.2,1-2,1.3C196.2,51.1,195.3,51.3,194.2,51.3z M194,38.3c-1.1,0-2.1,0.4-2.8,1.3
		s-1.2,1.9-1.3,3.2v0.1h8v-0.4c0-1.2-0.4-2.2-1.1-3S195.2,38.3,194,38.3z"/>
	<path d="M208.8,38.6l-1.1-0.1c-1,0-1.7,0.3-2.4,0.8c-0.6,0.5-1.1,1.3-1.3,2.2V51h-1.5V37.3h1.3l0.2,2.3v0.2c0.4-0.8,0.9-1.5,1.6-2
		S207,37,208,37c0.2,0,0.4,0,0.6,0c0.2,0,0.3,0.1,0.5,0.1L208.8,38.6z"/>
	<path d="M214.1,33.8v3.5h3v1.2h-3v9c0,0.9,0.2,1.5,0.5,1.9s0.8,0.6,1.3,0.6c0.2,0,0.5,0,0.7,0s0.5-0.1,0.8-0.1l0.2,1.1
		c-0.3,0.1-0.6,0.2-0.9,0.3s-0.7,0.1-1.1,0.1c-1,0-1.7-0.3-2.3-0.9c-0.5-0.6-0.8-1.6-0.8-2.9v-9h-2.4v-1.2h2.4v-3.5L214.1,33.8
		L214.1,33.8z"/>
	<path d="M226.7,38.6l-1.1-0.1c-1,0-1.7,0.3-2.4,0.8c-0.6,0.5-1.1,1.3-1.3,2.2V51h-1.5V37.3h1.3l0.2,2.3v0.2c0.4-0.8,0.9-1.5,1.6-2
		s1.5-0.7,2.4-0.7c0.2,0,0.4,0,0.6,0c0.2,0,0.3,0.1,0.5,0.1L226.7,38.6z"/>
	<path d="M237.9,51c-0.1-0.5-0.2-0.9-0.2-1.2s-0.1-0.7-0.1-1c-0.5,0.7-1.2,1.3-2,1.8s-1.8,0.7-2.9,0.7c-1.3,0-2.4-0.4-3.1-1.1
		c-0.7-0.7-1.1-1.7-1.1-2.9c0-1.3,0.5-2.3,1.6-3c1.1-0.8,2.6-1.1,4.4-1.1h3v-1.7c0-1-0.3-1.8-0.9-2.3c-0.6-0.6-1.5-0.8-2.6-0.8
		s-1.9,0.3-2.6,0.8c-0.7,0.5-1,1.2-1,2H229v-0.1c-0.1-1,0.4-1.9,1.4-2.7s2.2-1.2,3.8-1.2c1.5,0,2.7,0.4,3.7,1.2s1.4,1.9,1.4,3.3v6.8
		c0,0.5,0,1,0.1,1.4c0.1,0.5,0.1,0.9,0.3,1.4h-1.8V51z M232.9,49.9c1.1,0,2.1-0.3,2.9-0.8c0.8-0.5,1.4-1.2,1.8-2v-2.9h-3.1
		c-1.4,0-2.5,0.3-3.3,0.9c-0.8,0.6-1.2,1.3-1.2,2.2c0,0.7,0.3,1.4,0.8,1.8C231.3,49.7,232,49.9,232.9,49.9z"/>
	<path d="M242.6,44.3c0-2.2,0.5-3.9,1.4-5.3c0.9-1.3,2.2-2,3.9-2c1,0,1.8,0.2,2.5,0.6c0.7,0.4,1.3,1,1.8,1.8l0.2-2.2h1.3v13.6
		c0,1.8-0.5,3.2-1.5,4.2s-2.3,1.5-4.1,1.5c-0.7,0-1.4-0.1-2.1-0.2s-1.4-0.4-2-0.7l0.4-1.3c0.5,0.3,1.1,0.5,1.7,0.6
		c0.6,0.1,1.2,0.2,1.9,0.2c1.3,0,2.3-0.4,3-1.2s1-1.8,1-3.2V49c-0.5,0.7-1.1,1.2-1.8,1.6c-0.7,0.4-1.5,0.6-2.5,0.6
		c-1.7,0-2.9-0.6-3.9-1.8c-0.9-1.2-1.4-2.9-1.4-4.9v-0.2H242.6z M244.1,44.5c0,1.7,0.3,3,1,4s1.7,1.5,3,1.5c1,0,1.8-0.2,2.5-0.7
		s1.2-1.1,1.5-1.9V41c-0.3-0.8-0.8-1.5-1.5-2c-0.6-0.5-1.5-0.8-2.5-0.8c-1.3,0-2.3,0.6-3,1.7c-0.7,1.1-1,2.5-1,4.3V44.5z"/>
	<path d="M266.6,48.8c-0.4,0.8-1,1.4-1.8,1.9c-0.7,0.4-1.6,0.7-2.6,0.7c-1.4,0-2.6-0.5-3.4-1.5s-1.2-2.5-1.2-4.6v-8h1.5v8
		c0,1.7,0.3,2.9,0.9,3.6c0.6,0.7,1.4,1.1,2.4,1.1c1.2,0,2.1-0.3,2.8-0.8c0.7-0.5,1.2-1.2,1.4-2.1v-9.8h1.5V51h-1.3L266.6,48.8z"/>
	<path d="M273.5,37.3l0.1,2.4c0.4-0.8,1-1.5,1.8-2c0.7-0.5,1.6-0.7,2.7-0.7c1.5,0,2.6,0.5,3.4,1.4s1.2,2.3,1.2,4.3V51h-1.5v-8.4
		c0-1.6-0.3-2.7-0.9-3.3c-0.6-0.7-1.4-1-2.5-1s-1.9,0.3-2.6,0.8c-0.7,0.6-1.2,1.3-1.5,2.2V51h-1.5V37.3H273.5z"/>
	<path d="M286,44.3c0-2.2,0.5-3.9,1.4-5.3c0.9-1.3,2.2-2,3.9-2c1,0,1.8,0.2,2.5,0.6c0.7,0.4,1.3,1,1.8,1.8l0.2-2.2h1.3v13.6
		c0,1.8-0.5,3.2-1.5,4.2s-2.3,1.5-4.1,1.5c-0.7,0-1.4-0.1-2.1-0.2s-1.4-0.4-2-0.7l0.4-1.3c0.5,0.3,1.1,0.5,1.7,0.6s1.2,0.2,1.9,0.2
		c1.3,0,2.3-0.4,3-1.2s1-1.8,1-3.2V49c-0.5,0.7-1.1,1.2-1.8,1.6c-0.7,0.4-1.5,0.6-2.5,0.6c-1.7,0-2.9-0.6-3.9-1.8
		c-0.9-1.2-1.4-2.9-1.4-4.9v-0.2H286z M287.5,44.5c0,1.7,0.3,3,1,4s1.7,1.5,3,1.5c1,0,1.8-0.2,2.5-0.7s1.2-1.1,1.5-1.9V41
		c-0.3-0.8-0.8-1.5-1.5-2c-0.6-0.5-1.5-0.8-2.5-0.8c-1.3,0-2.3,0.6-3,1.7c-0.7,1.1-1,2.5-1,4.3V44.5z"/>
</g>
</svg>
