<?xml version="1.0" encoding="utf-8"?>
<!-- Generator: Adobe Illustrator 18.1.1, SVG Export Plug-In . SVG Version: 6.00 Build 0)  -->
<!DOCTYPE svg PUBLIC "-//W3C//DTD SVG 1.1//EN" "http://www.w3.org/Graphics/SVG/1.1/DTD/svg11.dtd">
<svg version="1.1" id="Layer_1" xmlns="http://www.w3.org/2000/svg" xmlns:xlink="http://www.w3.org/1999/xlink" x="0px" y="0px"
	 width="330.7px" height="126.5px" viewBox="0 0 330.7 126.5" enable-background="new 0 0 330.7 126.5" xml:space="preserve">
<g>
	<g>
		<path fill="#FFFFFF" d="M70.1,83.7h12.9v17.6H70.1V126H47.3v-24.7H0.9l-1-13.7l47.2-75.4h23V83.7z M21.1,83.7h26.2v-41l-0.5-0.2
			l-1.8,3.2L21.1,83.7z"/>
	</g>
	<g>
		<path fill="#FFFFFF" d="M315.5,83.7h12.9v17.6h-12.9V126h-22.7v-24.7h-46.4l-1-13.7l47.2-75.4h23V83.7z M266.6,83.7h26.2v-41
			l-0.5-0.2l-1.8,3.2L266.6,83.7z"/>
	</g>
	<g>
		<circle fill="#3FA9F5" cx="164.2" cy="63.8" r="61"/>
		<g>
			<g>
				<path fill="#FFFFFF" d="M148.8,45.7c-3.9-5.4-11.5-6.6-16.9-2.8s-6.6,11.5-2.8,16.9c0.2,0.3,0.4,0.6,0.7,0.9
					c0.1,0.2,0.3,0.3,0.4,0.5c0.1,0.1,0.2,0.2,0.3,0.4c0.2,0.2,0.4,0.4,0.6,0.5c0,0,0.1,0.1,0.2,0.1c0.2,0.2,0.5,0.4,0.7,0.5l0,0
					c-0.8-2.3,0-5,2.1-6.5c2.6-1.8,6-1.3,7.9,1.3c1.6,2.2,1.3,5.2-0.5,7.1c0.8-0.2,1.5-0.4,2.3-0.7l0,0c0.3-0.2,0.7-0.3,1-0.5
					c0,0,0.1-0.1,0.1-0.1c0.4-0.2,0.7-0.5,1.1-0.7C151.4,58.6,152.7,51.1,148.8,45.7z"/>
				<path fill="#131414" d="M152.4,43.1c-5.3-7.4-15.6-9.2-23-3.9c-7.4,5.3-9.2,15.6-3.9,23c5.3,7.4,15.6,9.2,23,3.9
					C156,60.9,157.7,50.6,152.4,43.1z M141.4,64.5c1.8-2,2.1-4.9,0.5-7.1c-1.8-2.5-5.3-3.1-7.8-1.3c-2.1,1.5-2.9,4.1-2.1,6.4
					c-1-0.8-2.1-1.7-2.9-2.9c-3.9-5.4-2.6-12.9,2.9-16.8c5.4-3.9,13-2.6,16.9,2.9s2.6,13-2.9,16.9C144.5,63.5,143,64.2,141.4,64.5z"
					/>
			</g>
			<g>
				<path fill="#FFFFFF" d="M181,39.4c-7.4,2.8-11.1,11.1-8.3,18.5c2.8,7.3,11.1,11.1,18.5,8.3c0.4-0.2,0.8-0.3,1.2-0.5
					c0.2-0.1,0.4-0.2,0.6-0.3c0.2-0.1,0.3-0.2,0.5-0.2c0.3-0.2,0.6-0.4,0.8-0.5c0,0,0.1-0.1,0.2-0.1c0.3-0.2,0.6-0.4,0.8-0.7l0,0
					c-2.9,0.2-5.7-1.5-6.8-4.3c-1.3-3.5,0.4-7.3,3.9-8.6c3-1.1,6.3,0.1,8,2.8c0-1,0-1.9-0.1-2.9l0,0c-0.1-0.4-0.2-0.8-0.3-1.2
					c0,0-0.1-0.1-0.1-0.2c-0.1-0.5-0.3-0.9-0.5-1.5C196.6,40.2,188.4,36.5,181,39.4z"/>
				<path fill="#131414" d="M179.1,34.4c-10.1,3.8-15.2,15.1-11.4,25.2c3.8,10.1,15.1,15.2,25.2,11.4c10.1-3.8,15.2-15.1,11.4-25.2
					C200.5,35.7,189.2,30.6,179.1,34.4z M200.3,53.4c-1.7-2.7-5-3.9-8-2.8c-3.4,1.3-5.2,5.2-3.9,8.6c1.1,2.8,3.8,4.6,6.7,4.4
					c-1.2,1-2.5,1.9-4.2,2.5c-7.4,2.8-15.7-1-18.4-8.4s1-15.7,8.4-18.4c7.4-2.8,15.7,1,18.4,8.4C200.2,49.6,200.4,51.5,200.3,53.4z"
					/>
			</g>
		</g>
		<path d="M192.9,101.7c-2.6,2.3-7.9,5.1-14.5,5.1c-4.5,0-9.6-1.3-14.9-4.8c-12.3-8.2-23.8-0.4-24.3,0c-1.5,1-3.5,0.7-4.6-0.8
			s-0.7-3.5,0.8-4.6c0.6-0.5,15.6-10.8,31.7-0.1c12,8,21,0.6,21.4,0.2c1.4-1.2,3.5-1,4.6,0.3C194.4,98.4,194.2,100.5,192.9,101.7z"
			/>
	</g>
</g>
</svg>
