<?xml version="1.0" encoding="utf-8"?>
<!-- Generator: Adobe Illustrator 19.2.1, SVG Export Plug-In . SVG Version: 6.00 Build 0)  -->
<svg version="1.1" id="Layer_1" xmlns="http://www.w3.org/2000/svg" xmlns:xlink="http://www.w3.org/1999/xlink" x="0px" y="0px"
	 viewBox="0 0 390 72" style="enable-background:new 0 0 390 72;" xml:space="preserve">
<style type="text/css">
	.st0{fill:#101214;}
	.st1{fill:#FFFFFF;}
	.st2{fill:#1BA9E2;}
	.st3{fill:#696968;}
	.st4{fill:#010202;}
</style>
<g>
	<path class="st0" d="M31.3,6.3c-1.7-1.7-3.7-3-5.9-3.9c-2.2-0.9-4.6-1.3-7-1.3H2.2v4.6h16.2c1.8,0,3.5,0.3,5.2,1
		c1.7,0.7,3.1,1.6,4.4,2.9c1.1,1.1,2,2.4,2.7,3.7c0.4,0.8,0.7,1.7,0.9,2.6H0v3c0,2.4,0.5,4.7,1.4,6.9s2.3,4.1,4,5.8
		c1.7,1.6,3.7,3,5.9,3.8c2.2,0.9,4.6,1.3,7,1.3h16.2v-4.6H18.4c-1.8,0-3.5-0.3-5.2-1s-3.1-1.6-4.4-2.9c-1.3-1.2-2.3-2.7-2.9-4.3
		c-0.5-1.1-0.8-2.2-0.9-3.4h31.8v-1.6c0-2.4-0.5-4.7-1.4-6.8C34.4,9.8,33.1,7.9,31.3,6.3z"/>
	<g>
		<path class="st1" d="M110.8,18.8c0,8.4-7,15.2-15.7,15.2s-15.7-6.8-15.7-15.2s7-15.2,15.7-15.2S110.8,10.4,110.8,18.8z"/>
		<path class="st1" d="M72.6,18.8c0,8.4-7,15.2-15.7,15.2s-15.7-6.8-15.7-15.2s7-15.2,15.7-15.2S72.6,10.4,72.6,18.8z"/>
		<g>
			<path class="st0" d="M69.3,24.8c0,3.3-2.8,6-6.2,6c-3.4,0-6.2-2.7-6.2-6c0-3.3,2.8-6,6.2-6C66.5,18.8,69.3,21.5,69.3,24.8z"/>
			<ellipse class="st0" cx="101.3" cy="24.8" rx="6.2" ry="6"/>
		</g>
		<path class="st0" d="M69.8,6.2c-1.7-1.6-3.6-2.9-5.8-3.8c-4.4-1.9-9.8-1.9-14.3,0c-2.2,0.9-4.2,2.2-5.8,3.8s-3,3.5-3.9,5.7
			c-1,2.2-1.5,4.5-1.5,7s0.5,4.7,1.5,7c1,2.2,2.3,4.1,3.9,5.7c1.7,1.6,3.6,2.9,5.8,3.8c2.2,0.9,4.6,1.4,7.1,1.4c2.5,0,5-0.5,7.2-1.4
			c2.2-0.9,4.2-2.2,5.8-3.8s3-3.5,3.9-5.7c1-2.2,1.5-4.5,1.5-7s-0.5-4.7-1.5-7C72.8,9.7,71.5,7.8,69.8,6.2z M51.6,30.9
			c-1.6-0.7-3.1-1.6-4.3-2.8c-1.2-1.2-2.2-2.6-2.9-4.2c-0.7-1.6-1-3.3-1-5.1c0-1.8,0.3-3.5,1.1-5.1c0.7-1.6,1.7-3,2.9-4.2
			c1.2-1.2,2.7-2.1,4.3-2.8c1.6-0.7,3.4-1,5.3-1s3.7,0.3,5.3,1c1.7,0.7,3.1,1.6,4.3,2.8c1.2,1.2,2.2,2.6,2.9,4.2
			c0.7,1.6,1.1,3.3,1.1,5.1c0,1.8-0.3,3.6-1,5.1c-0.7,1.6-1.7,3-2.9,4.2c-1.2,1.2-2.7,2.1-4.3,2.8C58.8,32.3,54.8,32.3,51.6,30.9z"
			/>
		<path class="st0" d="M108,6.2c-1.7-1.6-3.6-2.9-5.8-3.8c-4.4-1.9-9.8-1.9-14.3,0c-2.2,0.9-4.2,2.2-5.8,3.8s-3,3.5-3.9,5.7
			s-1.5,4.5-1.5,7s0.5,4.7,1.5,7c1,2.2,2.3,4.1,3.9,5.7c1.7,1.6,3.6,2.9,5.8,3.8c2.2,0.9,4.6,1.4,7.1,1.4c2.5,0,5-0.5,7.2-1.4
			c2.2-0.9,4.2-2.2,5.8-3.8c1.7-1.6,3-3.5,3.9-5.7s1.5-4.5,1.5-7s-0.5-4.7-1.5-7C111,9.7,109.7,7.8,108,6.2z M89.8,30.9
			c-1.6-0.7-3.1-1.6-4.3-2.8c-1.2-1.2-2.2-2.6-2.9-4.2c-0.7-1.6-1-3.3-1-5.1c0-1.8,0.3-3.5,1.1-5.1c0.7-1.6,1.7-3,2.9-4.2
			c1.2-1.2,2.7-2.1,4.3-2.8c1.6-0.7,3.4-1,5.3-1s3.7,0.3,5.3,1c1.7,0.7,3.1,1.6,4.3,2.8c1.2,1.2,2.2,2.6,2.9,4.2
			c0.7,1.6,1.1,3.3,1.1,5.1c0,1.8-0.3,3.6-1,5.1c-0.7,1.6-1.7,3-2.9,4.2c-1.2,1.2-2.7,2.1-4.3,2.8C97.1,32.3,93,32.3,89.8,30.9z"/>
	</g>
	<path class="st0" d="M168.8,6.2c-1.7-1.6-3.7-3-5.9-3.8c-2.2-0.9-4.6-1.3-7-1.3c-4,0-7.7,1.1-10.8,3.4c-3.1-2.2-6.8-3.4-10.8-3.4
		c-2.5,0-4.8,0.4-7,1.3c-2.2,0.9-4.2,2.2-5.9,3.8c-1.7,1.7-3.1,3.6-4,5.8s-1.4,4.4-1.4,6.9v17.8h4.8V18.8c0-1.8,0.3-3.4,1-5
		c0.7-1.6,1.7-3,2.9-4.3c1.3-1.2,2.8-2.2,4.4-2.9c3.3-1.3,7.1-1.3,10.3,0c1.7,0.7,3.1,1.6,4.4,2.9s2.3,2.7,2.9,4.3
		c0.7,1.6,1,3.3,1,5v17.8h4.8V18.8c0-2.4-0.5-4.7-1.4-6.8c-0.7-1.6-1.6-3-2.7-4.3c2.2-1.3,4.5-2,7.2-2c1.8,0,3.5,0.3,5.2,1
		c1.6,0.7,3.1,1.6,4.4,2.9c1.3,1.2,2.3,2.7,3,4.3c0.7,1.6,1,3.3,1,5v17.8h4.8V18.8c0-2.4-0.5-4.7-1.3-6.8
		C171.8,9.8,170.5,7.9,168.8,6.2z"/>
	<g>
		<path class="st2" d="M181.6,6.4c1.7-1.7,3.7-3,5.9-3.9c2.2-0.9,4.6-1.3,7-1.3h16.2v4.6h-16.2c-1.8,0-3.5,0.3-5.2,1
			s-3.1,1.6-4.4,2.9c-1.1,1.1-2,2.4-2.7,3.7c-0.4,0.8-0.7,1.7-0.9,2.6H213v3c0,2.4-0.5,4.7-1.4,6.9c-0.9,2.1-2.3,4.1-4,5.8
			c-1.7,1.6-3.7,3-5.9,3.8c-2.2,0.9-4.6,1.3-7,1.3h-16.2v-4.6h16.2c1.8,0,3.5-0.3,5.2-1c1.7-0.7,3.1-1.6,4.4-2.9
			c1.3-1.2,2.3-2.7,2.9-4.3c0.5-1.1,0.8-2.2,0.9-3.4h-31.8V19c0-2.4,0.5-4.7,1.4-6.8C178.5,10,179.9,8.1,181.6,6.4z"/>
		<path class="st2" d="M246.3,6.4c-1.7-1.6-3.6-2.9-5.8-3.8c-4.5-1.9-9.8-1.9-14.3,0c-2.2,0.9-4.2,2.2-5.8,3.8s-3,3.5-3.9,5.7
			s-1.5,4.5-1.5,7s0.5,4.7,1.5,7c1,2.2,2.3,4.1,3.9,5.7s3.6,2.9,5.8,3.8c2.2,0.9,4.7,1.4,7.2,1.4h1.7v-4.7h-1.7
			c-1.9,0-3.7-0.3-5.3-1c-1.6-0.7-3.1-1.6-4.3-2.8c-1.2-1.2-2.2-2.6-2.9-4.2c-0.7-1.6-1-3.3-1-5.1c0-1.8,0.3-3.5,1.1-5.1
			c0.7-1.6,1.7-3,2.9-4.2c1.2-1.2,2.7-2.1,4.3-2.8c3.2-1.3,7.2-1.4,10.5,0c1.7,0.7,3.1,1.6,4.3,2.8c1.2,1.2,2.2,2.6,2.9,4.2
			c0.7,1.6,1.1,3.3,1.1,5.1v51h4.8V19c0-2.4-0.5-4.7-1.5-7C249.3,9.9,248,8,246.3,6.4z"/>
		<path class="st2" d="M286.9,19c0,1.8-0.3,3.4-1,5c-0.7,1.6-1.7,3-2.9,4.3c-1.3,1.2-2.7,2.2-4.4,2.8c-3.3,1.3-7.1,1.3-10.4,0
			c-1.7-0.6-3.1-1.6-4.4-2.8c-1.3-1.2-2.3-2.7-2.9-4.3c-0.7-1.6-1-3.3-1-5V1.1H255V19c0,2.4,0.5,4.7,1.4,6.8c0.9,2.2,2.3,4.1,4,5.7
			c1.7,1.7,3.7,3,5.9,3.9c2.2,0.9,4.6,1.3,7,1.3c2.5,0,4.8-0.4,7-1.3s4.2-2.2,6-3.9c1.7-1.6,3-3.6,4-5.8c0.9-2.2,1.4-4.4,1.4-6.8
			V1.1h-4.8L286.9,19L286.9,19z"/>
		<path class="st2" d="M325.8,6.4c-1.7-1.6-3.6-2.9-5.8-3.8c-4.5-1.9-9.8-1.9-14.3,0c-2.2,0.9-4.2,2.2-5.8,3.8s-3,3.5-3.9,5.7
			s-1.5,4.5-1.5,7s0.5,4.7,1.5,7c1,2.2,2.3,4.1,3.9,5.7s3.6,2.9,5.8,3.8c2.2,0.9,4.7,1.4,7.2,1.4h1.7v-4.6h-1.7
			c-1.9,0-3.7-0.3-5.3-1c-1.7-0.7-3.1-1.6-4.3-2.8c-1.2-1.2-2.2-2.6-2.9-4.2c-0.7-1.6-1-3.3-1-5.1c0-1.8,0.3-3.5,1.1-5.1
			c0.7-1.6,1.7-3,2.9-4.2c1.2-1.2,2.7-2.1,4.3-2.8c3.2-1.3,7.2-1.4,10.5,0c1.7,0.7,3.1,1.6,4.3,2.8c1.2,1.2,2.2,2.6,2.9,4.2
			c0.7,1.6,1.1,3.3,1.1,5.1v17.8h4.8V19.1c0-2.4-0.5-4.7-1.5-7C328.8,9.9,327.5,8,325.8,6.4z"/>
		<path class="st2" d="M355.2,5.9V1.1h-1.7c-2.5,0-4.9,0.5-7.2,1.4c-2.2,0.9-4.2,2.2-5.8,3.8s-3,3.5-3.9,5.7c-1,2.2-1.5,4.5-1.5,7
			v17.8h4.8V19c0-1.8,0.3-3.5,1.1-5.1c0.7-1.6,1.7-3,2.9-4.2c1.2-1.2,2.7-2.1,4.3-2.8c1.6-0.7,3.4-1,5.3-1
			C353.5,5.9,355.2,5.9,355.2,5.9z"/>
		<path class="st2" d="M388.5,12c-1-2.2-2.3-4.1-3.9-5.7c-1.7-1.6-3.6-2.9-5.8-3.8c-4.5-1.9-9.9-1.9-14.3,0
			c-2.2,0.9-4.2,2.2-5.8,3.8s-3,3.5-3.9,5.7c-1,2.2-1.5,4.5-1.5,7s0.5,4.7,1.5,7c1,2.2,2.3,4.1,3.9,5.7s3.6,2.9,5.8,3.8
			c2.2,0.9,4.7,1.4,7.2,1.4h1.8l-0.1-3c0-1.7,0.3-3.4,1-5c0.7-1.6,1.7-3,3-4.3c1.3-1.3,2.8-2.3,4.4-2.9c1.7-0.6,3.4-1,5.1-1h3.2V19
			C390,16.5,389.5,14.2,388.5,12z M371.6,5.9c1.7,0,3.4,0.3,5,0.9c1.6,0.6,3,1.5,4.2,2.5c1.2,1,2.2,2.4,2.9,3.8
			c0.5,0.9,0.9,1.9,1.1,3c-1.7,0.2-3.3,0.6-4.9,1.2c-2.2,0.9-4.3,2.2-6.1,3.9c-1.8,1.8-3.2,3.7-4,5.9c-0.6,1.5-1,3.1-1.2,4.7
			c-1-0.2-2.1-0.6-3-1.1c-1.5-0.7-2.8-1.7-3.9-2.9c-1.1-1.2-2-2.5-2.6-4c-0.6-1.5-1-3.1-1-4.9c0-1.8,0.3-3.5,1.1-5.1
			c0.7-1.6,1.7-3,2.9-4.2c1.2-1.2,2.7-2.1,4.3-2.8C368,6.2,369.8,5.9,371.6,5.9z"/>
	</g>
</g>
</svg>
