<svg xmlns="http://www.w3.org/2000/svg" width="25" height="19" viewBox="0 0 25 19">
    <path fill="current" d="M25 2.8h-.989c-.367 0-.886.508-.886.834V15.43c0 .326.52.77.886.77H25V19h-8.958v-2.8h1.875V3.8h-.092L13.446 19h-3.39L5.734 3.8h-.109v12.4H7.5V19H0v-2.8h.96c.396 0 .915-.444.915-.77V3.634c0-.326-.52-.834-.915-.834H0V0h9.378l3.08 11h.084L15.65 0H25v2.8" transform="translate(-1322 -866) translate(0 850) translate(1322 16)"/>
</svg>
