// Jest Snapshot v1, https://goo.gl/fbAQLP

exports[`Spinner component should match snapshot 1`] = `
<div
  className="spinner"
>
  <div
    className="spinner-border"
    role="status"
  >
    <span
      className="visually-hidden"
    >
      Loading...
    </span>
  </div>
</div>
`;
