<svg xmlns="http://www.w3.org/2000/svg" xmlns:xlink="http://www.w3.org/1999/xlink" width="97" height="94" viewBox="0 0 97 94">
    <defs>
        <path id="ateazlntxa" d="M0.612 0.189L42.526 0.189 42.526 55 0.612 55z"/>
        <path id="vzmaau895c" d="M0 94L96.726 94 96.726 0.498 0 0.498z"/>
        <path id="u2cavhmfwe" d="M0 0.517L9.673 0.517 9.673 10.189 0 10.189z"/>
        <path id="ajkeayobpg" d="M0 94L96.726 94 96.726 0.498 0 0.498z"/>
    </defs>
    <g fill="none" fill-rule="evenodd">
        <g>
            <g>
                <path fill="#00B1FF" d="M5.304 32.101L13.363 24.042 15.643 26.322 7.583 34.381zM19.345 25.183L29.018 25.183 29.018 21.958 19.345 21.958zM34.411 22.331L45.692 12.655 47.791 15.102 36.511 24.777z" transform="translate(-672 -584) translate(672 583)"/>
                <g transform="translate(-672 -584) translate(672 583) translate(0 .502)">
                    <g transform="translate(1 39)">
                        <mask id="2vraqa7tjb" fill="#fff">
                            <use xlink:href="#ateazlntxa"/>
                        </mask>
                        <path fill="#1F6FE5" d="M42.526 3.413v48.363c0 .856-.339 1.675-.944 2.28-.605.605-1.424.945-2.28.945H3.836c-.856 0-1.675-.34-2.28-.945-.605-.605-.944-1.424-.944-2.28V14.422c.003-.856.342-1.674.944-2.28L12.564 1.134c.607-.603 1.425-.942 2.28-.945h24.458c.856 0 1.675.339 2.28.945.605.604.944 1.424.944 2.279" mask="url(#2vraqa7tjb)"/>
                    </g>
                    <path fill="#00B1FF" d="M14.509 39.48v9.382c0 .855-.34 1.675-.944 2.279-.605.606-1.425.944-2.281.944h-9.38c.16-.351.38-.671.653-.944l11.008-11.008c.272-.272.592-.493.944-.652"/>
                    <mask id="upcicpsaid" fill="#fff">
                        <use xlink:href="#vzmaau895c"/>
                    </mask>
                    <path fill="#00B1FF" d="M20.957 52.086L25.794 52.086 25.794 48.862 20.957 48.862zM32.242 60.146L37.078 60.146 37.078 56.921 32.242 56.921zM20.957 60.146L29.018 60.146 29.018 56.921 20.957 56.921zM8.061 60.146L17.734 60.146 17.734 56.921 8.061 56.921zM17.733 68.207L37.078 68.207 37.078 64.982 17.733 64.982zM8.061 68.207L14.509 68.207 14.509 64.982 8.061 64.982zM27.405 76.267L37.078 76.267 37.078 73.042 27.405 73.042zM8.061 76.267L24.182 76.267 24.182 73.042 8.061 73.042zM17.733 84.328L27.405 84.328 27.405 81.103 17.733 81.103zM8.061 84.328L14.509 84.328 14.509 81.103 8.061 81.103z" mask="url(#upcicpsaid)"/>
                    <path fill="#1F6FE5" d="M53.199 84.327L62.872 84.327 62.872 73.042 53.199 73.042z" mask="url(#upcicpsaid)"/>
                    <path fill="#00B1FF" d="M62.872 84.328L72.544 84.328 72.544 63.371 62.872 63.371z" mask="url(#upcicpsaid)"/>
                    <path fill="#00E0CC" d="M72.544 84.328L82.217 84.328 82.217 53.698 72.544 53.698z" mask="url(#upcicpsaid)"/>
                    <path fill="#C1F7F3" d="M82.217 84.328L91.89 84.328 91.89 44.025 82.217 44.025z" mask="url(#upcicpsaid)"/>
                </g>
                <g>
                    <path fill="#0E273B" d="M8.06 5.352c0 1.781-1.443 3.225-3.225 3.225-1.78 0-3.223-1.444-3.223-3.225 0-1.78 1.443-3.224 3.223-3.224 1.782 0 3.225 1.444 3.225 3.224" transform="translate(-672 -584) translate(672 583) translate(0 29.502)"/>
                    <g transform="translate(-672 -584) translate(672 583) translate(0 29.502)">
                        <mask id="yrjgems5ef" fill="#fff">
                            <use xlink:href="#u2cavhmfwe"/>
                        </mask>
                        <path fill="#E0EDFF" d="M4.836 3.74c-.651 0-1.24.394-1.49.996s-.111 1.296.35 1.757c.46.46 1.155.599 1.757.35.603-.25.995-.838.995-1.491-.001-.89-.721-1.61-1.612-1.611m0 6.448c-1.956 0-3.72-1.178-4.468-2.986-.748-1.806-.335-3.886 1.049-5.27C2.8.55 4.88.137 6.687.885c1.807.749 2.986 2.51 2.986 4.467-.004 2.67-2.166 4.834-4.837 4.837" mask="url(#yrjgems5ef)"/>
                    </g>
                </g>
                <g>
                    <path fill="#0E273B" d="M8.345 17.068c0 1.78-1.442 3.225-3.224 3.225-1.781 0-3.224-1.444-3.224-3.225 0-1.781 1.443-3.225 3.224-3.225 1.782 0 3.224 1.444 3.224 3.225" transform="translate(-672 -584) translate(672 583) translate(11 6.502)"/>
                    <path fill="#E0EDFF" d="M5.121 15.456c-.652 0-1.239.393-1.489.995-.25.603-.112 1.296.35 1.757.46.46 1.154.6 1.756.35.603-.25.995-.838.995-1.49 0-.89-.722-1.611-1.612-1.612m0 6.448c-1.956 0-3.72-1.178-4.468-2.985-.749-1.807-.335-3.887 1.048-5.271 1.384-1.382 3.464-1.796 5.271-1.047 1.806.748 2.985 2.51 2.985 4.467-.003 2.67-2.166 4.833-4.836 4.836" transform="translate(-672 -584) translate(672 583) translate(11 6.502)"/>
                    <path fill="#0E273B" d="M24.466 17.068c0 1.78-1.442 3.225-3.224 3.225-1.781 0-3.224-1.444-3.224-3.225 0-1.781 1.443-3.225 3.224-3.225 1.782 0 3.224 1.444 3.224 3.225" transform="translate(-672 -584) translate(672 583) translate(11 6.502)"/>
                    <path fill="#E0EDFF" d="M21.242 15.456c-.652 0-1.24.393-1.489.995-.25.603-.112 1.296.35 1.757.46.46 1.154.6 1.756.35.602-.25.994-.838.994-1.49 0-.89-.72-1.611-1.61-1.612m0 6.448c-1.958 0-3.72-1.178-4.469-2.985-.749-1.807-.335-3.887 1.048-5.271 1.384-1.382 3.464-1.796 5.27-1.047 1.807.748 2.986 2.51 2.986 4.467-.003 2.67-2.166 4.833-4.836 4.836" transform="translate(-672 -584) translate(672 583) translate(11 6.502)"/>
                    <path fill="#0E273B" d="M40.587 5.783c0 1.78-1.443 3.225-3.224 3.225-1.781 0-3.224-1.444-3.224-3.225 0-1.78 1.443-3.224 3.224-3.224 1.78 0 3.224 1.444 3.224 3.224" transform="translate(-672 -584) translate(672 583) translate(11 6.502)"/>
                    <path fill="#E0EDFF" d="M37.363 4.171c-.652 0-1.24.393-1.49.995-.249.602-.11 1.296.35 1.757.46.46 1.155.6 1.756.35.603-.25.995-.838.995-1.49 0-.89-.72-1.61-1.61-1.612m0 6.448c-1.958 0-3.72-1.178-4.47-2.986-.748-1.806-.334-3.886 1.05-5.27 1.383-1.382 3.463-1.796 5.27-1.048 1.806.75 2.985 2.511 2.985 4.467-.003 2.671-2.166 4.834-4.836 4.837" transform="translate(-672 -584) translate(672 583) translate(11 6.502)"/>
                </g>
                <g fill="#00E0CC">
                    <path d="M16.2 50.473H.077V47.25h15.453l16.535-16.536 2.28 2.281L17.34 50.001c-.303.302-.713.472-1.14.472" transform="translate(-672 -584) translate(672 583) translate(37 .502)"/>
                    <path d="M58.113 19.843c0 7.824-4.713 14.88-11.94 17.873-7.23 2.994-15.55 1.34-21.083-4.194-5.534-5.533-7.189-13.853-4.195-21.082C23.89 5.212 30.945.498 38.768.498c5.135-.015 10.066 2.02 13.696 5.65 3.63 3.631 5.665 8.56 5.65 13.695" transform="translate(-672 -584) translate(672 583) translate(37 .502)"/>
                </g>
                <g transform="translate(-672 -584) translate(672 583) translate(0 .502)">
                    <path fill="#00B1FF" d="M95.113 19.843H75.768V.498c5.13 0 10.051 2.038 13.68 5.667 3.627 3.627 5.665 8.548 5.665 13.678"/>
                    <path fill="#1F6FE5" d="M95.113 19.843c.007 5.528-2.358 10.793-6.494 14.46l-12.85-14.46h19.344zM37.078 48.862c0 1.78-1.443 3.224-3.225 3.224-1.78 0-3.223-1.444-3.223-3.224 0-1.781 1.443-3.225 3.223-3.225 1.782 0 3.225 1.444 3.225 3.225"/>
                    <path fill="#CFE2EB" d="M33.853 47.25c-.65 0-1.239.392-1.489.995-.248.602-.11 1.296.35 1.757.46.46 1.156.598 1.757.35.603-.25.995-.838.995-1.49-.002-.89-.721-1.611-1.613-1.613m0 6.448c-1.956 0-3.719-1.178-4.468-2.986-.748-1.805-.335-3.886 1.05-5.27 1.384-1.382 3.463-1.796 5.27-1.047 1.806.748 2.986 2.51 2.986 4.468-.004 2.67-2.166 4.832-4.838 4.835"/>
                    <mask id="yxsb72svnh" fill="#fff">
                        <use xlink:href="#ajkeayobpg"/>
                    </mask>
                    <path fill="#00B1FF" d="M37.078 85.94L96.725 85.94 96.725 82.715 37.078 82.715z" mask="url(#yxsb72svnh)"/>
                    <path fill="#1F6FE5" d="M38.69 84.328c0 1.78-1.443 3.224-3.225 3.224-1.78 0-3.223-1.443-3.223-3.224 0-1.781 1.442-3.225 3.223-3.225 1.782 0 3.225 1.444 3.225 3.225" mask="url(#yxsb72svnh)"/>
                    <path fill="#CFE2EB" d="M35.466 82.715c-.651 0-1.24.393-1.49.995-.25.603-.111 1.296.35 1.757.46.461 1.155.6 1.757.35.603-.25.995-.838.995-1.49-.001-.889-.722-1.61-1.612-1.612m0 6.448c-1.956 0-3.72-1.178-4.468-2.985-.748-1.807-.335-3.887 1.049-5.27 1.383-1.383 3.463-1.797 5.27-1.048 1.807.748 2.986 2.511 2.986 4.467-.004 2.67-2.167 4.833-4.837 4.836" mask="url(#yxsb72svnh)"/>
                </g>
            </g>
        </g>
    </g>
</svg>
