<svg xmlns="http://www.w3.org/2000/svg" width="42" height="58" viewBox="0 0 42 58">
    <g fill="none" fill-rule="evenodd">
        <g fill-rule="nonzero">
            <g>
                <path fill="#00E0CC" d="M32.522 0H1.712C.766 0 0 .76 0 1.7v37.495c0 .939.766 1.7 1.712 1.7h10.52c-2.784 6.184-.015 11.172 3.332 16.156.051.05.47.949 1.553.949h18.829c.786 0 1.472-.532 1.661-1.29l4.136-16.535c.77-3.058-.218-6.267-2.578-8.376l-4.93-4.405V1.699C34.234.761 33.467 0 32.521 0zM3.423 3.398h27.388v34.098h-6.107c-.487-1.31-.74-2.699-.74-4.116v-4.43c0-2.788-2.272-5.048-5.101-5.048h-.086c-2.803 0-5.082 2.265-5.082 5.047v6.237c0 .748-.088 1.52-.26 2.31H3.424V3.398zm33.452 30.927c1.416 1.265 2.009 3.191 1.546 5.028l-3.814 15.249H18.036c-2.835-4.283-4.718-7.993-2.596-12.504 1.023-2.173 1.677-4.532 1.677-6.912v-6.237c0-.909.745-1.648 1.66-1.648h.086c.941 0 1.677.744 1.677 1.648v4.431c0 3.03.895 5.963 2.588 8.483l1.123 1.673c.525.781 1.588.992 2.374.472.787-.52 1-1.576.475-2.357l-.508-.756h5.93c.946 0 1.712-.761 1.712-1.7v-7.23l2.641 2.36z" transform="translate(-145 -1141) translate(145 1141)"/>
                <path fill="#1F6FE5" d="M14.462 18.515c.324.323.749.485 1.173.485.424 0 .85-.162 1.173-.485l7.706-7.69c.648-.646.648-1.694 0-2.34-.648-.647-1.698-.647-2.346 0l-6.533 6.519-3.803-3.795c-.648-.646-1.698-.646-2.346 0-.648.646-.648 1.694 0 2.34l4.976 4.966z" transform="translate(-145 -1141) translate(145 1141)"/>
            </g>
        </g>
    </g>
</svg>
