<?xml version="1.0" encoding="UTF-8"?>
<svg width="219px" height="81px" viewBox="0 0 219 81" version="1.1" xmlns="http://www.w3.org/2000/svg" xmlns:xlink="http://www.w3.org/1999/xlink">
    <!-- Generator: Sketch 62 (91390) - https://sketch.com -->
    <title>End Date Copy</title>
    <desc>Created with Sketch.</desc>
    <g id="Page-1" stroke="none" stroke-width="1" fill="none" fill-rule="evenodd">
        <g id="how-it-works" transform="translate(-248.000000, -2284.000000)">
            <g id="Group-11" transform="translate(145.000000, 1610.000000)">
                <g id="Group-5" transform="translate(0.000000, 614.000000)">
                    <g id="End-Date-Copy" transform="translate(104.000000, 60.000000)">
                        <rect id="Rectangle" stroke="#00E0CC" x="0" y="8" width="217" height="72" rx="1"></rect>
                        <rect id="Rectangle" fill="#0E273B" x="12" y="4" width="113" height="10"></rect>
                        <path d="M21.008,12 L21.008,7.616 L23.534,7.616 L26.416,12 L27.936,12 L24.927,7.404 L24.9489444,7.3985 C25.3998333,7.2885 25.7980556,7.1125 26.1436111,6.8705 L26.312,6.744 C26.968,6.216 27.296,5.47733333 27.296,4.528 C27.296,3.57866667 26.9706667,2.82666667 26.32,2.272 C25.6693333,1.71733333 24.8053333,1.44 23.728,1.44 L23.728,1.44 L19.728,1.44 L19.728,12 L21.008,12 Z M23.712,6.416 L21.008,6.416 L21.008,2.64 L23.712,2.64 C24.4693333,2.64 25.032,2.79733333 25.4,3.112 C25.768,3.42666667 25.952,3.89866667 25.952,4.528 C25.952,5.15733333 25.768,5.62933333 25.4,5.944 C25.032,6.25866667 24.4693333,6.416 23.712,6.416 L23.712,6.416 Z M33.4245617,12.16 C33.9472284,12.16 34.4192284,12.088 34.8405617,11.944 C35.261895,11.8 35.629895,11.5946667 35.9445617,11.328 C36.2592284,11.0613333 36.517895,10.7466667 36.7205617,10.384 L36.7205617,10.384 L35.7125617,9.792 C35.4885617,10.176 35.1925617,10.48 34.8245617,10.704 C34.4565617,10.928 33.9792284,11.04 33.3925617,11.04 C32.8485617,11.04 32.381895,10.92 31.9925617,10.68 C31.6032284,10.44 31.301895,10.0906667 31.0885617,9.632 C30.9361807,9.30438095 30.8382215,8.93322449 30.7946841,8.51853061 L30.783,8.368 L36.8165617,8.368 C36.8307839,8.28977778 36.8426358,8.20444444 36.8521172,8.112 L36.8645617,7.968 C36.8752284,7.81866667 36.8805617,7.65333333 36.8805617,7.472 C36.8805617,6.78933333 36.741895,6.17333333 36.4645617,5.624 C36.1872284,5.07466667 35.7845617,4.64 35.2565617,4.32 C34.7285617,4 34.0912284,3.84 33.3445617,3.84 C32.6085617,3.84 31.9525617,4.00533333 31.3765617,4.336 C30.8005617,4.66666667 30.3472284,5.144 30.0165617,5.768 C29.685895,6.392 29.5205617,7.136 29.5205617,8 C29.5205617,8.864 29.685895,9.608 30.0165617,10.232 C30.3472284,10.856 30.8085617,11.3333333 31.4005617,11.664 C31.9925617,11.9946667 32.6672284,12.16 33.4245617,12.16 Z M35.597,7.232 L30.825,7.232 C30.8637826,6.98971429 30.921378,6.76571429 30.9977862,6.56 L31.0805617,6.36 C31.2885617,5.90666667 31.581895,5.56 31.9605617,5.32 C32.3392284,5.08 32.789895,4.96 33.3125617,4.96 C33.9952284,4.96 34.5472284,5.168 34.9685617,5.584 C35.389895,6 35.6005617,6.592 35.6005617,7.36 L35.597,7.232 Z M42.3531234,12 L44.4811234,5.632 L46.7371234,12 L48.0171234,12 L50.8011234,4 L49.3771234,4 L47.3611234,10.512 L45.1851234,4 L43.9051234,4 L41.7291234,10.512 L39.7131234,4 L38.2891234,4 L41.0731234,12 L42.3531234,12 Z M54.8976851,12.16 C55.2710184,12.16 55.6496851,12.0986667 56.0336851,11.976 C56.4176851,11.8533333 56.7643517,11.6613333 57.0736851,11.4 C57.2062565,11.288 57.3221748,11.1617959 57.4214402,11.0213878 L57.456,10.968 L57.4616851,10.994 C57.4847962,11.0944444 57.515611,11.1880741 57.5541295,11.2748889 L57.6176851,11.4 C57.7563517,11.64 57.9483517,11.8186667 58.1936851,11.936 C58.4390184,12.0533333 58.7163517,12.112 59.0256851,12.112 C59.3670184,12.112 59.6443517,12.0586667 59.8576851,11.952 L59.8576851,11.952 L59.9216851,10.944 C59.7296851,10.9973333 59.5323517,11.024 59.3296851,11.024 C58.9243517,11.024 58.7216851,10.832 58.7216851,10.448 L58.7216851,10.448 L58.7216851,6.576 C58.7216851,5.94666667 58.5856851,5.432 58.3136851,5.032 C58.0416851,4.632 57.6710184,4.33333333 57.2016851,4.136 C56.7323517,3.93866667 56.2096851,3.84 55.6336851,3.84 C54.7803517,3.84 54.0656851,4.024 53.4896851,4.392 C52.9136851,4.76 52.5190184,5.24266667 52.3056851,5.84 L52.3056851,5.84 L53.3456851,6.48 C53.5270184,5.94666667 53.8096851,5.56 54.1936851,5.32 C54.5776851,5.08 55.0470184,4.96 55.6016851,4.96 C56.1883517,4.96 56.6416851,5.12266667 56.9616851,5.448 C57.2816851,5.77333333 57.4416851,6.23466667 57.4416851,6.832 L57.4416851,6.832 L57.441,7.138 L54.5296851,7.712 C53.8944258,7.83525926 53.3834793,8.05754733 52.9968455,8.3788642 L52.8576851,8.504 C52.4576851,8.89333333 52.2576851,9.38666667 52.2576851,9.984 C52.2576851,10.464 52.3776851,10.8666667 52.6176851,11.192 C52.8576851,11.5173333 53.1803517,11.76 53.5856851,11.92 C53.9910184,12.08 54.4283517,12.16 54.8976851,12.16 Z M55.0736851,11.04 C54.5936851,11.04 54.2230184,10.936 53.9616851,10.728 C53.7003517,10.52 53.5696851,10.2506667 53.5696851,9.92 C53.5696851,9.57866667 53.6976851,9.312 53.9536851,9.12 C54.2096851,8.928 54.5990184,8.77866667 55.1216851,8.672 L55.1216851,8.672 L57.441,8.196 L57.4416851,9.04 C57.4416851,9.31306667 57.4007251,9.55712 57.3188051,9.77216 L57.2496851,9.928 C57.1216851,10.1786667 56.9456851,10.3866667 56.7216851,10.552 C56.4976851,10.7173333 56.2443517,10.84 55.9616851,10.92 C55.6790184,11 55.3830184,11.04 55.0736851,11.04 Z M63.3302467,12 L63.3302467,7.68 C63.3302467,7.08266667 63.4422467,6.58933333 63.6662467,6.2 C63.8902467,5.81066667 64.1702467,5.52 64.5062467,5.328 C64.8422467,5.136 65.1755801,5.04 65.5062467,5.04 C65.7622467,5.04 65.9595801,5.05066667 66.0982467,5.072 C66.2369134,5.09333333 66.3649134,5.12533333 66.4822467,5.168 L66.4822467,5.168 L66.7062467,4 C66.5889134,3.936 66.4475801,3.89333333 66.2822467,3.872 C66.1169134,3.85066667 65.9649134,3.84 65.8262467,3.84 C65.2075801,3.84 64.6822467,3.96266667 64.2502467,4.208 C63.8182467,4.45333333 63.4902467,4.82133333 63.2662467,5.312 L63.2662467,5.312 L63.0902467,4 L62.0502467,4 L62.0502467,12 L63.3302467,12 Z M71.6668084,12.16 C72.1254751,12.16 72.5601418,12.0746667 72.9708084,11.904 C73.3814751,11.7333333 73.7281418,11.4853333 74.0108084,11.16 C74.1723322,10.9740952 74.2998969,10.7646803 74.3935023,10.5317551 L74.397,10.522 L74.4828084,12 L75.6028084,12 L75.6028084,0.32 L74.3228084,0.32 L74.322,5.292 L74.2685862,5.184 C74.1194504,4.91140741 73.9201088,4.67338272 73.6705615,4.46992593 L73.5148084,4.352 C73.0294751,4.01066667 72.4561418,3.84 71.7948084,3.84 C71.1334751,3.84 70.5148084,4.00266667 69.9388084,4.328 C69.3628084,4.65333333 68.8988084,5.12533333 68.5468084,5.744 C68.1948084,6.36266667 68.0188084,7.11466667 68.0188084,8 C68.0188084,8.864 68.1841418,9.608 68.5148084,10.232 C68.8454751,10.856 69.2881418,11.3333333 69.8428084,11.664 C70.3974751,11.9946667 71.0054751,12.16 71.6668084,12.16 Z M71.7948084,11.04 C71.0054751,11.04 70.3921418,10.7626667 69.9548084,10.208 C69.5174751,9.65333333 69.2988084,8.91733333 69.2988084,8 C69.2988084,7.08266667 69.5228084,6.34666667 69.9708084,5.792 C70.4188084,5.23733333 71.0481418,4.96 71.8588084,4.96 C72.3494751,4.96 72.7788084,5.07733333 73.1468084,5.312 C73.5148084,5.54666667 73.8028084,5.88266667 74.0108084,6.32 C74.2188084,6.75733333 74.3228084,7.28 74.3228084,7.888 C74.3228084,8.528 74.2188084,9.08533333 74.0108084,9.56 C73.8028084,10.0346667 73.5094751,10.4 73.1308084,10.656 C72.7521418,10.912 72.3068084,11.04 71.7948084,11.04 Z M86.0039318,12 L86.0039318,7.872 L88.4519318,7.872 C89.1665985,7.872 89.7879318,7.74133333 90.3159318,7.48 C90.8439318,7.21866667 91.2572651,6.848 91.5559318,6.368 C91.8545985,5.888 92.0039318,5.31733333 92.0039318,4.656 C92.0039318,3.99466667 91.8545985,3.424 91.5559318,2.944 C91.2572651,2.464 90.8439318,2.09333333 90.3159318,1.832 C89.7879318,1.57066667 89.1665985,1.44 88.4519318,1.44 L88.4519318,1.44 L84.7239318,1.44 L84.7239318,12 L86.0039318,12 Z M88.2599318,6.672 L86.0039318,6.672 L86.0039318,2.64 L88.2599318,2.64 C89.0919318,2.64 89.6999318,2.81066667 90.0839318,3.152 C90.4679318,3.49333333 90.6599318,3.99466667 90.6599318,4.656 C90.6599318,5.30666667 90.4679318,5.80533333 90.0839318,6.152 C89.6999318,6.49866667 89.0919318,6.672 88.2599318,6.672 L88.2599318,6.672 Z M97.6364935,12.16 C98.3938268,12.16 99.0631601,11.9946667 99.6444935,11.664 C100.225827,11.3333333 100.681827,10.856 101.012493,10.232 C101.34316,9.608 101.508493,8.864 101.508493,8 C101.508493,7.136 101.34316,6.392 101.012493,5.768 C100.681827,5.144 100.225827,4.66666667 99.6444935,4.336 C99.0631601,4.00533333 98.3938268,3.84 97.6364935,3.84 C96.8898268,3.84 96.2231601,4.00533333 95.6364935,4.336 C95.0498268,4.66666667 94.5911601,5.144 94.2604935,5.768 C93.9298268,6.392 93.7644935,7.136 93.7644935,8 C93.7644935,8.864 93.9298268,9.608 94.2604935,10.232 C94.5911601,10.856 95.0498268,11.3333333 95.6364935,11.664 C96.2231601,11.9946667 96.8898268,12.16 97.6364935,12.16 Z M97.6364935,11.056 C97.0924935,11.056 96.6284935,10.9333333 96.2444935,10.688 C95.8604935,10.4426667 95.5644935,10.0906667 95.3564935,9.632 C95.1484935,9.17333333 95.0444935,8.62933333 95.0444935,8 C95.0444935,7.36 95.1484935,6.81333333 95.3564935,6.36 C95.5644935,5.90666667 95.8604935,5.55733333 96.2444935,5.312 C96.6284935,5.06666667 97.0924935,4.944 97.6364935,4.944 C98.1804935,4.944 98.6444935,5.06666667 99.0284935,5.312 C99.4124935,5.55733333 99.7084935,5.90666667 99.9164935,6.36 C100.124493,6.81333333 100.228493,7.36 100.228493,8 C100.228493,8.62933333 100.124493,9.17333333 99.9164935,9.632 C99.7084935,10.0906667 99.4124935,10.4426667 99.0284935,10.688 C98.6444935,10.9333333 98.1804935,11.056 97.6364935,11.056 Z M107.461055,12.16 C108.218388,12.16 108.887722,11.9946667 109.469055,11.664 C110.050388,11.3333333 110.506388,10.856 110.837055,10.232 C111.167722,9.608 111.333055,8.864 111.333055,8 C111.333055,7.136 111.167722,6.392 110.837055,5.768 C110.506388,5.144 110.050388,4.66666667 109.469055,4.336 C108.887722,4.00533333 108.218388,3.84 107.461055,3.84 C106.714388,3.84 106.047722,4.00533333 105.461055,4.336 C104.874388,4.66666667 104.415722,5.144 104.085055,5.768 C103.754388,6.392 103.589055,7.136 103.589055,8 C103.589055,8.864 103.754388,9.608 104.085055,10.232 C104.415722,10.856 104.874388,11.3333333 105.461055,11.664 C106.047722,11.9946667 106.714388,12.16 107.461055,12.16 Z M107.461055,11.056 C106.917055,11.056 106.453055,10.9333333 106.069055,10.688 C105.685055,10.4426667 105.389055,10.0906667 105.181055,9.632 C104.973055,9.17333333 104.869055,8.62933333 104.869055,8 C104.869055,7.36 104.973055,6.81333333 105.181055,6.36 C105.389055,5.90666667 105.685055,5.55733333 106.069055,5.312 C106.453055,5.06666667 106.917055,4.944 107.461055,4.944 C108.005055,4.944 108.469055,5.06666667 108.853055,5.312 C109.237055,5.55733333 109.533055,5.90666667 109.741055,6.36 C109.949055,6.81333333 110.053055,7.36 110.053055,8 C110.053055,8.62933333 109.949055,9.17333333 109.741055,9.632 C109.533055,10.0906667 109.237055,10.4426667 108.853055,10.688 C108.469055,10.9333333 108.005055,11.056 107.461055,11.056 Z M115.829617,12.16 C116.04295,12.16 116.25095,12.1413333 116.453617,12.104 C116.656284,12.0666667 116.84295,12.0106667 117.013617,11.936 L117.013617,11.936 L117.221617,10.816 C116.98695,10.9013333 116.800284,10.96 116.661617,10.992 C116.52295,11.024 116.34695,11.04 116.133617,11.04 C115.80295,11.04 115.56295,10.9626667 115.413617,10.808 C115.264284,10.6533333 115.189617,10.3733333 115.189617,9.968 L115.189617,9.968 L115.189617,0.32 L113.909617,0.32 L113.909617,10.016 C113.909617,10.7413333 114.06695,11.28 114.381617,11.632 C114.696284,11.984 115.17895,12.16 115.829617,12.16 Z" id="RewardPool" fill="#00E0CC" fill-rule="nonzero"></path>
                        <path d="M27.45,53 L27.45,36.5 L26.325,36.5 C26.1083333,36.8833333 25.8083333,37.25 25.425,37.6 C25.0416667,37.95 24.6208333,38.275 24.1625,38.575 C23.7041667,38.875 23.25,39.1291667 22.8,39.3375 C22.35,39.5458333 21.9416667,39.7 21.575,39.8 L21.575,39.8 L21.9,40.925 C22.7166667,40.7083333 23.5083333,40.3625 24.275,39.8875 C25.0416667,39.4125 25.6916667,38.8416667 26.225,38.175 C26.225,38.475 26.2208333,38.7708333 26.2125,39.0625 C26.2041667,39.3541667 26.2,39.6416667 26.2,39.925 L26.2,39.925 L26.2,53 L27.45,53 Z M37.8258776,53.25 C39.709211,53.25 41.1800443,52.5208333 42.2383776,51.0625 C43.296711,49.6041667 43.8258776,47.5 43.8258776,44.75 C43.8258776,42 43.296711,39.8958333 42.2383776,38.4375 C41.1800443,36.9791667 39.709211,36.25 37.8258776,36.25 C35.9425443,36.25 34.4675443,36.9791667 33.4008776,38.4375 C32.334211,39.8958333 31.8008776,42 31.8008776,44.75 C31.8008776,47.5 32.334211,49.6041667 33.4008776,51.0625 C34.4675443,52.5208333 35.9425443,53.25 37.8258776,53.25 Z M37.8258776,52.125 C36.809211,52.125 35.946711,51.8458333 35.2383776,51.2875 C34.5300443,50.7291667 33.9925443,49.8958333 33.6258776,48.7875 C33.259211,47.6791667 33.0758776,46.3333333 33.0758776,44.75 C33.0758776,43.15 33.259211,41.8 33.6258776,40.7 C33.9925443,39.6 34.5300443,38.7708333 35.2383776,38.2125 C35.946711,37.6541667 36.809211,37.375 37.8258776,37.375 C38.8425443,37.375 39.7008776,37.6541667 40.4008776,38.2125 C41.1008776,38.7708333 41.634211,39.6 42.0008776,40.7 C42.3675443,41.8 42.5508776,43.15 42.5508776,44.75 C42.5508776,46.35 42.3675443,47.7 42.0008776,48.8 C41.634211,49.9 41.1008776,50.7291667 40.4008776,51.2875 C39.7008776,51.8458333 38.8425443,52.125 37.8258776,52.125 Z M53.3517553,53.25 C55.2350886,53.25 56.7059219,52.5208333 57.7642553,51.0625 C58.8225886,49.6041667 59.3517553,47.5 59.3517553,44.75 C59.3517553,42 58.8225886,39.8958333 57.7642553,38.4375 C56.7059219,36.9791667 55.2350886,36.25 53.3517553,36.25 C51.4684219,36.25 49.9934219,36.9791667 48.9267553,38.4375 C47.8600886,39.8958333 47.3267553,42 47.3267553,44.75 C47.3267553,47.5 47.8600886,49.6041667 48.9267553,51.0625 C49.9934219,52.5208333 51.4684219,53.25 53.3517553,53.25 Z M53.3517553,52.125 C52.3350886,52.125 51.4725886,51.8458333 50.7642553,51.2875 C50.0559219,50.7291667 49.5184219,49.8958333 49.1517553,48.7875 C48.7850886,47.6791667 48.6017553,46.3333333 48.6017553,44.75 C48.6017553,43.15 48.7850886,41.8 49.1517553,40.7 C49.5184219,39.6 50.0559219,38.7708333 50.7642553,38.2125 C51.4725886,37.6541667 52.3350886,37.375 53.3517553,37.375 C54.3684219,37.375 55.2267553,37.6541667 55.9267553,38.2125 C56.6267553,38.7708333 57.1600886,39.6 57.5267553,40.7 C57.8934219,41.8 58.0767553,43.15 58.0767553,44.75 C58.0767553,46.35 57.8934219,47.7 57.5267553,48.8 C57.1600886,49.9 56.6267553,50.7291667 55.9267553,51.2875 C55.2267553,51.8458333 54.3684219,52.125 53.3517553,52.125 Z M62.7276329,56.2 C63.2276329,55.95 63.6359662,55.6416667 63.9526329,55.275 C64.2692996,54.9083333 64.5026329,54.5083333 64.6526329,54.075 C64.8026329,53.6416667 64.8776329,53.2083333 64.8776329,52.775 C64.8776329,52.4083333 64.8234662,52.0916667 64.7151329,51.825 C64.6067996,51.5583333 64.4484662,51.3458333 64.2401329,51.1875 C64.0317996,51.0291667 63.7859662,50.95 63.5026329,50.95 C63.2859662,50.95 63.0942996,51 62.9276329,51.1 C62.7609662,51.2 62.6234662,51.3375 62.5151329,51.5125 C62.4067996,51.6875 62.3526329,51.8833333 62.3526329,52.1 C62.3526329,52.3333333 62.4026329,52.5291667 62.5026329,52.6875 C62.6026329,52.8458333 62.7276329,52.9708333 62.8776329,53.0625 C63.0276329,53.1541667 63.1776329,53.2 63.3276329,53.2 C63.4942996,53.2 63.6192996,53.1791667 63.7026329,53.1375 C63.7859662,53.0958333 63.8526329,53.0333333 63.9026329,52.95 L63.9026329,52.95 L63.9776329,52.975 C63.9942996,53.2916667 63.9234662,53.6208333 63.7651329,53.9625 C63.6067996,54.3041667 63.3817996,54.6208333 63.0901329,54.9125 C62.7984662,55.2041667 62.4442996,55.425 62.0276329,55.575 L62.0276329,55.575 L62.7276329,56.2 Z M73.6285105,53.25 C75.5118439,53.25 76.9826772,52.5208333 78.0410105,51.0625 C79.0993439,49.6041667 79.6285105,47.5 79.6285105,44.75 C79.6285105,42 79.0993439,39.8958333 78.0410105,38.4375 C76.9826772,36.9791667 75.5118439,36.25 73.6285105,36.25 C71.7451772,36.25 70.2701772,36.9791667 69.2035105,38.4375 C68.1368439,39.8958333 67.6035105,42 67.6035105,44.75 C67.6035105,47.5 68.1368439,49.6041667 69.2035105,51.0625 C70.2701772,52.5208333 71.7451772,53.25 73.6285105,53.25 Z M73.6285105,52.125 C72.6118439,52.125 71.7493439,51.8458333 71.0410105,51.2875 C70.3326772,50.7291667 69.7951772,49.8958333 69.4285105,48.7875 C69.0618439,47.6791667 68.8785105,46.3333333 68.8785105,44.75 C68.8785105,43.15 69.0618439,41.8 69.4285105,40.7 C69.7951772,39.6 70.3326772,38.7708333 71.0410105,38.2125 C71.7493439,37.6541667 72.6118439,37.375 73.6285105,37.375 C74.6451772,37.375 75.5035105,37.6541667 76.2035105,38.2125 C76.9035105,38.7708333 77.4368439,39.6 77.8035105,40.7 C78.1701772,41.8 78.3535105,43.15 78.3535105,44.75 C78.3535105,46.35 78.1701772,47.7 77.8035105,48.8 C77.4368439,49.9 76.9035105,50.7291667 76.2035105,51.2875 C75.5035105,51.8458333 74.6451772,52.125 73.6285105,52.125 Z M89.1543882,53.25 C91.0377215,53.25 92.5085548,52.5208333 93.5668882,51.0625 C94.6252215,49.6041667 95.1543882,47.5 95.1543882,44.75 C95.1543882,42 94.6252215,39.8958333 93.5668882,38.4375 C92.5085548,36.9791667 91.0377215,36.25 89.1543882,36.25 C87.2710548,36.25 85.7960548,36.9791667 84.7293882,38.4375 C83.6627215,39.8958333 83.1293882,42 83.1293882,44.75 C83.1293882,47.5 83.6627215,49.6041667 84.7293882,51.0625 C85.7960548,52.5208333 87.2710548,53.25 89.1543882,53.25 Z M89.1543882,52.125 C88.1377215,52.125 87.2752215,51.8458333 86.5668882,51.2875 C85.8585548,50.7291667 85.3210548,49.8958333 84.9543882,48.7875 C84.5877215,47.6791667 84.4043882,46.3333333 84.4043882,44.75 C84.4043882,43.15 84.5877215,41.8 84.9543882,40.7 C85.3210548,39.6 85.8585548,38.7708333 86.5668882,38.2125 C87.2752215,37.6541667 88.1377215,37.375 89.1543882,37.375 C90.1710548,37.375 91.0293882,37.6541667 91.7293882,38.2125 C92.4293882,38.7708333 92.9627215,39.6 93.3293882,40.7 C93.6960548,41.8 93.8793882,43.15 93.8793882,44.75 C93.8793882,46.35 93.6960548,47.7 93.3293882,48.8 C92.9627215,49.9 92.4293882,50.7291667 91.7293882,51.2875 C91.0293882,51.8458333 90.1710548,52.125 89.1543882,52.125 Z M104.680266,53.25 C106.563599,53.25 108.034432,52.5208333 109.092766,51.0625 C110.151099,49.6041667 110.680266,47.5 110.680266,44.75 C110.680266,42 110.151099,39.8958333 109.092766,38.4375 C108.034432,36.9791667 106.563599,36.25 104.680266,36.25 C102.796932,36.25 101.321932,36.9791667 100.255266,38.4375 C99.1885991,39.8958333 98.6552658,42 98.6552658,44.75 C98.6552658,47.5 99.1885991,49.6041667 100.255266,51.0625 C101.321932,52.5208333 102.796932,53.25 104.680266,53.25 Z M104.680266,52.125 C103.663599,52.125 102.801099,51.8458333 102.092766,51.2875 C101.384432,50.7291667 100.846932,49.8958333 100.480266,48.7875 C100.113599,47.6791667 99.9302658,46.3333333 99.9302658,44.75 C99.9302658,43.15 100.113599,41.8 100.480266,40.7 C100.846932,39.6 101.384432,38.7708333 102.092766,38.2125 C102.801099,37.6541667 103.663599,37.375 104.680266,37.375 C105.696932,37.375 106.555266,37.6541667 107.255266,38.2125 C107.955266,38.7708333 108.488599,39.6 108.855266,40.7 C109.221932,41.8 109.405266,43.15 109.405266,44.75 C109.405266,46.35 109.221932,47.7 108.855266,48.8 C108.488599,49.9 107.955266,50.7291667 107.255266,51.2875 C106.555266,51.8458333 105.696932,52.125 104.680266,52.125 Z M128.982021,55.5 L128.982,52.965 L129.288811,52.9472222 C130.024614,52.8916667 130.697453,52.7527778 131.30733,52.5305556 L131.607021,52.4125 C132.490354,52.0375 133.182021,51.5166667 133.682021,50.85 C134.182021,50.1833333 134.432021,49.4 134.432021,48.5 C134.432021,47.5 134.115354,46.6791667 133.482021,46.0375 C132.848688,45.3958333 131.790354,44.9166667 130.307021,44.6 L130.307021,44.6 L128.982,44.308 L128.982,37.641 L129.137083,37.6567149 C129.830816,37.744938 130.455368,37.9360882 131.01074,38.2301653 L131.244521,38.3625 C132.086188,38.8708333 132.740354,39.6916667 133.207021,40.825 L133.207021,40.825 L134.207021,40.05 C133.673688,38.8333333 132.911188,37.9333333 131.919521,37.35 C131.093132,36.8638889 130.130748,36.5803241 129.032368,36.4993056 L128.982,36.497 L128.982021,34 L127.907021,34 L127.907,36.487 L127.658021,36.5005 C126.867021,36.56 126.161771,36.723625 125.542271,36.991375 L125.282021,37.1125 C124.432021,37.5375 123.773688,38.0916667 123.307021,38.775 C122.840354,39.4583333 122.607021,40.2083333 122.607021,41.025 C122.607021,41.6916667 122.744521,42.2916667 123.019521,42.825 C123.294521,43.3583333 123.736188,43.8125 124.344521,44.1875 C124.952854,44.5625 125.748688,44.8583333 126.732021,45.075 L126.732021,45.075 L127.907,45.331 L127.907,51.821 L127.609169,51.7902344 C127.180524,51.7371094 126.771669,51.6485677 126.382607,51.5246094 L126.094521,51.425 C125.336188,51.1416667 124.698688,50.7375 124.182021,50.2125 C123.665354,49.6875 123.290354,49.0416667 123.057021,48.275 L123.057021,48.275 L121.982021,49.1 C122.282021,49.9 122.740354,50.5916667 123.357021,51.175 C123.973688,51.7583333 124.719521,52.2041667 125.594521,52.5125 C126.250771,52.74375 126.965615,52.8882813 127.739052,52.9460938 L127.907,52.956 L127.907021,55.5 L128.982021,55.5 Z M127.907,44.071 L127.132021,43.9 C126.315354,43.7166667 125.669521,43.4875 125.194521,43.2125 C124.719521,42.9375 124.382021,42.6083333 124.182021,42.225 C123.982021,41.8416667 123.882021,41.4 123.882021,40.9 C123.882021,40.2833333 124.048688,39.725 124.382021,39.225 C124.715354,38.725 125.207021,38.3291667 125.857021,38.0375 C126.507021,37.7458333 127.290354,37.6 128.207021,37.6 L127.907,37.606 L127.907,44.071 Z M128.982,51.843 L128.982,45.566 L130.057021,45.8 C131.09591,46.0138889 131.854706,46.3293113 132.33341,46.7462674 L132.457021,46.8625 C132.923688,47.3375 133.157021,47.9166667 133.157021,48.6 C133.157021,49.65 132.740354,50.4541667 131.907021,51.0125 C131.201893,51.4849359 130.305838,51.7574951 129.218855,51.8301775 L128.982,51.843 Z M140.032899,53 L140.032899,45.2 L147.957899,45.2 L147.957899,44.025 L140.032899,44.025 L140.032899,37.65 L150.032899,37.65 L150.032899,36.5 L138.782899,36.5 L138.782899,53 L140.032899,53 Z M159.558776,53 L165.908776,36.5 L164.583776,36.5 L159.683776,49.275 L158.808776,51.825 L157.933776,49.275 L153.058776,36.5 L151.708776,36.5 L158.083776,53 L159.558776,53 Z M174.659654,53 L174.659654,37.65 L180.684654,37.65 L180.684654,36.5 L167.384654,36.5 L167.384654,37.65 L173.409654,37.65 L173.409654,53 L174.659654,53 Z" id="100,000$FVT" fill="#FFFFFF" fill-rule="nonzero"></path>
                    </g>
                </g>
            </g>
        </g>
    </g>
</svg>