<svg xmlns="http://www.w3.org/2000/svg" xmlns:xlink="http://www.w3.org/1999/xlink" width="171" height="24" viewBox="0 0 171 24">
    <defs>
        <path id="fs0iwp14ja" d="M0 0L7.656 0 7.656 17.723 0 17.723z"/>
        <path id="4xpc7lckyc" d="M0 18L129.999 18 129.999 0 0 0z"/>
    </defs>
    <g fill="none" fill-rule="evenodd">
        <g>
            <g>
                <g>
                    <g>
                        <path fill="#00E0CC" d="M0 6.786L6.786 6.786 6.786 0 0 0zM8.482 6.786L15.268 6.786 15.268 0 8.482 0z" transform="translate(-145 -37) translate(145 37)"/>
                        <path fill="#00CFFF" d="M0 15.268L6.786 15.268 6.786 8.482 0 8.482zM8.482 15.268L15.268 15.268 15.268 8.482 8.482 8.482z" transform="translate(-145 -37) translate(145 37)"/>
                        <path fill="#1F6FE5" d="M0 23.75L6.786 23.75 6.786 16.964 0 16.964z" transform="translate(-145 -37) translate(145 37)"/>
                        <path fill="#00E0CC" d="M16.964 6.786L23.75 6.786 23.75 0 16.964 0z" transform="translate(-145 -37) translate(145 37)"/>
                    </g>
                    <g transform="translate(-145 -37) translate(145 37) translate(34 3)">
                        <g>
                            <mask id="2y11floh4b" fill="#fff">
                                <use xlink:href="#fs0iwp14ja"/>
                            </mask>
                            <path fill="#CFE2EB" d="M2.36 8.585H0v-1.8h2.36V4.339c0-1.461.28-2.55.844-3.266C3.767.358 4.734 0 6.107 0c.231 0 .474.008.729.023.254.016.528.062.82.139l-.23 1.846c-.201-.077-.394-.13-.58-.162-.184-.03-.385-.046-.6-.046-.386 0-.695.058-.926.173-.231.116-.412.281-.543.497-.131.215-.216.472-.254.773-.04.3-.058.642-.058 1.026v2.516h2.474v1.8H4.442v9.138H2.36V8.585z" mask="url(#2y11floh4b)"/>
                        </g>
                        <mask id="8is2u5ylqd" fill="#fff">
                            <use xlink:href="#4xpc7lckyc"/>
                        </mask>
                        <path fill="#CFE2EB" d="M9.669 17.723L11.75 17.723 11.75 6.785 9.669 6.785z" mask="url(#8is2u5ylqd)"/>
                        <path fill="#00CFFF" d="M9.669 4.659L11.75 4.659 11.75 2.582 9.669 2.582zM78.981 17.928L81.757 17.928 81.757 15.159 78.981 15.159z" mask="url(#8is2u5ylqd)"/>
                        <path fill="#CFE2EB" d="M15.313 6.785h2.082v1.684h.046c.262-.584.717-1.057 1.365-1.419.647-.361 1.395-.542 2.243-.542.524 0 1.03.08 1.516.242.486.162.91.412 1.272.75.362.339.65.774.867 1.304.216.53.324 1.158.324 1.88v7.04h-2.082v-6.462c0-.508-.069-.942-.208-1.304-.139-.361-.324-.654-.555-.877-.231-.223-.498-.384-.798-.485-.3-.1-.613-.15-.937-.15-.432 0-.833.07-1.203.208-.37.139-.694.358-.972.658-.277.3-.493.68-.647 1.142-.154.462-.231 1.008-.231 1.638v5.631h-2.082V6.785zM34.35 12.462c-.493 0-.998.027-1.515.08-.517.055-.987.159-1.41.312-.425.154-.772.37-1.042.646-.27.277-.404.631-.404 1.062 0 .631.212 1.084.636 1.361.424.278.998.416 1.723.416.57 0 1.056-.096 1.457-.289.401-.192.725-.442.971-.75.247-.307.425-.65.533-1.026.107-.377.161-.75.161-1.12v-.692h-1.11zm-5.875-4.338c.586-.539 1.264-.943 2.036-1.212.77-.269 1.541-.404 2.313-.404.802 0 1.492.1 2.07.3.578.2 1.053.47 1.423.807.37.34.644.727.82 1.166.178.439.267.897.267 1.373v5.585c0 .384.007.738.023 1.061.015.324.038.631.07.923h-1.851c-.046-.554-.07-1.108-.07-1.661h-.046c-.462.708-1.01 1.208-1.642 1.5-.633.292-1.365.438-2.198.438-.509 0-.994-.069-1.457-.207-.463-.14-.867-.346-1.214-.624-.347-.276-.621-.619-.821-1.026-.2-.408-.301-.881-.301-1.42 0-.707.158-1.3.474-1.776.316-.477.748-.866 1.295-1.166.548-.3 1.187-.515 1.92-.646.732-.13 1.515-.196 2.348-.196h1.526v-.462c0-.276-.054-.554-.161-.83-.108-.277-.27-.527-.486-.75-.216-.223-.486-.4-.81-.532-.323-.13-.71-.196-1.156-.196-.401 0-.752.039-1.053.116-.3.077-.575.173-.82.288-.248.116-.471.25-.672.404-.2.154-.393.3-.578.438l-1.249-1.291zM40.689 6.785h2.082v1.684h.046c.262-.584.716-1.057 1.365-1.419.647-.361 1.395-.542 2.243-.542.524 0 1.03.08 1.515.242.486.162.91.412 1.273.75.362.339.65.774.867 1.304.216.53.324 1.158.324 1.88v7.04h-2.082v-6.462c0-.508-.07-.942-.208-1.304-.139-.361-.324-.654-.555-.877-.232-.223-.498-.384-.798-.485-.3-.1-.613-.15-.937-.15-.432 0-.833.07-1.203.208-.37.139-.694.358-.972.658-.277.3-.494.68-.647 1.142-.155.462-.231 1.008-.231 1.638v5.631h-2.082V6.785zM61.645 9.692c-.385-.4-.79-.703-1.214-.911-.424-.208-.929-.311-1.515-.311-.57 0-1.068.103-1.492.31-.424.209-.78.494-1.064.855-.286.362-.501.777-.647 1.246-.147.47-.22.958-.22 1.465 0 .508.084.99.254 1.443.17.454.408.85.717 1.188.309.339.679.604 1.11.797.432.192.918.288 1.458.288.586 0 1.087-.104 1.504-.312.415-.207.8-.51 1.156-.911l1.48 1.477c-.54.6-1.168 1.03-1.885 1.292-.717.261-1.477.392-2.278.392-.849 0-1.623-.138-2.325-.415-.702-.277-1.307-.665-1.816-1.166-.509-.5-.902-1.1-1.18-1.8-.277-.7-.416-1.472-.416-2.319 0-.846.139-1.623.417-2.33.277-.708.666-1.316 1.167-1.824.501-.507 1.103-.903 1.805-1.188.701-.285 1.484-.427 2.348-.427.801 0 1.568.142 2.301.427.732.285 1.369.72 1.908 1.304l-1.573 1.43zM73.35 11.354c-.015-.461-.089-.885-.22-1.27-.131-.384-.328-.718-.59-1.003-.262-.285-.59-.508-.983-.67-.393-.161-.852-.241-1.376-.241-.509 0-.976.096-1.4.288-.424.192-.782.443-1.075.75-.293.308-.52.65-.683 1.027-.161.377-.242.75-.242 1.12h6.569zm-6.57 1.662c0 .477.105.911.313 1.304.208.391.482.726.821 1.003.339.277.732.493 1.18.647.447.153.91.23 1.388.23.647 0 1.21-.15 1.688-.45.478-.3.918-.696 1.319-1.188l1.573 1.2C73.905 17.254 72.286 18 70.204 18c-.864 0-1.646-.146-2.348-.438-.702-.292-1.295-.696-1.78-1.212-.487-.515-.861-1.123-1.123-1.823s-.393-1.457-.393-2.273c0-.815.142-1.573.428-2.273.285-.7.679-1.307 1.18-1.823.5-.516 1.098-.92 1.792-1.212.694-.292 1.45-.438 2.267-.438.972 0 1.793.17 2.464.508.67.338 1.222.78 1.654 1.327.431.546.744 1.161.936 1.846.193.684.29 1.38.29 2.088v.739h-8.79zM83.69 6.785L86.096 6.785 89.381 15.162 92.527 6.785 94.747 6.785 90.445 17.723 88.155 17.723zM98.517 12.254c0 .554.085 1.066.255 1.534.17.47.408.87.717 1.2.309.332.686.593 1.133.785.448.193.95.289 1.504.289.555 0 1.056-.096 1.504-.289.447-.192.824-.453 1.133-.784.309-.331.547-.73.717-1.2.17-.469.255-.981.255-1.535 0-.554-.085-1.065-.255-1.534-.17-.47-.408-.87-.717-1.2-.309-.331-.686-.593-1.133-.785-.448-.192-.949-.288-1.504-.288s-1.056.096-1.504.288c-.447.192-.824.454-1.133.784-.309.332-.547.731-.717 1.2-.17.47-.255.981-.255 1.535m-2.22 0c0-.8.15-1.546.45-2.239.302-.692.714-1.3 1.239-1.823.524-.523 1.14-.934 1.85-1.234.71-.3 1.472-.45 2.29-.45.817 0 1.58.15 2.29.45.71.3 1.326.711 1.85 1.234.525.524.937 1.131 1.238 1.823.3.693.451 1.44.451 2.24 0 .8-.15 1.55-.45 2.25-.302.7-.714 1.307-1.238 1.822-.525.515-1.142.923-1.851 1.223-.71.3-1.473.45-2.29.45-.818 0-1.58-.15-2.29-.45-.71-.3-1.326-.708-1.85-1.223-.525-.515-.937-1.123-1.238-1.823-.3-.7-.451-1.45-.451-2.25M116.698 8.585h-2.983v4.961c0 .308.007.612.023.912.015.3.073.57.173.808.1.238.254.43.463.577.208.146.512.219.913.219.247 0 .501-.024.764-.07.262-.046.501-.13.717-.253v1.892c-.247.138-.567.234-.96.289-.393.053-.698.08-.913.08-.803 0-1.424-.112-1.863-.334-.44-.223-.763-.512-.971-.866-.209-.354-.332-.75-.37-1.188-.039-.44-.058-.88-.058-1.327v-5.7h-2.406v-1.8h2.406v-3.07h2.082v3.07h2.983v1.8zM127.779 11.354c-.016-.461-.09-.885-.22-1.27-.132-.384-.328-.718-.59-1.003-.262-.285-.59-.508-.983-.67-.393-.161-.852-.241-1.377-.241-.508 0-.975.096-1.399.288-.424.192-.783.443-1.076.75-.293.308-.52.65-.682 1.027-.162.377-.243.75-.243 1.12h6.57zm-6.57 1.662c0 .477.104.911.312 1.304.209.391.482.726.822 1.003.338.277.732.493 1.18.647.447.153.91.23 1.387.23.648 0 1.21-.15 1.689-.45.477-.3.917-.696 1.318-1.188l1.573 1.2c-1.156 1.492-2.776 2.238-4.857 2.238-.864 0-1.646-.146-2.348-.438-.703-.292-1.296-.696-1.781-1.212-.486-.515-.86-1.123-1.122-1.823-.263-.7-.394-1.457-.394-2.273 0-.815.143-1.573.428-2.273.285-.7.68-1.307 1.18-1.823.501-.516 1.099-.92 1.793-1.212.694-.292 1.449-.438 2.267-.438.971 0 1.792.17 2.463.508.671.338 1.223.78 1.654 1.327.432.546.744 1.161.937 1.846.193.684.29 1.38.29 2.088v.739h-8.79z" mask="url(#8is2u5ylqd)"/>
                    </g>
                </g>
            </g>
        </g>
    </g>
</svg>
