// Jest Snapshot v1, https://goo.gl/fbAQLP

exports[`should match snapshot 1`] = `
<div
  className="asset-profile container-fluid"
>
  <div
    className="align-items-center row"
  >
    <div
      className="align-self-start col-auto"
    >
      <img
        alt="FVT"
        src="FVTTokenLogo.svg"
      />
    </div>
    <div
      className="col"
    >
      <div
        className="row row-cols-1"
      >
        <div
          className="asset-profile__name col"
        >
          FVT
        </div>
        <div
          className="asset-profile__urls align-self-end col"
        >
          <a
            className="asset-profile__url"
            href="https://finance.vote"
            rel="noopener noreferrer"
            target="_blank"
          >
            website
          </a>
          <a
            className="asset-profile__url"
            href="https://medium.com/@financedotvote"
            rel="noopener noreferrer"
            target="_blank"
          >
            medium
          </a>
          <a
            className="asset-profile__url"
            href="https://t.me/financedotvote"
            rel="noopener noreferrer"
            target="_blank"
          >
            telegram
          </a>
          <a
            className="asset-profile__url"
            href="https://twitter.com/financedotvote"
            rel="noopener noreferrer"
            target="_blank"
          >
            twitter
          </a>
        </div>
      </div>
    </div>
  </div>
</div>
`;
