// Jest Snapshot v1, https://goo.gl/fbAQLP

exports[`should match snapshot 1`] = `
<g
  className="grid-legend"
  style={
    Object {
      "transform": "translate(0, 0)",
    }
  }
>
  <g
    className="grid-legend-item"
    style={
      Object {
        "transform": "translate(0, 0rem)",
      }
    }
  >
    <g
      className="block"
      transform="translate(0,0)"
    >
      <rect
        height={10}
        width={10}
        x={0}
        y={0}
      />
    </g>
    <text
      className="text"
      lengthAdjust="spacing"
      x={17}
      y="0.6rem"
    >
      Sold
    </text>
  </g>
  <g
    className="grid-legend-item"
    style={
      Object {
        "transform": "translate(0, 1.5rem)",
      }
    }
  >
    <g
      className="block block--empty"
      transform="translate(0,0)"
    >
      <rect
        height={10}
        width={10}
        x={0}
        y={0}
      />
    </g>
    <text
      className="text"
      lengthAdjust="spacing"
      x={17}
      y="0.6rem"
    >
      Price not met
    </text>
  </g>
  <g
    className="grid-legend-item"
    style={
      Object {
        "transform": "translate(0, 3rem)",
      }
    }
  >
    <g
      className="block block--closed"
      transform="translate(0,0)"
    >
      <rect
        height={10}
        width={10}
        x={0}
        y={0}
      />
      <text
        className="text"
        dominantBaseline="middle"
        lengthAdjust="spacing"
        textAnchor="middle"
        x={5}
        y={5.882352941176471}
      >
        X
      </text>
    </g>
    <text
      className="text"
      lengthAdjust="spacing"
      x={17}
      y="0.6rem"
    >
      Lot sold out
    </text>
  </g>
  <g
    className="grid-legend-item"
    style={
      Object {
        "transform": "translate(0, 4.5rem)",
      }
    }
  >
    <g
      className="block block--active"
      transform="translate(0,0)"
    >
      <rect
        height={10}
        width={10}
        x={0}
        y={0}
      />
    </g>
    <text
      className="text"
      lengthAdjust="spacing"
      x={17}
      y="0.6rem"
    >
      Buy
    </text>
  </g>
</g>
`;
