<svg width="146" height="60" viewBox="0 0 146 60" fill="none" xmlns="http://www.w3.org/2000/svg">
<g clip-path="url(#clip0_5_2448)">
<path d="M66.5779 0H58.5576V8.05607H66.5779V0Z" fill="#00DBC7"/>
<path d="M76.6028 0H68.5825V8.05607H76.6028V0Z" fill="#00DBC7"/>
<path d="M66.5779 10.0694H58.5576V18.1254H66.5779V10.0694Z" fill="#00B1FF"/>
<path d="M76.6028 10.0694H68.5825V18.1254H76.6028V10.0694Z" fill="#00B1FF"/>
<path d="M66.5779 20.1388H58.5576V28.1948H66.5779V20.1388Z" fill="#1F6FE5"/>
<path d="M86.6272 0H78.6069V8.05607H86.6272V0Z" fill="#00E0CC"/>
<path d="M2.63584 49.4124H0V47.3878H2.63584V44.6383C2.63584 42.994 2.94969 41.767 3.57741 40.9571C4.20512 40.1473 5.28577 39.7452 6.81934 39.7508C7.0787 39.7508 7.34933 39.7508 7.63406 39.7763C7.9439 39.7971 8.25085 39.8493 8.55025 39.932L8.29372 42.0077C8.08534 41.925 7.869 41.8643 7.64815 41.8264C7.42529 41.7913 7.19998 41.7742 6.97439 41.7755C6.62032 41.7594 6.26732 41.8253 5.94261 41.968C5.68966 42.0941 5.47825 42.2907 5.33369 42.5343C5.17977 42.8009 5.0837 43.0972 5.05178 43.4037C5.0051 43.7869 4.98344 44.1729 4.98694 44.559V47.3906H7.74964V49.4153H4.96157V59.6914H2.63584V49.4124Z" fill="#CFE2EB"/>
<path d="M13.1226 47.3878H10.7969V59.6885H13.1226V47.3878Z" fill="#CFE2EB"/>
<path d="M13.1226 42.6617H10.7969V44.9979H13.1226V42.6617Z" fill="#00B1FF"/>
<path d="M91.31 56.8031H88.209V59.9179H91.31V56.8031Z" fill="#00B1FF"/>
<path d="M17.1035 47.3878H19.4264V49.2709H19.48C19.7988 48.5849 20.3339 48.0236 21.0023 47.6738C21.7716 47.2575 22.6348 47.0478 23.5085 47.065C24.0838 47.0668 24.6551 47.1624 25.1999 47.3482C25.7258 47.5247 26.2069 47.8147 26.6094 48.1977C27.0351 48.6099 27.3661 49.1105 27.5792 49.6645C27.8331 50.3399 27.9556 51.0579 27.94 51.7797V59.6942H25.6284V52.4225C25.6398 51.9233 25.5605 51.4263 25.3944 50.9557C25.2626 50.5853 25.0508 50.2487 24.7742 49.9703C24.5226 49.7223 24.2179 49.5354 23.8834 49.4238C23.5441 49.3171 23.1901 49.2655 22.8347 49.2709C22.3762 49.2663 21.9206 49.3449 21.49 49.5031C21.0747 49.6602 20.7026 49.9146 20.4047 50.2449C20.0757 50.6159 19.8296 51.0533 19.683 51.5277C19.4991 52.1243 19.4115 52.7467 19.4236 53.3711V59.7027H17.1035V47.3878Z" fill="#CFE2EB"/>
<path d="M31.8018 48.8942C32.4577 48.2872 33.2312 47.8225 34.074 47.5294C34.9043 47.2338 35.7782 47.0806 36.6591 47.0763C37.4428 47.06 38.2239 47.1739 38.9707 47.4133C39.556 47.6043 40.0961 47.9137 40.5579 48.3222C40.9593 48.6835 41.2736 49.1319 41.4769 49.6333C41.6737 50.1237 41.7742 50.6478 41.7729 51.1766V57.4572C41.7729 57.8876 41.7729 58.2868 41.7983 58.6493C41.8236 59.0118 41.8405 59.36 41.8772 59.6885H39.8108C39.7582 59.0656 39.7319 58.4426 39.7319 57.8196H39.6811C39.2434 58.5504 38.6066 59.1399 37.8459 59.5186C37.0741 59.861 36.2369 60.0292 35.3933 60.0113C34.8417 60.0135 34.2927 59.9343 33.7639 59.7763C33.2713 59.6329 32.8109 59.3954 32.4079 59.0769C32.0206 58.7652 31.7076 58.3705 31.4917 57.9216C31.2584 57.4224 31.1436 56.8758 31.1562 56.3245C31.1301 55.6208 31.3147 54.9254 31.6862 54.3282C32.0528 53.7777 32.5498 53.3272 33.1324 53.0171C33.8026 52.6595 34.5262 52.4137 35.2749 52.2894C36.1417 52.1394 37.0199 52.0655 37.8995 52.0685H39.5909V51.5362C39.5873 50.873 39.3287 50.2369 38.8692 49.7607C38.6128 49.4998 38.3044 49.2962 37.9643 49.1632C37.5521 49.007 37.1137 48.932 36.6732 48.9424C36.2774 48.9359 35.8824 48.9796 35.4976 49.0726C35.1825 49.15 34.8756 49.2582 34.5814 49.3954C34.3157 49.5195 34.0642 49.6724 33.8315 49.8513L33.186 50.344L31.8018 48.8942ZM38.3646 53.7704C37.7996 53.7717 37.2351 53.8019 36.6732 53.861C36.1357 53.9138 35.6066 54.0317 35.0973 54.2121C34.66 54.3626 34.2627 54.6115 33.9359 54.9398C33.7851 55.0981 33.6675 55.2852 33.59 55.49C33.5125 55.6947 33.4767 55.913 33.4848 56.132C33.4848 56.8427 33.7188 57.3524 34.1952 57.6639C34.7773 58.004 35.4454 58.1663 36.1178 58.1311C36.6785 58.1475 37.2355 58.0362 37.7472 57.8055C38.1679 57.6089 38.5381 57.3183 38.8298 56.956C39.1022 56.6142 39.3044 56.2215 39.4246 55.8007C39.5432 55.3912 39.604 54.967 39.605 54.5406V53.7619L38.3646 53.7704Z" fill="#CFE2EB"/>
<path d="M45.4434 47.3878H47.7663V49.2709H47.8198C48.1387 48.5849 48.6737 48.0236 49.3421 47.6738C50.1114 47.2575 50.9747 47.0478 51.8483 47.065C52.4237 47.0668 52.9949 47.1624 53.5397 47.3482C54.0656 47.5247 54.5467 47.8147 54.9493 48.1977C55.375 48.6099 55.7059 49.1105 55.919 49.6645C56.1729 50.3399 56.2954 51.0579 56.2799 51.7797V59.6942H53.957V52.4225C53.9684 51.9233 53.8891 51.4263 53.723 50.9557C53.5912 50.5853 53.3794 50.2487 53.1028 49.9703C52.8511 49.7223 52.5465 49.5354 52.212 49.4238C51.8744 49.3126 51.5213 49.2562 51.1661 49.2567C50.7076 49.2521 50.252 49.3308 49.8214 49.4889C49.4061 49.6461 49.034 49.9004 48.736 50.2308C48.4081 50.6024 48.1621 51.0396 48.0144 51.5135C47.8305 52.1101 47.7429 52.7325 47.755 53.3569V59.6885H45.4434V47.3878Z" fill="#CFE2EB"/>
<path d="M68.8475 50.6584C68.4589 50.2394 67.9999 49.8924 67.4915 49.6333C66.9622 49.3867 66.3833 49.2665 65.8001 49.2822C65.2243 49.2686 64.6532 49.3888 64.1312 49.6333C63.6676 49.8578 63.2616 50.1862 62.9444 50.5932C62.6169 51.0156 62.3712 51.4958 62.2199 52.0091C62.0555 52.5418 61.9728 53.0965 61.9746 53.6543C61.9709 54.2077 62.0664 54.7573 62.2565 55.2768C62.4346 55.7702 62.7065 56.2241 63.0571 56.6133C63.403 56.9962 63.8258 57.3012 64.2975 57.5081C64.8104 57.7319 65.365 57.8429 65.9241 57.8338C66.5076 57.8525 67.0872 57.7321 67.6156 57.4827C68.1083 57.2286 68.5468 56.8804 68.9067 56.4576L70.5615 58.1198C69.9901 58.7717 69.2665 59.2708 68.4556 59.5724C67.6424 59.8686 66.7835 60.0182 65.9185 60.0142C65.0314 60.0251 64.1503 59.8665 63.3221 59.5469C62.5649 59.2525 61.8753 58.8065 61.2952 58.2359C60.7193 57.6616 60.2707 56.9717 59.9787 56.2112C59.6605 55.3794 59.5026 54.4944 59.5135 53.6033C59.4962 52.7049 59.6483 51.8114 59.9618 50.9698C60.2461 50.2011 60.6885 49.5011 61.2603 48.9156C61.832 48.3302 62.5201 47.8723 63.2798 47.5719C64.1143 47.2419 65.0048 47.0784 65.9016 47.0905C66.781 47.0877 67.6531 47.251 68.4726 47.5719C69.2858 47.8884 70.0151 48.3894 70.6038 49.0358L68.8475 50.6584Z" fill="#CFE2EB"/>
<path d="M74.5813 54.3933C74.5764 54.9036 74.6965 55.4073 74.9308 55.8601C75.157 56.2959 75.4687 56.6812 75.847 56.9928C76.2402 57.3117 76.687 57.5572 77.1664 57.7177C77.6642 57.8907 78.1873 57.9787 78.7141 57.9782C79.3789 57.9939 80.0344 57.818 80.6028 57.4713C81.1631 57.11 81.6603 56.6585 82.0744 56.1348L83.8307 57.4855C82.5395 59.1618 80.7316 60.0009 78.4068 60.0028C77.508 60.0153 76.6158 59.8478 75.7822 59.5101C75.031 59.203 74.3534 58.7387 73.7948 58.1481C73.2439 57.5562 72.8172 56.859 72.5403 56.098C72.2436 55.2817 72.0955 54.4184 72.1033 53.5495C72.096 52.677 72.2578 51.8114 72.5797 51.001C72.8829 50.2388 73.33 49.5426 73.8963 48.9509C74.4663 48.366 75.1481 47.9028 75.9006 47.5888C76.7045 47.2542 77.5676 47.0866 78.4378 47.0961C79.3865 47.0646 80.3293 47.2587 81.1892 47.6625C81.9069 48.0167 82.5376 48.5263 83.0357 49.1547C83.5192 49.7693 83.8749 50.4751 84.0816 51.2304C84.296 51.9943 84.405 52.7841 84.4058 53.5778V54.4075L74.5813 54.3933ZM81.9109 52.5273C81.8999 52.041 81.8173 51.5591 81.6656 51.0973C81.5274 50.6774 81.3026 50.2914 81.006 49.9646C80.7 49.6356 80.3255 49.3785 79.9093 49.2114C79.4196 49.017 78.8967 48.9208 78.3701 48.9282C77.8325 48.9221 77.2999 49.0322 76.8084 49.251C75.9215 49.6412 75.2159 50.3561 74.835 51.2502C74.6553 51.6461 74.5593 52.0752 74.5531 52.5103L81.9109 52.5273Z" fill="#CFE2EB"/>
<path d="M93.4663 47.3878H96.1529L99.8177 56.8087L103.33 47.3878H105.811L101.005 59.6885H98.4476L93.4663 47.3878Z" fill="#CFE2EB"/>
<path d="M107.548 53.5382C107.54 52.6733 107.711 51.8162 108.049 51.0208C108.378 50.2558 108.847 49.5602 109.434 48.9707C110.026 48.3771 110.728 47.9057 111.5 47.5832C113.138 46.9072 114.976 46.9072 116.614 47.5832C117.386 47.9057 118.088 48.3771 118.68 48.9707C119.267 49.5594 119.737 50.2552 120.064 51.0208C120.403 51.8162 120.574 52.6733 120.566 53.5382C120.572 54.389 120.409 55.2325 120.086 56.0189C119.762 56.8052 119.285 57.5186 118.683 58.117C117.447 59.3304 115.788 60.0098 114.06 60.0098C112.332 60.0098 110.672 59.3304 109.436 58.117C108.834 57.5189 108.356 56.8056 108.032 56.0192C107.708 55.2328 107.545 54.3892 107.55 53.5382H107.548ZM110.026 53.5382C110.019 54.1251 110.115 54.7086 110.307 55.2626C110.48 55.7628 110.753 56.2224 111.108 56.6133C111.464 56.9928 111.895 57.2928 112.374 57.494C113.452 57.9287 114.656 57.9287 115.734 57.494C116.213 57.2921 116.644 56.9921 117 56.6133C117.354 56.2217 117.627 55.7623 117.801 55.2626C118.18 54.1446 118.18 52.9317 117.801 51.8137C117.627 51.3137 117.355 50.8542 117 50.463C116.643 50.0842 116.212 49.7834 115.734 49.5795C114.655 49.1491 113.453 49.1491 112.374 49.5795C111.896 49.7828 111.465 50.0836 111.108 50.463C110.752 50.8554 110.481 51.3171 110.31 51.8193C110.117 52.3714 110.021 52.953 110.026 53.5382Z" fill="#CFE2EB"/>
<path d="M130.331 49.4124H126.999V54.9908C126.999 55.3362 126.999 55.6789 127.025 56.0158C127.036 56.3279 127.102 56.6355 127.219 56.9248C127.325 57.1865 127.504 57.4118 127.735 57.5733C128.043 57.7571 128.398 57.843 128.756 57.8196C129.039 57.8186 129.322 57.7921 129.601 57.7403C129.882 57.6932 130.153 57.5974 130.402 57.4572V59.5837C130.067 59.7574 129.703 59.8678 129.328 59.9094C128.99 59.9609 128.649 59.9912 128.307 60C127.595 60.0346 126.885 59.9058 126.23 59.6234C125.781 59.4121 125.404 59.0735 125.144 58.6493C124.907 58.2411 124.765 57.7841 124.73 57.3127C124.688 56.82 124.665 56.3245 124.665 55.8205V49.4124H121.979V47.3878H124.665V43.936H126.991V47.3878H130.323L130.331 49.4124Z" fill="#CFE2EB"/>
<path d="M135.369 54.3933C135.362 54.9038 135.483 55.408 135.719 55.8601C135.945 56.2959 136.257 56.6812 136.635 56.9928C137.027 57.3113 137.473 57.5568 137.952 57.7177C138.45 57.8905 138.974 57.9785 139.502 57.9782C140.166 57.9943 140.821 57.8184 141.388 57.4713C141.95 57.1108 142.448 56.6592 142.862 56.1348L144.619 57.4826C143.327 59.159 141.519 59.9981 139.192 60C138.294 60.0127 137.403 59.8451 136.57 59.5073C135.819 59.2002 135.141 58.7359 134.583 58.1453C134.037 57.5521 133.615 56.855 133.342 56.0951C133.045 55.279 132.896 54.4158 132.903 53.5466C132.896 52.674 133.059 51.8084 133.382 50.9982C133.685 50.2359 134.132 49.5398 134.698 48.948C135.267 48.3633 135.948 47.9 136.7 47.586C137.504 47.2518 138.367 47.0842 139.237 47.0933C140.186 47.0621 141.128 47.2562 141.988 47.6596C142.706 48.0146 143.336 48.5242 143.835 49.1519C144.317 49.7671 144.673 50.4727 144.881 51.2275C145.094 51.9916 145.202 52.7814 145.202 53.575V54.4046L135.369 54.3933ZM142.699 52.5272C142.686 52.0412 142.604 51.5595 142.454 51.0973C142.315 50.6774 142.091 50.2914 141.794 49.9646C141.487 49.6349 141.112 49.3777 140.694 49.2114C140.206 49.0168 139.684 48.9206 139.158 48.9282C138.62 48.9221 138.088 49.0322 137.596 49.251C136.71 49.6427 136.005 50.357 135.623 51.2502C135.444 51.6465 135.348 52.0753 135.341 52.5103L142.699 52.5272Z" fill="#CFE2EB"/>
</g>
<defs>
<clipPath id="clip0_5_2448">
<rect width="145.185" height="60" fill="white"/>
</clipPath>
</defs>
</svg>
