{
	"compiler": {
		"version": "0.8.12+commit.f00d7308"
	},
	"language": "Solidity",
	"output": {
		"abi": [
			{
				"inputs": [
					{
						"internalType": "address",
						"name": "_mgmt",
						"type": "address"
					},
					{
						"internalType": "address",
						"name": "_gateMaster",
						"type": "address"
					}
				],
				"stateMutability": "nonpayable",
				"type": "constructor"
			},
			{
				"inputs": [
					{
						"internalType": "uint256",
						"name": "maxWithdrawalsAddress",
						"type": "uint256"
					},
					{
						"internalType": "uint256",
						"name": "maxWithdrawalsTotal",
						"type": "uint256"
					}
				],
				"name": "addGate",
				"outputs": [
					{
						"internalType": "uint256",
						"name": "",
						"type": "uint256"
					}
				],
				"stateMutability": "nonpayable",
				"type": "function"
			},
			{
				"inputs": [],
				"name": "gateMaster",
				"outputs": [
					{
						"internalType": "address",
						"name": "",
						"type": "address"
					}
				],
				"stateMutability": "view",
				"type": "function"
			},
			{
				"inputs": [
					{
						"internalType": "uint256",
						"name": "",
						"type": "uint256"
					}
				],
				"name": "gates",
				"outputs": [
					{
						"internalType": "uint256",
						"name": "maxWithdrawalsAddress",
						"type": "uint256"
					},
					{
						"internalType": "uint256",
						"name": "maxWithdrawalsTotal",
						"type": "uint256"
					},
					{
						"internalType": "uint256",
						"name": "totalWithdrawals",
						"type": "uint256"
					}
				],
				"stateMutability": "view",
				"type": "function"
			},
			{
				"inputs": [
					{
						"internalType": "uint256",
						"name": "index",
						"type": "uint256"
					}
				],
				"name": "getGate",
				"outputs": [
					{
						"internalType": "uint256",
						"name": "",
						"type": "uint256"
					},
					{
						"internalType": "uint256",
						"name": "",
						"type": "uint256"
					},
					{
						"internalType": "uint256",
						"name": "",
						"type": "uint256"
					}
				],
				"stateMutability": "view",
				"type": "function"
			},
			{
				"inputs": [
					{
						"internalType": "uint256",
						"name": "index",
						"type": "uint256"
					},
					{
						"internalType": "address",
						"name": "recipient",
						"type": "address"
					},
					{
						"internalType": "bytes32[]",
						"name": "",
						"type": "bytes32[]"
					}
				],
				"name": "isEligible",
				"outputs": [
					{
						"internalType": "bool",
						"name": "eligible",
						"type": "bool"
					}
				],
				"stateMutability": "view",
				"type": "function"
			},
			{
				"inputs": [],
				"name": "management",
				"outputs": [
					{
						"internalType": "address",
						"name": "",
						"type": "address"
					}
				],
				"stateMutability": "view",
				"type": "function"
			},
			{
				"inputs": [],
				"name": "numGates",
				"outputs": [
					{
						"internalType": "uint256",
						"name": "",
						"type": "uint256"
					}
				],
				"stateMutability": "view",
				"type": "function"
			},
			{
				"inputs": [
					{
						"internalType": "uint256",
						"name": "index",
						"type": "uint256"
					},
					{
						"internalType": "address",
						"name": "recipient",
						"type": "address"
					},
					{
						"internalType": "bytes32[]",
						"name": "",
						"type": "bytes32[]"
					}
				],
				"name": "passThruGate",
				"outputs": [],
				"stateMutability": "nonpayable",
				"type": "function"
			},
			{
				"inputs": [
					{
						"internalType": "address",
						"name": "newMgmt",
						"type": "address"
					}
				],
				"name": "setManagement",
				"outputs": [],
				"stateMutability": "nonpayable",
				"type": "function"
			},
			{
				"inputs": [
					{
						"internalType": "uint256",
						"name": "",
						"type": "uint256"
					},
					{
						"internalType": "address",
						"name": "",
						"type": "address"
					}
				],
				"name": "timesWithdrawn",
				"outputs": [
					{
						"internalType": "uint256",
						"name": "",
						"type": "uint256"
					}
				],
				"stateMutability": "view",
				"type": "function"
			}
		],
		"devdoc": {
			"kind": "dev",
			"methods": {},
			"version": 1
		},
		"userdoc": {
			"kind": "user",
			"methods": {},
			"version": 1
		}
	},
	"settings": {
		"compilationTarget": {
			"contracts/AmaluEligibility.sol": "AmaluEligibility"
		},
		"evmVersion": "london",
		"libraries": {},
		"metadata": {
			"bytecodeHash": "ipfs"
		},
		"optimizer": {
			"enabled": false,
			"runs": 200
		},
		"remappings": []
	},
	"sources": {
		"contracts/AmaluEligibility.sol": {
			"keccak256": "0x075ddde2a5b55fef7b6d1ba4c3c114bb3833888164b1a34af3aa4d90254637cd",
			"license": "GPL-3.0-only",
			"urls": [
				"bzz-raw://84c25ce57e8f3ab188b6f5cd7a34fec99d43f1e6e93853c8bac458d4716437a4",
				"dweb:/ipfs/Qma9Msbx4FS8ddNYkJauEeWYTaaP8atiji5sVP2qYuRHWN"
			]
		},
		"interfaces/IEligibility.sol": {
			"keccak256": "0xbf97f0c4cb14e4fe6d08df7d373d9196cc0b4f144428237b0c00e4e281b31566",
			"license": "GPL-3.0-only",
			"urls": [
				"bzz-raw://52e80aa3d560ddd0f4399f8a755cd7cd5d2d4470385d2dbaf82c08383afe3185",
				"dweb:/ipfs/QmX4DneVNTFZ98WkSpfEGrVYTvJUezFaYchHhFaQPFmeDc"
			]
		}
	},
	"version": 1
}