{
	"compiler": {
		"version": "0.8.9+commit.e5eed63a"
	},
	"language": "Solidity",
	"output": {
		"abi": [
			{
				"inputs": [
					{
						"internalType": "uint256",
						"name": "",
						"type": "uint256"
					}
				],
				"name": "getCost",
				"outputs": [
					{
						"internalType": "uint256",
						"name": "ethCost",
						"type": "uint256"
					}
				],
				"stateMutability": "view",
				"type": "function"
			},
			{
				"inputs": [
					{
						"internalType": "uint256",
						"name": "",
						"type": "uint256"
					},
					{
						"internalType": "address",
						"name": "",
						"type": "address"
					}
				],
				"name": "passThruGate",
				"outputs": [],
				"stateMutability": "payable",
				"type": "function"
			}
		],
		"devdoc": {
			"kind": "dev",
			"methods": {},
			"version": 1
		},
		"userdoc": {
			"kind": "user",
			"methods": {},
			"version": 1
		}
	},
	"settings": {
		"compilationTarget": {
			"contracts/FlattenMerkleIdentitysol.sol": "IPriceGate"
		},
		"evmVersion": "london",
		"libraries": {},
		"metadata": {
			"bytecodeHash": "ipfs"
		},
		"optimizer": {
			"enabled": false,
			"runs": 200
		},
		"remappings": []
	},
	"sources": {
		"contracts/FlattenMerkleIdentitysol.sol": {
			"keccak256": "0x80ec69c41d12260093456306021f2afca8793a772e41b2377e42b0f4bffc982c",
			"urls": [
				"bzz-raw://84908b6484093f62d5ba4efd6bde682ffd45c04a24d7701edbabd0c3db4b08a3",
				"dweb:/ipfs/Qmeu6J6QXAuGTqNT3X3w3f8HCeEaunSqy1vEYFdhMGMv3j"
			]
		}
	},
	"version": 1
}