{
	"compiler": {
		"version": "0.8.12+commit.f00d7308"
	},
	"language": "Solidity",
	"output": {
		"abi": [
			{
				"inputs": [
					{
						"internalType": "address",
						"name": "ooner",
						"type": "address"
					},
					{
						"internalType": "address",
						"name": "minter",
						"type": "address"
					},
					{
						"internalType": "string",
						"name": "nomen",
						"type": "string"
					},
					{
						"internalType": "string",
						"name": "symbowl",
						"type": "string"
					}
				],
				"stateMutability": "nonpayable",
				"type": "constructor"
			},
			{
				"inputs": [
					{
						"internalType": "uint256",
						"name": "tokenIndex",
						"type": "uint256"
					}
				],
				"name": "InvalidIndex",
				"type": "error"
			},
			{
				"inputs": [
					{
						"internalType": "uint256",
						"name": "tokenId",
						"type": "uint256"
					}
				],
				"name": "InvalidToken",
				"type": "error"
			},
			{
				"inputs": [
					{
						"internalType": "address",
						"name": "receiver",
						"type": "address"
					}
				],
				"name": "NFTUnreceivable",
				"type": "error"
			},
			{
				"inputs": [
					{
						"internalType": "address",
						"name": "notMinter",
						"type": "address"
					}
				],
				"name": "OnlyMinter",
				"type": "error"
			},
			{
				"inputs": [
					{
						"internalType": "address",
						"name": "notOwner",
						"type": "address"
					}
				],
				"name": "OnlyOwner",
				"type": "error"
			},
			{
				"inputs": [
					{
						"internalType": "uint256",
						"name": "tokenId",
						"type": "uint256"
					},
					{
						"internalType": "address",
						"name": "owner",
						"type": "address"
					}
				],
				"name": "SelfApproval",
				"type": "error"
			},
			{
				"inputs": [
					{
						"internalType": "uint256",
						"name": "tokenId",
						"type": "uint256"
					}
				],
				"name": "TokenAlreadyExists",
				"type": "error"
			},
			{
				"inputs": [
					{
						"internalType": "uint256",
						"name": "tokenId",
						"type": "uint256"
					},
					{
						"internalType": "address",
						"name": "notOwner",
						"type": "address"
					}
				],
				"name": "TokenOwnershipRequired",
				"type": "error"
			},
			{
				"inputs": [
					{
						"internalType": "uint256",
						"name": "tokenId",
						"type": "uint256"
					},
					{
						"internalType": "address",
						"name": "notApproved",
						"type": "address"
					}
				],
				"name": "UnapprovedTransfer",
				"type": "error"
			},
			{
				"inputs": [
					{
						"internalType": "uint256",
						"name": "tokenId",
						"type": "uint256"
					},
					{
						"internalType": "address",
						"name": "unauthorized",
						"type": "address"
					}
				],
				"name": "UnauthorizedApproval",
				"type": "error"
			},
			{
				"inputs": [],
				"name": "ZeroAddress",
				"type": "error"
			},
			{
				"anonymous": false,
				"inputs": [
					{
						"indexed": true,
						"internalType": "address",
						"name": "owner",
						"type": "address"
					},
					{
						"indexed": true,
						"internalType": "address",
						"name": "approved",
						"type": "address"
					},
					{
						"indexed": true,
						"internalType": "uint256",
						"name": "tokenId",
						"type": "uint256"
					}
				],
				"name": "Approval",
				"type": "event"
			},
			{
				"anonymous": false,
				"inputs": [
					{
						"indexed": true,
						"internalType": "address",
						"name": "owner",
						"type": "address"
					},
					{
						"indexed": true,
						"internalType": "address",
						"name": "operator",
						"type": "address"
					},
					{
						"indexed": false,
						"internalType": "bool",
						"name": "approved",
						"type": "bool"
					}
				],
				"name": "ApprovalForAll",
				"type": "event"
			},
			{
				"anonymous": false,
				"inputs": [
					{
						"indexed": true,
						"internalType": "address",
						"name": "owner",
						"type": "address"
					},
					{
						"indexed": true,
						"internalType": "uint256",
						"name": "token",
						"type": "uint256"
					}
				],
				"name": "IdentityCreated",
				"type": "event"
			},
			{
				"anonymous": false,
				"inputs": [
					{
						"indexed": false,
						"internalType": "address",
						"name": "oldOwner",
						"type": "address"
					},
					{
						"indexed": false,
						"internalType": "address",
						"name": "newOwner",
						"type": "address"
					}
				],
				"name": "OwnerUpdated",
				"type": "event"
			},
			{
				"anonymous": false,
				"inputs": [
					{
						"indexed": true,
						"internalType": "address",
						"name": "from",
						"type": "address"
					},
					{
						"indexed": true,
						"internalType": "address",
						"name": "to",
						"type": "address"
					},
					{
						"indexed": true,
						"internalType": "uint256",
						"name": "tokenId",
						"type": "uint256"
					}
				],
				"name": "Transfer",
				"type": "event"
			},
			{
				"inputs": [],
				"name": "_minter",
				"outputs": [
					{
						"internalType": "address",
						"name": "",
						"type": "address"
					}
				],
				"stateMutability": "view",
				"type": "function"
			},
			{
				"inputs": [],
				"name": "_owner_",
				"outputs": [
					{
						"internalType": "address",
						"name": "",
						"type": "address"
					}
				],
				"stateMutability": "view",
				"type": "function"
			},
			{
				"inputs": [
					{
						"internalType": "uint256",
						"name": "",
						"type": "uint256"
					}
				],
				"name": "allTokens",
				"outputs": [
					{
						"internalType": "uint256",
						"name": "",
						"type": "uint256"
					}
				],
				"stateMutability": "view",
				"type": "function"
			},
			{
				"inputs": [
					{
						"internalType": "address",
						"name": "approved",
						"type": "address"
					},
					{
						"internalType": "uint256",
						"name": "tokenId",
						"type": "uint256"
					}
				],
				"name": "approve",
				"outputs": [],
				"stateMutability": "nonpayable",
				"type": "function"
			},
			{
				"inputs": [
					{
						"internalType": "address",
						"name": "_address",
						"type": "address"
					}
				],
				"name": "balanceOf",
				"outputs": [
					{
						"internalType": "uint256",
						"name": "",
						"type": "uint256"
					}
				],
				"stateMutability": "view",
				"type": "function"
			},
			{
				"inputs": [
					{
						"internalType": "address",
						"name": "",
						"type": "address"
					}
				],
				"name": "balances",
				"outputs": [
					{
						"internalType": "uint256",
						"name": "",
						"type": "uint256"
					}
				],
				"stateMutability": "view",
				"type": "function"
			},
			{
				"inputs": [
					{
						"internalType": "address",
						"name": "thisOwner",
						"type": "address"
					},
					{
						"internalType": "uint256",
						"name": "thisToken",
						"type": "uint256"
					},
					{
						"internalType": "string",
						"name": "uri",
						"type": "string"
					}
				],
				"name": "createIdentityFor",
				"outputs": [],
				"stateMutability": "nonpayable",
				"type": "function"
			},
			{
				"inputs": [],
				"name": "endMinting",
				"outputs": [],
				"stateMutability": "nonpayable",
				"type": "function"
			},
			{
				"inputs": [
					{
						"internalType": "uint256",
						"name": "tokenId",
						"type": "uint256"
					}
				],
				"name": "getApproved",
				"outputs": [
					{
						"internalType": "address",
						"name": "",
						"type": "address"
					}
				],
				"stateMutability": "view",
				"type": "function"
			},
			{
				"inputs": [
					{
						"internalType": "address",
						"name": "operator",
						"type": "address"
					},
					{
						"internalType": "uint256",
						"name": "tokenId",
						"type": "uint256"
					}
				],
				"name": "isApproved",
				"outputs": [
					{
						"internalType": "bool",
						"name": "",
						"type": "bool"
					}
				],
				"stateMutability": "view",
				"type": "function"
			},
			{
				"inputs": [
					{
						"internalType": "address",
						"name": "_address",
						"type": "address"
					},
					{
						"internalType": "address",
						"name": "operator",
						"type": "address"
					}
				],
				"name": "isApprovedForAll",
				"outputs": [
					{
						"internalType": "bool",
						"name": "",
						"type": "bool"
					}
				],
				"stateMutability": "view",
				"type": "function"
			},
			{
				"inputs": [],
				"name": "name",
				"outputs": [
					{
						"internalType": "string",
						"name": "",
						"type": "string"
					}
				],
				"stateMutability": "view",
				"type": "function"
			},
			{
				"inputs": [],
				"name": "numIdentities",
				"outputs": [
					{
						"internalType": "uint256",
						"name": "",
						"type": "uint256"
					}
				],
				"stateMutability": "view",
				"type": "function"
			},
			{
				"inputs": [
					{
						"internalType": "address",
						"name": "",
						"type": "address"
					},
					{
						"internalType": "address",
						"name": "",
						"type": "address"
					}
				],
				"name": "operatorApprovals",
				"outputs": [
					{
						"internalType": "bool",
						"name": "",
						"type": "bool"
					}
				],
				"stateMutability": "view",
				"type": "function"
			},
			{
				"inputs": [],
				"name": "owner",
				"outputs": [
					{
						"internalType": "address",
						"name": "",
						"type": "address"
					}
				],
				"stateMutability": "view",
				"type": "function"
			},
			{
				"inputs": [
					{
						"internalType": "uint256",
						"name": "tokenId",
						"type": "uint256"
					}
				],
				"name": "ownerOf",
				"outputs": [
					{
						"internalType": "address",
						"name": "",
						"type": "address"
					}
				],
				"stateMutability": "view",
				"type": "function"
			},
			{
				"inputs": [
					{
						"internalType": "uint256",
						"name": "",
						"type": "uint256"
					}
				],
				"name": "owners",
				"outputs": [
					{
						"internalType": "address",
						"name": "",
						"type": "address"
					}
				],
				"stateMutability": "view",
				"type": "function"
			},
			{
				"inputs": [
					{
						"internalType": "address",
						"name": "",
						"type": "address"
					},
					{
						"internalType": "uint256",
						"name": "",
						"type": "uint256"
					}
				],
				"name": "ownershipMapIndexToToken",
				"outputs": [
					{
						"internalType": "uint256",
						"name": "",
						"type": "uint256"
					}
				],
				"stateMutability": "view",
				"type": "function"
			},
			{
				"inputs": [
					{
						"internalType": "address",
						"name": "",
						"type": "address"
					},
					{
						"internalType": "uint256",
						"name": "",
						"type": "uint256"
					}
				],
				"name": "ownershipMapTokenToIndex",
				"outputs": [
					{
						"internalType": "uint256",
						"name": "",
						"type": "uint256"
					}
				],
				"stateMutability": "view",
				"type": "function"
			},
			{
				"inputs": [
					{
						"internalType": "address",
						"name": "from",
						"type": "address"
					},
					{
						"internalType": "address",
						"name": "to",
						"type": "address"
					},
					{
						"internalType": "uint256",
						"name": "tokenId",
						"type": "uint256"
					}
				],
				"name": "safeTransferFrom",
				"outputs": [],
				"stateMutability": "nonpayable",
				"type": "function"
			},
			{
				"inputs": [
					{
						"internalType": "address",
						"name": "from",
						"type": "address"
					},
					{
						"internalType": "address",
						"name": "to",
						"type": "address"
					},
					{
						"internalType": "uint256",
						"name": "tokenId",
						"type": "uint256"
					},
					{
						"internalType": "bytes",
						"name": "data",
						"type": "bytes"
					}
				],
				"name": "safeTransferFrom",
				"outputs": [],
				"stateMutability": "nonpayable",
				"type": "function"
			},
			{
				"inputs": [
					{
						"internalType": "address",
						"name": "operator",
						"type": "address"
					},
					{
						"internalType": "bool",
						"name": "approved",
						"type": "bool"
					}
				],
				"name": "setApprovalForAll",
				"outputs": [],
				"stateMutability": "nonpayable",
				"type": "function"
			},
			{
				"inputs": [
					{
						"internalType": "address",
						"name": "newOwner",
						"type": "address"
					}
				],
				"name": "setOwner",
				"outputs": [],
				"stateMutability": "nonpayable",
				"type": "function"
			},
			{
				"inputs": [
					{
						"internalType": "uint256",
						"name": "token",
						"type": "uint256"
					},
					{
						"internalType": "string",
						"name": "uri",
						"type": "string"
					}
				],
				"name": "setTokenURI",
				"outputs": [],
				"stateMutability": "nonpayable",
				"type": "function"
			},
			{
				"inputs": [
					{
						"internalType": "bytes4",
						"name": "interfaceId",
						"type": "bytes4"
					}
				],
				"name": "supportsInterface",
				"outputs": [
					{
						"internalType": "bool",
						"name": "",
						"type": "bool"
					}
				],
				"stateMutability": "pure",
				"type": "function"
			},
			{
				"inputs": [],
				"name": "symbol",
				"outputs": [
					{
						"internalType": "string",
						"name": "",
						"type": "string"
					}
				],
				"stateMutability": "view",
				"type": "function"
			},
			{
				"inputs": [
					{
						"internalType": "uint256",
						"name": "",
						"type": "uint256"
					}
				],
				"name": "tokenApprovals",
				"outputs": [
					{
						"internalType": "address",
						"name": "",
						"type": "address"
					}
				],
				"stateMutability": "view",
				"type": "function"
			},
			{
				"inputs": [
					{
						"internalType": "uint256",
						"name": "_index",
						"type": "uint256"
					}
				],
				"name": "tokenByIndex",
				"outputs": [
					{
						"internalType": "uint256",
						"name": "",
						"type": "uint256"
					}
				],
				"stateMutability": "view",
				"type": "function"
			},
			{
				"inputs": [
					{
						"internalType": "address",
						"name": "_address",
						"type": "address"
					},
					{
						"internalType": "uint256",
						"name": "_index",
						"type": "uint256"
					}
				],
				"name": "tokenOfOwnerByIndex",
				"outputs": [
					{
						"internalType": "uint256",
						"name": "",
						"type": "uint256"
					}
				],
				"stateMutability": "view",
				"type": "function"
			},
			{
				"inputs": [
					{
						"internalType": "uint256",
						"name": "_tokenId",
						"type": "uint256"
					}
				],
				"name": "tokenURI",
				"outputs": [
					{
						"internalType": "string",
						"name": "",
						"type": "string"
					}
				],
				"stateMutability": "view",
				"type": "function"
			},
			{
				"inputs": [],
				"name": "totalSupply",
				"outputs": [
					{
						"internalType": "uint256",
						"name": "",
						"type": "uint256"
					}
				],
				"stateMutability": "view",
				"type": "function"
			},
			{
				"inputs": [
					{
						"internalType": "address",
						"name": "from",
						"type": "address"
					},
					{
						"internalType": "address",
						"name": "to",
						"type": "address"
					},
					{
						"internalType": "uint256",
						"name": "tokenId",
						"type": "uint256"
					}
				],
				"name": "transferFrom",
				"outputs": [],
				"stateMutability": "nonpayable",
				"type": "function"
			},
			{
				"inputs": [
					{
						"internalType": "uint256",
						"name": "",
						"type": "uint256"
					}
				],
				"name": "uriMap",
				"outputs": [
					{
						"internalType": "string",
						"name": "",
						"type": "string"
					}
				],
				"stateMutability": "view",
				"type": "function"
			}
		],
		"devdoc": {
			"author": "metapriest, adrian.wachel, marek.babiarz, radoslaw.gorecki",
			"details": "This contract uses no subclassing to make it easier to read and reason aboutThis contract conforms to ERC721 and ERC165 but not ERC1155 because it's a crappy standard :P",
			"events": {
				"Approval(address,address,uint256)": {
					"details": "This emits when the approved address for an NFT is changed or  reaffirmed. The zero address indicates there is no approved address.  When a Transfer event emits, this also indicates that the approved  address for that NFT (if any) is reset to none."
				},
				"ApprovalForAll(address,address,bool)": {
					"details": "This emits when an operator is enabled or disabled for an owner.  The operator can manage all NFTs of the owner."
				},
				"Transfer(address,address,uint256)": {
					"details": "This emits when ownership of any NFT changes by any mechanism.  This event emits when NFTs are created (`from` == 0) and destroyed  (`to` == 0). Exception: during contract creation, any number of NFTs  may be created and assigned without emitting Transfer. At the time of  any transfer, the approved address for that NFT (if any) is reset to none."
				}
			},
			"kind": "dev",
			"methods": {
				"approve(address,uint256)": {
					"details": "The zero address indicates there is no approved address.  Throws unless `msg.sender` is the current NFT owner, or an authorized  operator of the current owner.",
					"params": {
						"approved": "The new approved NFT controller",
						"tokenId": "The NFT to approve"
					}
				},
				"balanceOf(address)": {
					"details": "NFTs assigned to the zero address are considered invalid, and this  function throws for queries about the zero address.",
					"params": {
						"_address": "An address for whom to query the balance"
					},
					"returns": {
						"_0": "The number of NFTs owned by `owner`, possibly zero"
					}
				},
				"constructor": {
					"details": "names are misspelled on purpose because we already have owners and _owner_ and _name and...",
					"params": {
						"minter": "address (MerkleIdentity contract) that can mint NFTs in this series",
						"nomen": "name of the NFT series",
						"ooner": "the owner of this contract",
						"symbowl": "symbol for the NFT series"
					}
				},
				"createIdentityFor(address,uint256,string)": {
					"details": "All permissions around minting should be done thru MerkleIdentity and it's associate gatesOnly the minter contract can call this, and duplicate tokenIds are not allowed",
					"params": {
						"thisOwner": "the owner of this particular NFT, not the owner of the contract",
						"thisToken": "the tokenId that the newly NFT will have",
						"uri": "the metadata string that this NFT will have"
					}
				},
				"getApproved(uint256)": {
					"details": "Throws if `tokenId` is not a valid NFT.",
					"params": {
						"tokenId": "The NFT to find the approved address for"
					},
					"returns": {
						"_0": "The approved address for this NFT, or the zero address if there is none"
					}
				},
				"isApproved(address,uint256)": {
					"details": "There was a bug in this part of the contract when it was originally forked from OpenZeppelin",
					"params": {
						"operator": "the address whose approval we are querying",
						"tokenId": "the specific NFT about which we are querying approval"
					},
					"returns": {
						"_0": "approval is the operator approved to transfer this tokenId?"
					}
				},
				"isApprovedForAll(address,address)": {
					"params": {
						"_address": "The address that owns the NFTs",
						"operator": "The address that acts on behalf of the owner"
					},
					"returns": {
						"_0": "True if `operator` is an approved operator for `owner`, false otherwise"
					}
				},
				"name()": {
					"returns": {
						"_0": "name the intended name"
					}
				},
				"owner()": {
					"returns": {
						"_0": "The address that can set the tokenUri for tokens"
					}
				},
				"ownerOf(uint256)": {
					"details": "NFTs assigned to zero address are considered invalid, and queries  about them do throw.",
					"params": {
						"tokenId": "The identifier for an NFT"
					},
					"returns": {
						"_0": "The address of the owner of the NFT"
					}
				},
				"safeTransferFrom(address,address,uint256)": {
					"details": "This works identically to the other function with an extra data parameter,  except this function just sets data to \"\".",
					"params": {
						"from": "The current owner of the NFT",
						"to": "The new owner",
						"tokenId": "The NFT to transfer"
					}
				},
				"safeTransferFrom(address,address,uint256,bytes)": {
					"details": "Throws unless `msg.sender` is the current owner, an authorized  operator, or the approved address for this NFT. Throws if `from` is  not the current owner. Throws if `to` is the zero address. Throws if  `tokenId` is not a valid NFT. When transfer is complete, this function  checks if `to` is a smart contract (code size > 0). If so, it calls  `onERC721Received` on `to` and throws if the return value is not  `bytes4(keccak256(\"onERC721Received(address,address,uint256,bytes)\"))`.",
					"params": {
						"data": "Additional data with no specified format, sent in call to `to`",
						"from": "The current owner of the NFT",
						"to": "The new owner",
						"tokenId": "The NFT to transfer"
					}
				},
				"setApprovalForAll(address,bool)": {
					"details": "Emits the ApprovalForAll event. The contract MUST allow  multiple operators per owner.",
					"params": {
						"approved": "True if the operator is approved, false to revoke approval",
						"operator": "Address to add to the set of authorized operators"
					}
				},
				"setOwner(address)": {
					"details": "Only current owner may do this",
					"params": {
						"newOwner": "the new address that will be owner, old address is no longer owner"
					}
				},
				"setTokenURI(uint256,string)": {
					"details": "This is just a backup in case some metadata goes wrong, this is basically the only thing the owner can do",
					"params": {
						"token": "tokenId that we are setting metadata for",
						"uri": "metadata that will be associated to this token"
					}
				},
				"supportsInterface(bytes4)": {
					"details": "Returns true if this contract implements the interface defined by `interfaceId`. See the corresponding https://eips.ethereum.org/EIPS/eip-165#how-interfaces-are-identified[EIP section] to learn more about how these ids are created. This function call must use less than 30 000 gas.This whole interface thing is a little pointless, because contracts can lie or mis-implement the interfaceso you might as well just use a try catch",
					"params": {
						"interfaceId": "the first four bytes of the hash of the signatures of the functions of the interface in question"
					},
					"returns": {
						"_0": "supports true if the interface is supported, false otherwise"
					}
				},
				"symbol()": {
					"returns": {
						"_0": "symbol the intended ticker symbol"
					}
				},
				"tokenByIndex(uint256)": {
					"details": "Throws if `_index` >= `totalSupply()`.",
					"params": {
						"_index": "A counter less than `totalSupply()`"
					},
					"returns": {
						"_0": "The token identifier for the `_index`th NFT,  (sort order not specified)"
					}
				},
				"tokenOfOwnerByIndex(address,uint256)": {
					"details": "Throws if `_index` >= `balanceOf(_owner_)` or if  `_owner_` is the zero address, representing invalid NFTs.",
					"params": {
						"_address": "An address where we are interested in NFTs owned by them",
						"_index": "A counter less than `balanceOf(_owner_)`"
					},
					"returns": {
						"_0": "The token identifier for the `_index`th NFT assigned to `_owner_`,   (sort order not specified)"
					}
				},
				"tokenURI(uint256)": {
					"details": "Throws if `_tokenId` is not a valid NFT. URIs are defined in RFC  3986. The URI may point to a JSON file that conforms to the \"ERC721  Metadata JSON Schema\".",
					"returns": {
						"_0": "uri the tokenUri for a specific tokenId"
					}
				},
				"totalSupply()": {
					"returns": {
						"_0": "A count of valid NFTs tracked by this contract, where each one of  them has an assigned and queryable owner not equal to the zero address"
					}
				},
				"transferFrom(address,address,uint256)": {
					"details": "Throws unless `msg.sender` is the current owner, an authorized  operator, or the approved address for this NFT. Throws if `from` is  not the current owner. Throws if `to` is the zero address. Throws if  `tokenId` is not a valid NFT.",
					"params": {
						"from": "The current owner of the NFT",
						"to": "The new owner",
						"tokenId": "The NFT to transfer"
					}
				}
			},
			"title": "A slightly modified enumerable, metadataed NFT contract, compatible with MerkleIdentity contract",
			"version": 1
		},
		"userdoc": {
			"kind": "user",
			"methods": {
				"approve(address,uint256)": {
					"notice": "Change or reaffirm the approved address for an NFT"
				},
				"balanceOf(address)": {
					"notice": "Count all NFTs assigned to an owner"
				},
				"constructor": {
					"notice": "Whoever deploys the contract determines the name, symbol and owner. Minter should be MerkleIdentity contract"
				},
				"createIdentityFor(address,uint256,string)": {
					"notice": "Create a new NFT in this series, with the given tokenId and uri"
				},
				"getApproved(uint256)": {
					"notice": "Get the approved address for a single NFT"
				},
				"isApproved(address,uint256)": {
					"notice": "Look thru all 3 (???) notions of approval for one that matches"
				},
				"isApprovedForAll(address,address)": {
					"notice": "Query if an address is an authorized operator for another address"
				},
				"name()": {
					"notice": "A descriptive name for a collection of NFTs in this contract"
				},
				"owner()": {
					"notice": "The address that can set the tokenUri for tokens"
				},
				"ownerOf(uint256)": {
					"notice": "Find the owner of an NFT"
				},
				"safeTransferFrom(address,address,uint256)": {
					"notice": "Transfers the ownership of an NFT from one address to another address"
				},
				"safeTransferFrom(address,address,uint256,bytes)": {
					"notice": "Transfers the ownership of an NFT from one address to another address"
				},
				"setApprovalForAll(address,bool)": {
					"notice": "Enable or disable approval for a third party (\"operator\") to manage  all of `msg.sender`'s assets"
				},
				"setOwner(address)": {
					"notice": "Changing the owner key"
				},
				"setTokenURI(uint256,string)": {
					"notice": "Manually set the token URI"
				},
				"supportsInterface(bytes4)": {
					"notice": "ERC165 function to tell other contracts which interfaces we support"
				},
				"symbol()": {
					"notice": "An abbreviated name for NFTs in this contract"
				},
				"tokenByIndex(uint256)": {
					"notice": "Enumerate valid NFTs"
				},
				"tokenOfOwnerByIndex(address,uint256)": {
					"notice": "Enumerate NFTs assigned to an owner"
				},
				"tokenURI(uint256)": {
					"notice": "A distinct Uniform Resource Identifier (URI) for a given asset."
				},
				"totalSupply()": {
					"notice": "Count NFTs tracked by this contract"
				},
				"transferFrom(address,address,uint256)": {
					"notice": "Transfer ownership of an NFT -- THE CALLER IS RESPONSIBLE  TO CONFIRM THAT `to` IS CAPABLE OF RECEIVING NFTS OR ELSE  THEY MAY BE PERMANENTLY LOST"
				}
			},
			"version": 1
		}
	},
	"settings": {
		"compilationTarget": {
			"contracts/VoterID.sol": "VoterID"
		},
		"evmVersion": "london",
		"libraries": {},
		"metadata": {
			"bytecodeHash": "ipfs"
		},
		"optimizer": {
			"enabled": true,
			"runs": 200
		},
		"remappings": []
	},
	"sources": {
		"contracts/VoterID.sol": {
			"keccak256": "0x70b096811ec42ea4c1715e2f78ce96e3381f0b0bd5ff8a19c011a9b82afb59e2",
			"license": "GPL-3.0-only",
			"urls": [
				"bzz-raw://38080334d6ff8e63c75c15ede5a55a2cec377ced113ff89741f6f3b5264434af",
				"dweb:/ipfs/QmNVkcjn5BCiqcTxqbP5UxL6R4iPkSj5tGYYDinbJ9He57"
			]
		},
		"interfaces/IERC721Receiver.sol": {
			"keccak256": "0x4efc41733300b9e1fac44d6ef1ff6c7c7425195eaeff6b94aca311ac11d5cb9e",
			"license": "GPL-3.0-only",
			"urls": [
				"bzz-raw://26d31558b8c68e3ba9f203b368b53e58043c967a58956ac00f8ba961a0689f9f",
				"dweb:/ipfs/QmSnu5R9bUyEcvadbNxgMqzymMeji5iKSwkVZp9q637BYP"
			]
		},
		"interfaces/IVoterID.sol": {
			"keccak256": "0x71b600afe80ccaa52ba553e1aeaf1e3b978324619a70406bcbbe2cd7811a5a55",
			"license": "GPL-3.0-only",
			"urls": [
				"bzz-raw://73583b6e5d135d84c7b8a8ba0850f08ea9f8affef5311755df8f13c04ee2c04e",
				"dweb:/ipfs/QmUEFXxkjzALBu696KrBP3ev667LnjJKB6dTaHtMob7Rnh"
			]
		}
	},
	"version": 1
}