<svg width="80" height="79" viewBox="0 0 80 79" fill="none" xmlns="http://www.w3.org/2000/svg">
<path d="M79.9943 50.768L79.9604 50.5245L79.9887 50.4849L72.1625 16.1959L72.2984 15.9354L72.0776 15.8222L72.0663 15.7825L40.4955 0.571954L40.4842 0.509662C40.4445 0.322786 40.286 0.192539 40.1048 0.17555L40.0651 0L40.0255 0.17555C39.8443 0.192539 39.6857 0.328449 39.6461 0.503999L8.047 15.7203L7.6959 15.9298L7.83181 16.1903L0.0339775 50.3546L0.0226517 50.5132L0.0339775 50.5245L0 50.768L0.254831 50.802L21.9495 78.0067V78.1765L22.1193 78.2162L22.1986 78.3124H39.714C39.7933 78.3804 39.8896 78.4144 39.9972 78.4144C40.1048 78.4144 40.1954 78.3804 40.2747 78.3124H57.7957L57.8807 78.2048L58.0902 78.1256L58.0619 77.984L79.7395 50.802L80 50.768H79.9943ZM78.4937 50.9719L57.8127 76.9081L52.7331 54.5282L78.4937 50.9719ZM40.756 77.4517L52.0535 55.4173L57.0539 77.4517H40.756ZM71.1432 16.2922L52.3706 52.9086L40.739 1.65357L71.1432 16.2979V16.2922ZM52.9766 53.6221L71.5509 17.3908L79.0033 50.0319L52.9766 53.6221ZM51.759 54.1092L40.0028 77.044L28.2693 54.1601L40.0595 2.55397L51.759 54.1092ZM22.9461 77.4517L27.9691 55.4683L39.2383 77.4517H22.9461ZM27.2783 54.6075L22.1816 76.9081L1.50067 50.9832L27.2726 54.6188L27.2783 54.6075ZM27.0687 53.7071L0.99101 50.0375L8.44341 17.3908L27.0631 53.7127L27.0687 53.7071ZM39.3912 1.58562L27.652 52.9652L8.85114 16.2922L39.3912 1.58562Z" fill="white"/>
</svg>
