<svg width="26" height="26" viewBox="0 0 26 26" fill="none" xmlns="http://www.w3.org/2000/svg">
<circle cx="13" cy="13" r="13" fill="white"/>
<path d="M10.2843 6H6V10.2843H10.2843V6Z" fill="#00DBC7"/>
<path d="M15.6422 6H11.3579V10.2843H15.6422V6Z" fill="#00DBC7"/>
<path d="M10.2843 11.3579H6V15.6422H10.2843V11.3579Z" fill="#00B1FF"/>
<path d="M15.6422 11.3579H11.3579V15.6422H15.6422V11.3579Z" fill="#00B1FF"/>
<path d="M10.2843 16.7133H6V20.9976H10.2843V16.7133Z" fill="#1F6FE5"/>
<path d="M20.9975 6H16.7133V10.2843H20.9975V6Z" fill="#00DBC7"/>
</svg>
