<svg width="46" height="46" viewBox="0 0 46 46" fill="none" xmlns="http://www.w3.org/2000/svg">
<path d="M-6.86646e-05 22.75C-6.86646e-05 35.2918 10.206 45.5 22.7499 45.5C35.2939 45.5 45.4999 35.295 45.4999 22.75C45.4999 10.205 35.295 0 22.7499 0C10.2049 0 -6.86646e-05 10.206 -6.86646e-05 22.75ZM2.76449 22.75C2.76449 11.7304 11.7303 2.76456 22.7499 2.76456C33.7696 2.76456 42.7364 11.7304 42.7364 22.75C42.7364 33.7696 33.7664 42.7354 22.7499 42.7354C11.7335 42.7354 2.76449 33.7664 2.76449 22.75Z" fill="white"/>
<path d="M20.0348 18.3582C28.084 17.6957 26.2907 15.0844 26.2907 15.0844C26.1095 14.6471 25.6829 14.3888 25.1265 14.2269C25.1265 14.2269 23.2345 11.8858 28.664 10.5705C29.2117 10.4386 29.618 11.1064 29.9782 11.4409C32.7845 14.0329 30.4852 18.534 30.4852 18.534C30.4852 18.534 27.7957 22.84 22.2805 23.0147C16.7653 23.1895 15.9077 26.3088 15.9077 26.3088C15.9077 26.3088 13.8807 29.3489 15.6741 31.7254C17.4674 34.1019 20.6822 33.031 20.6822 33.031C20.6822 33.031 22.3384 32.6612 23.9559 29.6212C25.5735 26.5811 27.5813 25.8222 27.5813 25.8222C27.5813 25.8222 28.4003 25.3934 30.4852 25.432C32.5701 25.4706 32.3911 27.6563 32.3911 27.6563L32.5659 27.7538C32.5659 27.7538 32.9946 28.6896 32.0202 28.7668C31.0458 28.844 31.2013 27.7924 30.929 27.5587C30.6567 27.325 29.3693 26.5039 28.1805 27.2854C25.7268 28.9008 24.3118 35.6273 20.9116 36.9822C16.6238 38.6974 7.23138 34.6443 11.2458 24.0438C11.2458 24.0481 13.2536 18.9167 20.0348 18.3582ZM30.0221 11.1C29.9514 11.0818 30.5656 10.9381 30.5195 10.8856C30.8968 10.7291 31.1284 11.1097 31.5325 11.1675C31.8541 11.2136 32.0524 11.1483 32.3708 11.2362C32.4314 11.2446 32.4867 11.275 32.5263 11.3217C32.5658 11.3684 32.5868 11.428 32.5852 11.4891C32.5755 11.6156 32.4029 11.636 32.2829 11.6746C32.1446 11.7207 32.2979 11.9447 32.419 12.0251C32.7056 12.2093 32.9569 12.4435 33.1608 12.7165C33.2894 12.8805 33.4041 12.9749 33.4234 13.185C33.4384 13.3307 33.2916 13.5237 33.1608 13.4572C32.9968 13.3768 32.9196 13.2193 32.7417 13.2525C32.5851 13.2814 32.568 13.4937 32.6248 13.6427C32.792 14.0832 33.0236 14.2612 33.3162 14.6267C33.4502 14.794 33.5821 14.9237 33.5306 15.1338C33.4867 15.3138 33.3505 15.5229 33.1801 15.4553C33.0096 15.3878 32.9464 15.1413 32.7706 15.2024C32.5948 15.2635 32.6173 15.4639 32.6634 15.6311C32.7095 15.7984 32.8413 15.8841 32.8585 16.0696C32.8703 16.2089 32.5948 16.1768 32.5948 16.3129C32.6248 16.7417 32.8649 16.9561 33.1704 17.2584C33.2948 17.3827 33.2851 17.6721 33.1115 17.7064C32.8874 17.7525 32.7781 17.5746 32.5659 17.492C32.5319 17.4803 32.4958 17.4762 32.4601 17.48C32.4244 17.4838 32.39 17.4955 32.3593 17.5141C32.3286 17.5327 32.3023 17.5579 32.2825 17.5878C32.2626 17.6177 32.2495 17.6516 32.2443 17.6871C32.2228 17.9594 32.3461 18.1159 32.2936 18.3882C32.2539 18.5908 31.9109 18.3057 31.7769 18.4568C31.6429 18.6079 31.7083 18.817 31.8058 19.0121C31.9913 19.384 32.1521 19.6113 32.1274 20.0251C32.1199 20.1794 31.9816 20.3391 31.8348 20.2877C31.7936 20.2712 31.757 20.2449 31.7283 20.2111C31.6995 20.1773 31.6794 20.137 31.6697 20.0937C31.5839 19.8718 31.4864 19.6649 31.2506 19.6552C30.8657 19.6359 30.8389 20.1473 30.8025 20.5321C30.7778 20.8044 30.7661 20.978 30.6074 21.2042C30.5367 21.3114 30.3244 21.3822 30.2955 21.2632C30.1883 21.1013 30.1282 20.8805 29.9449 20.9212C29.7788 20.9609 29.7456 21.1217 29.7102 21.2921C29.6748 21.4626 29.7016 21.5429 29.633 21.6812C29.5644 21.8195 29.2943 21.5505 29.2439 21.6919C29.1367 21.9771 29.216 22.1668 29.1946 22.4713C29.1923 22.514 29.1812 22.5558 29.162 22.5941C29.1428 22.6323 29.1159 22.6662 29.083 22.6936C29.05 22.7209 29.0118 22.7412 28.9707 22.7531C28.9296 22.765 28.8865 22.7684 28.844 22.7628C28.7143 22.7435 28.6972 22.5977 28.6779 22.4713C28.6586 22.3448 28.5857 22.1808 28.4539 22.2076C28.2448 22.2515 28.3049 22.512 28.1805 22.6846C28.1518 22.7388 28.1049 22.7813 28.0481 22.8046C27.9914 22.8279 27.9282 22.8306 27.8696 22.8121C27.7078 22.7489 27.5813 22.542 27.4505 22.6556C27.145 22.9215 27.2361 23.2827 26.9338 23.5518C26.6948 23.7662 26.3325 24.0728 26.1545 23.8058C26.1224 23.5346 26.3518 23.2388 26.1149 23.1134C26.0077 23.0576 25.9573 23.2334 25.9005 23.3385C25.7933 23.5432 25.7429 23.6986 25.5403 23.8155C25.4545 23.8637 25.3141 23.8616 25.2873 23.7662C25.2605 23.6708 25.3066 23.5721 25.2187 23.5325C25.1308 23.4928 25.0901 23.6107 25.0333 23.6793C24.9764 23.7479 24.8585 23.8348 24.8103 23.7565C24.7621 23.6783 24.8339 23.5668 24.761 23.4939C24.6881 23.421 24.6002 23.6011 24.5466 23.6986C24.359 24.0567 24.2561 24.3418 23.8841 24.4876C23.7694 24.5315 23.6129 24.5809 23.5625 24.4683C23.5229 24.3825 23.5625 24.3193 23.5818 24.225C23.6086 24.0545 23.7062 23.8273 23.5432 23.7865C23.4744 23.7644 23.4018 23.7563 23.3297 23.763C23.2577 23.7696 23.1878 23.7907 23.1241 23.8251C22.8454 23.9645 22.9044 24.4104 22.5978 24.4104C22.4659 24.2786 22.3319 24.5583 22.2666 24.732C22.1368 25.0707 22.0136 25.4406 21.6523 25.4245C21.4476 25.4138 21.3211 25.2004 21.35 24.9957C21.3918 24.7052 21.6352 24.5187 21.4958 24.2646C21.3822 24.0502 21.0531 24.2743 20.9116 24.4694C20.7701 24.6645 20.4517 24.6227 20.2877 24.4404C20.2052 24.3472 20.0562 24.2893 19.9758 24.3815C19.7057 24.6859 19.74 25.2294 19.3326 25.2004C19.3246 25.0508 19.3246 24.9009 19.3326 24.7513C19.3326 24.6956 19.3391 24.6205 19.2833 24.6152C19.1686 24.6055 19.115 24.7224 19.0882 24.8392C19.0545 25.0282 18.9742 25.2058 18.8545 25.3559C18.7666 25.4631 18.6648 25.6099 18.5426 25.5413C18.4011 25.4631 18.4965 25.2851 18.4847 25.1222C18.474 24.9925 18.3432 24.8424 18.2307 24.9078C18.0656 25.0053 18.0795 25.1683 17.9873 25.3366C17.9509 25.402 17.9369 25.5263 17.8705 25.492C17.804 25.4577 17.7901 25.4116 17.744 25.3655C17.3249 25.999 16.9347 25.9015 16.9347 25.9015C17.968 23.6408 20.2084 23.6804 21.9632 23.5432C23.718 23.406 27.0882 22.2172 27.0882 22.2172C27.0882 22.2172 30.8057 20.5675 31.6043 16.4951C32.4029 12.4228 30.1004 11.0411 30.0221 11.1ZM19.4988 32.837C19.3337 32.8788 19.0207 32.9732 19.0207 32.9732C19.7711 32.3782 19.6692 31.6718 20.1419 30.8582C20.2701 30.5871 20.4302 30.3323 20.619 30.0993C20.8141 29.8452 21.0188 29.619 21.3307 29.6898C21.3307 30.0114 21.1024 30.1475 20.9213 30.4198C20.8848 30.4766 20.858 30.5784 20.9213 30.5956C21.1281 30.6567 21.2578 30.498 21.4186 30.3522C21.9889 29.8356 22.1465 29.3317 22.8218 28.9683C23.0673 28.8365 23.0748 29.4261 22.9483 29.679C22.8367 29.941 22.6856 30.1843 22.5002 30.4005C22.4413 30.4691 22.3705 30.6149 22.4606 30.6342C22.5212 30.6445 22.5836 30.6361 22.6393 30.61C22.6951 30.584 22.7415 30.5415 22.7725 30.4884C22.929 30.2933 22.9805 30.006 23.2313 30.0306C23.2412 30.1254 23.2205 30.2208 23.1724 30.3029C22.0232 32.6023 19.4988 32.837 19.4988 32.837ZM23.1134 35.652C23.4768 35.1964 23.7641 35.0334 24.0889 34.5607C24.5241 33.925 24.6752 33.5209 25.0729 32.8552C25.3945 32.3193 25.4138 31.9494 25.7064 31.3952C25.9787 30.8786 26.1202 30.2836 26.7001 30.2836C26.7001 30.6052 26.3786 30.6835 26.2617 30.975C26.1781 31.1776 26.1642 31.6482 26.3485 31.5314C26.8684 31.2023 27.1096 30.6738 27.7228 30.7617C27.83 30.7757 27.8053 30.9439 27.7528 31.034C27.6425 31.2029 27.5149 31.3598 27.3723 31.5024C27.1375 31.7618 27.026 31.9162 26.7784 32.1638C26.549 32.3932 26.4997 32.5787 26.34 32.8552C26.1492 33.1843 26.0023 33.3451 25.9112 33.7235C26.2413 33.7696 26.3153 33.3773 26.6219 33.2561C26.7795 33.1918 26.9167 33.4866 26.8363 33.6356C26.5297 34.1909 26.2617 34.5028 25.7064 34.8051C25.1973 35.0817 24.9336 35.2703 24.3708 35.4569C24.1391 35.5282 23.9011 35.5774 23.6601 35.6037C23.4629 35.6348 22.8679 36.0196 22.9001 35.8181L23.1134 35.652ZM30.7532 28.1794C30.7532 28.1794 30.9386 29.7669 32.4008 29.261C33.8629 28.755 32.8971 27.458 32.8971 27.458C32.8971 27.458 33.5981 27.2146 34.0569 27.9843C34.5157 28.754 34.5929 29.0273 34.8845 29.2706C35.1761 29.514 35.1289 29.8645 34.9831 29.8548C34.8373 29.8452 34.8555 29.8934 34.6508 29.7669C34.4461 29.6405 34.3496 29.3092 34.1738 29.3285C33.998 29.3478 33.9883 29.4357 34.0666 29.5729C34.1448 29.7101 35.1385 30.6835 35.1975 31.5603C35.2565 32.4372 35.3529 33.0696 35.0024 33.1586C34.6519 33.2476 34.6701 32.9828 34.6412 32.807C34.6122 32.6312 34.5157 31.9269 34.4182 31.8133C34.0859 31.4338 33.7847 30.9847 33.6089 31.0919C33.4331 31.1991 33.6089 31.4242 33.6667 31.5893C33.7246 31.7543 34.281 33.3623 34.0473 34.3763C33.8136 35.3904 33.8329 35.906 33.3066 35.847C32.7802 35.7881 32.9164 35.1942 32.9464 35.0581C32.9764 34.922 33.2283 34.2198 32.8092 33.0803C32.3901 31.9409 32.3911 31.6182 32.1371 31.7061C31.883 31.794 31.8541 32.4565 31.8734 32.6902C31.8927 32.9238 32.2046 33.5188 32.1564 34.0151C32.1081 34.5114 31.8734 34.9316 31.6011 34.5714C31.3288 34.2113 31.0458 33.9175 31.0072 33.4019C30.9686 32.8863 31.3481 32.018 31.2795 31.288C31.2109 30.558 31.1434 30.021 30.9 29.9138C30.6567 29.8066 30.8411 30.0017 30.8604 30.245C30.8797 30.4884 31.0265 31.2098 30.7146 31.7844C30.4027 32.3589 30.5099 32.3396 30.1883 32.4179C29.8667 32.4961 30.0028 32.0663 30.0618 31.853C30.1532 31.4009 30.1892 30.9395 30.169 30.4787C30.1486 29.8752 29.916 29.4657 30.1979 28.8033C30.4798 28.1408 30.7532 28.1794 30.7532 28.1794Z" fill="white"/>
<path fill-rule="evenodd" clip-rule="evenodd" d="M30.022 11.1001C30.1002 11.0412 32.4049 12.4218 31.6052 16.4942C30.8056 20.5665 27.0891 22.2162 27.0891 22.2162C27.0891 22.2162 23.7178 23.405 21.9641 23.5422C20.2104 23.6795 17.969 23.6387 16.9356 25.9005C16.9356 25.9005 17.3258 25.9981 17.7449 25.3646C17.791 25.4107 17.8103 25.46 17.8714 25.491C17.9325 25.5221 17.9518 25.401 17.9883 25.3356C18.0804 25.1673 18.0665 25.0044 18.2316 24.9068C18.3388 24.8414 18.4749 24.9915 18.4856 25.1212C18.4974 25.2842 18.402 25.4621 18.5435 25.5404C18.6657 25.609 18.7676 25.4642 18.8555 25.3549C18.9751 25.2048 19.0554 25.0272 19.0892 24.8382C19.116 24.731 19.1695 24.6045 19.2842 24.6142C19.34 24.6142 19.3303 24.6946 19.3336 24.7503C19.3255 24.8999 19.3255 25.0499 19.3336 25.1995C19.7398 25.2284 19.7055 24.6849 19.9767 24.3805C20.0571 24.2883 20.2061 24.3462 20.2887 24.4395C20.4527 24.6217 20.7721 24.6656 20.9125 24.4684C21.053 24.2712 21.3831 24.0546 21.4968 24.2637C21.6361 24.5177 21.3896 24.7042 21.351 24.9947C21.322 25.1995 21.4485 25.4128 21.6533 25.4235C22.0145 25.4396 22.1378 25.0698 22.2675 24.731C22.3329 24.5585 22.4669 24.2787 22.5987 24.4095C22.9053 24.4095 22.8463 23.9635 23.125 23.8242C23.1887 23.7898 23.2586 23.7686 23.3307 23.762C23.4027 23.7554 23.4753 23.7634 23.5442 23.7856C23.7071 23.8263 23.6096 24.0536 23.5828 24.224C23.5678 24.3183 23.5238 24.3816 23.5635 24.4673C23.6139 24.5799 23.7704 24.5306 23.8851 24.4866C24.257 24.3376 24.3599 24.0579 24.5475 23.6977C24.6011 23.5958 24.6815 23.4125 24.7619 23.4929C24.8423 23.5733 24.7544 23.6687 24.8112 23.7556C24.868 23.8424 24.9784 23.7481 25.0342 23.6784C25.0899 23.6087 25.1414 23.4951 25.2196 23.5315C25.2979 23.568 25.2636 23.6752 25.2882 23.7652C25.3129 23.8553 25.4555 23.8628 25.5412 23.8145C25.7438 23.6977 25.7899 23.5422 25.9014 23.3375C25.9582 23.2303 26.0086 23.0566 26.1158 23.1124C26.3527 23.2378 26.1233 23.5337 26.1554 23.8049C26.3334 24.0718 26.6914 23.7652 26.9348 23.5508C27.237 23.2818 27.1491 22.9205 27.4514 22.6547C27.5822 22.541 27.7087 22.7479 27.8706 22.8112C27.9291 22.8296 27.9923 22.8269 28.0491 22.8036C28.1059 22.7803 28.1527 22.7379 28.1814 22.6836C28.3058 22.511 28.2457 22.2548 28.4548 22.2066C28.5866 22.1798 28.6574 22.3384 28.6788 22.4703C28.7003 22.6021 28.7153 22.7426 28.845 22.7619C28.8874 22.7674 28.9305 22.7641 28.9717 22.7522C29.0128 22.7402 29.051 22.72 29.0839 22.6926C29.1168 22.6652 29.1437 22.6313 29.1629 22.5931C29.1821 22.5548 29.1932 22.513 29.1955 22.4703C29.2169 22.1659 29.1398 21.9761 29.2448 21.691C29.2952 21.5495 29.5664 21.8143 29.6339 21.6803C29.7015 21.5463 29.6822 21.4466 29.7111 21.2911C29.74 21.1357 29.7797 20.9599 29.9459 20.9203C30.1292 20.8795 30.1892 21.1003 30.2964 21.2622C30.3253 21.3812 30.5376 21.3062 30.6083 21.2032C30.767 20.9771 30.7788 20.8034 30.8034 20.5311C30.8399 20.1463 30.8667 19.635 31.2515 19.6543C31.4873 19.6661 31.5849 19.8687 31.6706 20.0927C31.6803 20.136 31.7004 20.1763 31.7292 20.2101C31.7579 20.2439 31.7945 20.2702 31.8357 20.2867C31.9826 20.3382 32.1208 20.1795 32.1283 20.0241C32.153 19.6103 31.9922 19.3809 31.8068 19.0111C31.7092 18.816 31.6363 18.6166 31.7778 18.4558C31.9193 18.295 32.2548 18.5898 32.2945 18.3872C32.347 18.115 32.2238 17.9585 32.2452 17.6862C32.2505 17.6507 32.2635 17.6167 32.2834 17.5868C32.3033 17.5569 32.3295 17.5317 32.3602 17.5131C32.3909 17.4945 32.4253 17.4829 32.461 17.4791C32.4967 17.4752 32.5328 17.4794 32.5668 17.4911C32.7812 17.5736 32.8884 17.7516 33.1124 17.7055C33.2861 17.6712 33.2957 17.3839 33.1714 17.2574C32.8658 16.953 32.6257 16.7407 32.5957 16.3119C32.5957 16.1726 32.8712 16.2047 32.8594 16.0686C32.8423 15.8832 32.7126 15.8081 32.6643 15.6302C32.6161 15.4522 32.6086 15.2571 32.7715 15.2014C32.9345 15.1457 33.0073 15.3868 33.181 15.4544C33.3547 15.5219 33.4876 15.3139 33.5315 15.1328C33.583 14.9184 33.4511 14.793 33.3171 14.6258C33.0245 14.2602 32.793 14.0823 32.6257 13.6417C32.5689 13.4927 32.5861 13.2805 32.7426 13.2515C32.9205 13.2183 32.9977 13.3759 33.1617 13.4563C33.2925 13.5227 33.4393 13.3298 33.4243 13.184C33.405 12.9696 33.2903 12.8796 33.1617 12.7155C32.9578 12.4425 32.7066 12.2084 32.4199 12.0241C32.2988 11.9437 32.1455 11.7197 32.2838 11.6736C32.4038 11.635 32.5764 11.6146 32.5861 11.4882C32.5877 11.427 32.5667 11.3674 32.5272 11.3207C32.4876 11.274 32.4323 11.2436 32.3717 11.2352C32.0501 11.1473 31.8571 11.2127 31.5334 11.1666C31.1293 11.1087 30.8977 10.7281 30.5204 10.8847C30.5654 10.934 29.9512 11.0819 30.022 11.1001Z" stroke="white" stroke-width="0.39" stroke-miterlimit="3.86"/>
<path fill-rule="evenodd" clip-rule="evenodd" d="M19.4985 32.8371C19.4985 32.8371 22.023 32.6024 23.1721 30.303C23.2203 30.2209 23.2409 30.1255 23.2311 30.0307C22.9802 30.0061 22.9288 30.2934 22.7723 30.4885C22.7413 30.5416 22.6948 30.5841 22.6391 30.6101C22.5833 30.6362 22.521 30.6446 22.4603 30.6343C22.3703 30.615 22.441 30.4692 22.5 30.4006C22.6853 30.1844 22.8364 29.9411 22.9481 29.6791C23.0746 29.4262 23.0671 28.8366 22.8216 28.9684C22.1462 29.3318 21.9887 29.8356 21.4184 30.3523C21.2576 30.4981 21.1279 30.6568 20.921 30.5957C20.8578 30.5785 20.8846 30.4767 20.921 30.4199C21.1022 30.1476 21.3316 30.0147 21.3316 29.6931C21.0196 29.6223 20.8149 29.8485 20.6198 30.1026C20.431 30.3356 20.2709 30.5904 20.1428 30.8615C19.67 31.6751 19.7676 32.3815 19.0215 32.9765C19.0204 32.9733 19.3335 32.8789 19.4985 32.8371Z" stroke="white" stroke-width="0.39" stroke-miterlimit="3.86"/>
<path fill-rule="evenodd" clip-rule="evenodd" d="M23.1134 35.6523C23.4768 35.1967 23.7641 35.0337 24.0889 34.561C24.5241 33.9253 24.6752 33.5212 25.0729 32.8555C25.3945 32.3196 25.4138 31.9497 25.7064 31.3955C25.9787 30.8789 26.1202 30.2839 26.7001 30.2839C26.7001 30.6055 26.3785 30.6838 26.2617 30.9753C26.1781 31.1779 26.1642 31.6485 26.3485 31.5317C26.8684 31.2026 27.1096 30.6741 27.7228 30.762C27.83 30.776 27.8053 30.9443 27.7528 31.0343C27.6424 31.2032 27.5149 31.3601 27.3722 31.5027C27.1375 31.7622 27.026 31.9165 26.7784 32.1641C26.549 32.3935 26.4997 32.579 26.34 32.8555C26.1491 33.1846 26.0023 33.3454 25.9112 33.7238C26.2413 33.7699 26.3153 33.3776 26.6219 33.2564C26.7795 33.1921 26.9167 33.4869 26.8363 33.6359C26.5297 34.1912 26.2617 34.5031 25.7064 34.8054C25.1973 35.082 24.9336 35.2706 24.3708 35.4572C24.1391 35.5285 23.9011 35.5777 23.6601 35.604C23.4628 35.6351 22.8679 36.0199 22.9001 35.8184L23.1134 35.6523Z" stroke="white" stroke-width="0.39" stroke-miterlimit="3.86"/>
<path fill-rule="evenodd" clip-rule="evenodd" d="M30.7532 28.1796C30.7532 28.1796 30.9386 29.7671 32.4007 29.2612C33.8629 28.7552 32.8971 27.4581 32.8971 27.4581C32.8971 27.4581 33.5981 27.2148 34.0569 27.9845C34.5157 28.7541 34.5929 29.0275 34.8845 29.2708C35.176 29.5141 35.1289 29.8647 34.9831 29.855C34.8373 29.8454 34.8555 29.8936 34.6508 29.7671C34.446 29.6406 34.3496 29.3094 34.1738 29.3287C33.998 29.348 33.9883 29.4359 34.0666 29.5731C34.1448 29.7103 35.1385 30.6836 35.1975 31.5605C35.2564 32.4374 35.3529 33.0698 35.0024 33.1588C34.6518 33.2477 34.6701 32.983 34.6411 32.8072C34.6122 32.6314 34.5157 31.9271 34.4182 31.8135C34.0859 31.434 33.7846 30.9849 33.6088 31.0921C33.433 31.1992 33.6088 31.4244 33.6667 31.5894C33.7246 31.7545 34.281 33.3624 34.0473 34.3765C33.8136 35.3906 33.8329 35.9062 33.3065 35.8472C32.7802 35.7883 32.9164 35.1944 32.9464 35.0583C32.9764 34.9221 33.2283 34.22 32.8092 33.0805C32.39 31.941 32.3911 31.6184 32.137 31.7063C31.883 31.7942 31.8541 32.4566 31.8733 32.6903C31.8926 32.924 32.2046 33.519 32.1563 34.0153C32.1081 34.5116 31.8733 34.9318 31.6011 34.5716C31.3288 34.2114 31.0458 33.9177 31.0072 33.4021C30.9686 32.8865 31.3481 32.0182 31.2795 31.2882C31.2109 30.5582 31.1434 30.0212 30.9 29.914C30.6567 29.8068 30.8411 30.0019 30.8604 30.2452C30.8797 30.4885 31.0265 31.21 30.7146 31.7845C30.4026 32.3591 30.5098 32.3398 30.1882 32.4181C29.8667 32.4963 30.0028 32.0665 30.0618 31.8531C30.1532 31.4011 30.1892 30.9396 30.1689 30.4789C30.1486 29.8754 29.916 29.4659 30.1979 28.8034C30.4798 28.141 30.7532 28.1796 30.7532 28.1796Z" stroke="white" stroke-width="0.39" stroke-miterlimit="3.86"/>
<path fill-rule="evenodd" clip-rule="evenodd" d="M20.0808 15.0771C20.1323 15.3987 19.5212 15.6892 19.7924 15.8607C20.0637 16.0323 20.3284 15.8607 20.561 16.0687C20.3885 16.3603 20.0604 16.2252 19.7453 16.341C19.6531 16.3731 19.7453 16.5489 19.8407 16.58C20.2888 16.7483 20.5771 16.7044 21.0563 16.7569C21.1367 16.9959 20.7647 17.0721 20.5128 17.1085C20.1087 17.1642 19.8857 17.0485 19.4891 16.9649C19.413 17.1482 19.6016 17.2682 19.7453 17.4119C19.5684 17.6681 19.2211 17.384 18.9778 17.2039C18.638 16.9531 18.3818 16.7365 18.3346 16.3088C18.2874 15.8811 18.8266 15.865 19.1825 15.6378C19.5384 15.4105 19.6692 15.1147 20.0808 15.0771Z" fill="white"/>
<path fill-rule="evenodd" clip-rule="evenodd" d="M17.3065 14.5174C17.5756 14.9686 18.1019 14.9611 18.61 14.8293C19.1932 14.6771 19.3315 14.1604 19.921 14.0296C20.4709 13.9085 20.7861 14.1368 21.3435 14.1979C21.8398 14.2504 22.1518 14.1218 22.5677 13.8463C22.855 13.6319 23.0629 13.5558 23.303 13.2868C23.4992 13.0649 23.571 12.8301 23.8626 12.7669C24.5819 12.6071 24.9956 12.5986 25.6849 12.3381C26.0344 12.2041 26.2209 12.098 26.5886 12.0347C26.6958 12.0165 26.8662 12.084 26.8201 12.1784C26.7488 12.3162 26.6364 12.4286 26.4985 12.4999C25.9164 12.8698 25.5338 13.0681 24.8424 13.1238C24.6012 13.1442 24.3578 12.992 24.2271 13.1956C24.1992 13.2417 24.2635 13.2921 24.315 13.3028C24.6087 13.394 24.793 13.3468 25.0985 13.3103C25.4448 13.2707 25.641 13.3103 25.9861 13.3103C26.1255 13.3075 26.2648 13.3183 26.402 13.3425C26.4824 13.3564 26.5896 13.3425 26.5939 13.4229C26.5982 13.5033 26.5146 13.5301 26.4417 13.5665C25.8564 13.8806 25.493 14.0243 24.8273 14.1261C24.4972 14.1765 24.3096 14.1261 23.9794 14.1025C23.765 14.0875 23.4081 14.1958 23.5078 14.3984C23.8133 14.7039 23.9934 14.8829 24.4029 15.0051C24.5636 15.0533 24.8531 15.0651 24.7791 15.2131C24.6848 15.4006 23.8508 15.5571 22.2364 14.9333C22.1807 14.9654 22.4283 15.4607 22.7156 15.853C22.7767 15.9345 22.6288 16.077 22.4047 15.9409C22.245 15.8444 22.125 15.8133 22.0049 15.7008C21.7262 15.4414 21.5622 15.2967 21.3617 14.9654C21.3435 14.9494 21.3114 14.9654 21.2899 14.9494L21.41 15.9409C21.1763 15.9409 21.0884 15.7383 20.9619 15.5411C20.7025 15.1391 20.7861 14.7736 20.4495 14.438C20.1997 14.1883 19.876 14.6053 19.667 14.885C19.4655 15.1737 19.1884 15.4014 18.8662 15.5432C18.4042 15.8112 17.969 15.7865 17.507 15.5196C17.1854 15.331 17.0493 15.0673 17.0193 14.6964C17.0213 14.6633 17.0313 14.6313 17.0482 14.6028C17.0652 14.5744 17.0887 14.5504 17.1168 14.5329C17.1449 14.5154 17.1768 14.5049 17.2098 14.5022C17.2428 14.4995 17.276 14.5047 17.3065 14.5174Z" fill="white"/>
<path fill-rule="evenodd" clip-rule="evenodd" d="M20.5365 13.1027C20.9342 13.2914 21.2868 13.0813 21.6159 12.7811C21.9857 12.4488 22.1519 12.1733 22.6321 12.0308C23.0609 11.9021 23.315 11.841 23.7598 11.871C23.9571 11.885 24.1704 11.9847 24.1586 12.183C24.1468 12.3813 23.9388 12.4167 23.7512 12.5046C23.4007 12.719 23.1413 12.7425 22.8476 13.0159C22.4874 13.3525 22.303 13.6162 21.8239 13.7598C21.512 13.8644 21.1758 13.8726 20.8591 13.7834C20.6158 13.7277 20.4303 13.6098 20.3714 13.3686C20.3392 13.2549 20.425 13.0513 20.5365 13.1027Z" fill="white"/>
<path fill-rule="evenodd" clip-rule="evenodd" d="M18.2735 12.7562C18.4878 12.9995 18.5854 13.1721 18.8652 13.3393C19.1139 13.4873 19.4011 13.2139 19.593 13.4283C19.7849 13.6427 19.4011 13.8796 19.1535 14.0511C18.9059 14.2226 18.7633 14.3598 18.4578 14.4188C18.2016 14.4188 18.0462 14.5474 17.8018 14.467C17.7352 14.4427 17.6744 14.405 17.623 14.3562C17.5716 14.3074 17.5307 14.2486 17.503 14.1833C17.4753 14.1181 17.4612 14.0479 17.4617 13.977C17.4622 13.9062 17.4773 13.8361 17.5059 13.7713C17.6324 13.4916 17.3419 13.1903 17.5703 12.9877C17.6978 12.8805 17.8361 12.9266 17.9862 12.8441C18.088 12.783 18.1963 12.6629 18.2735 12.7562Z" fill="white"/>
<path fill-rule="evenodd" clip-rule="evenodd" d="M17.1147 11.1483C17.0901 11.0293 17.0011 11.0004 16.9304 10.9007C16.836 10.7646 16.8821 10.6488 16.8746 10.4848C16.865 10.2908 16.5305 10.6274 16.507 10.8203C16.478 11.0164 16.5158 11.2164 16.6142 11.3884C16.7085 11.5771 17.0204 11.3402 17.1147 11.1483Z" fill="white"/>
<path fill-rule="evenodd" clip-rule="evenodd" d="M17.3464 11.4475C17.0387 11.5032 16.9101 11.843 16.9712 12.1518C17.028 12.4433 17.3399 12.6566 17.6144 12.5516C17.7923 12.513 17.982 12.4444 17.982 12.2632C17.9818 12.2294 17.9747 12.196 17.9612 12.165C17.9476 12.134 17.9279 12.1061 17.9033 12.0829C17.8786 12.0598 17.8495 12.0419 17.8177 12.0303C17.7859 12.0187 17.7521 12.0137 17.7183 12.0156C17.6058 12.0231 17.4782 11.991 17.4621 11.8795C17.4407 11.7058 17.5179 11.4175 17.3464 11.4475Z" fill="white"/>
<path fill-rule="evenodd" clip-rule="evenodd" d="M16.4008 12.4477C16.4887 12.3405 16.3847 12.2333 16.3847 12.0951C16.3847 11.9568 16.4469 11.9 16.4651 11.7735C16.4812 11.6588 16.4104 11.5119 16.2968 11.5334C16.1328 11.5655 16.1328 11.7295 16.017 11.8442C15.9548 11.9075 15.9098 11.9686 15.8251 11.9643C15.7405 11.96 15.7383 11.841 15.6815 11.7649C15.6247 11.6888 15.5218 11.7177 15.4178 11.7177C15.1112 11.7177 14.9461 11.8774 14.7296 12.0929C14.5131 12.3084 14.3619 12.4284 14.3373 12.7168C14.3178 12.8441 14.3431 12.9742 14.4088 13.085C14.4744 13.1958 14.5764 13.2805 14.6974 13.3246C14.9279 13.4039 15.0769 13.3782 15.3213 13.3964C15.6054 13.4168 15.9645 13.718 16.0492 13.4521C16.1124 13.256 15.8348 13.2024 15.7855 12.9966C15.7651 12.9119 15.8734 12.8797 15.9527 12.8604C16.2228 12.795 16.4404 12.9526 16.5852 13.1884C16.8424 13.6076 16.5208 14.1157 16.0888 14.3558C15.8166 14.5048 15.6268 14.4984 15.3288 14.5873C14.0982 14.955 12.9502 14.4115 12.6189 14.4115C11.8857 14.4115 11.3915 14.6495 10.9242 15.2348C11.4033 14.851 11.8428 14.895 12.4431 14.9947C12.8473 15.0611 13.0466 15.2026 13.4497 15.2434C14.378 15.3345 14.9279 15.3709 15.8166 15.0751C16.1081 14.9846 16.3796 14.8391 16.6162 14.6463C16.956 14.4008 17.1737 14.1854 17.2326 13.7673C17.2841 13.4007 17.2841 13.1552 17.0879 12.839C16.9239 12.5635 16.627 12.6718 16.4008 12.4477Z" fill="white"/>
<path fill-rule="evenodd" clip-rule="evenodd" d="M14.1561 12.6071C14.1561 13.126 14.348 13.6705 14.8679 13.7337C15.1391 13.768 15.3288 13.5579 15.5636 13.6941C15.6568 13.7477 15.7929 13.9321 15.6836 13.9503C15.5507 13.9717 15.4789 13.9095 15.347 13.8945C15.3556 14.0242 15.4832 14.0682 15.4832 14.1979C15.3309 14.1979 15.2398 14.2419 15.0919 14.2054C14.9697 14.1765 14.9043 14.0435 14.7875 14.0982C14.6899 14.14 14.7339 14.2622 14.7242 14.3694C14.7178 14.4316 14.6674 14.5023 14.6117 14.482C14.3823 14.3941 14.3458 13.8881 14.1475 14.0425C14.0682 14.1046 14.0735 14.2118 13.9717 14.2343C13.8699 14.2569 13.8484 14.1475 13.8281 14.0661C13.7955 13.9255 13.7793 13.7816 13.7798 13.6373C13.7723 13.4776 13.8581 13.3821 13.812 13.2299C13.7605 13.0606 13.5344 13.3018 13.3564 13.2782C13.3503 13.1183 13.3983 12.9611 13.4927 12.832C13.587 12.7028 13.7222 12.6092 13.8763 12.5664C13.9803 12.5267 14.0425 12.6286 14.1561 12.6071Z" fill="white"/>
<path fill-rule="evenodd" clip-rule="evenodd" d="M15.02 11.577C14.8914 11.0207 14.5162 10.6509 13.9481 10.593C13.38 10.5351 13.0712 10.7377 12.5546 10.9693C11.9628 11.2372 11.8042 11.711 11.1717 11.8804C10.8094 11.978 10.5339 11.9619 10.2284 11.7528C10.0516 11.6328 10.0344 11.4763 9.89291 11.3166C9.89176 11.5512 9.9836 11.7768 10.1483 11.9439C10.313 12.1111 10.5373 12.2062 10.7719 12.2084C11.3293 12.2084 11.6734 12.1227 12.1472 11.8161C12.621 11.5095 12.8247 11.1729 13.3703 11.1376C13.9159 11.1022 14.2118 11.4184 14.602 11.8086L15.02 11.577Z" fill="white"/>
<path fill-rule="evenodd" clip-rule="evenodd" d="M18.5222 8.66548C18.4021 8.76089 18.4021 8.87987 18.3303 9.00958C18.3056 9.0546 18.2735 9.11678 18.2231 9.09641C18.1427 9.06103 18.1588 8.96992 18.1588 8.88202C18.1588 8.79412 18.2049 8.71051 18.1427 8.6419C18.1041 8.6001 18.0355 8.65048 17.999 8.69014C17.9146 8.78185 17.8477 8.88831 17.8018 9.00422C17.6882 9.23255 17.7482 9.45337 17.5456 9.60451C17.3226 9.77174 17.0665 9.86607 17.0665 10.148C17.1202 10.1473 17.1738 10.1498 17.2272 10.1555C17.2004 10.208 17.2883 10.2316 17.3344 10.2627C17.4096 10.335 17.4755 10.4164 17.5306 10.505C17.6261 10.6202 17.7118 10.7432 17.7868 10.8726C17.9245 11.101 18.0091 11.3575 18.0344 11.623C18.0516 11.7816 18.0344 11.8856 18.1062 12.0228C18.1941 12.1868 18.3635 12.1686 18.4975 12.3026C18.7591 12.5642 18.7173 13.0744 19.0817 13.0305C19.0914 12.874 19.0335 12.7861 19.0335 12.6306C19.0335 12.5749 19.0753 12.4891 19.1214 12.5234C19.2286 12.591 19.2286 12.6885 19.2972 12.7871C19.3658 12.8858 19.6413 13.0305 19.6413 12.8943C19.6413 12.7228 19.5609 12.6306 19.577 12.458C19.8535 12.5427 19.8653 12.8697 20.1526 12.9179C20.2384 12.9318 20.3445 12.8847 20.337 12.7979C20.323 12.6456 20.1569 12.5899 20.1773 12.4387C20.323 12.4387 20.3991 12.5384 20.5449 12.5181C20.5449 12.0689 20.1687 11.8127 19.7292 11.7023C19.5148 11.6487 19.3529 11.6905 19.1771 11.5587C19.0013 11.4268 19.2329 11.1438 19.4333 11.0227C19.6338 10.9016 19.9843 10.8083 19.9843 11.0227C19.9843 11.2371 20.0529 11.4386 20.2566 11.534C20.5106 11.6519 20.6982 11.7484 20.8001 12.0132C20.8826 12.2276 20.6307 12.5106 20.8408 12.6049C20.9941 12.6756 21.1023 12.5492 21.2567 12.4773C21.5107 12.357 21.7493 12.2065 21.9674 12.0293C22.0821 11.9457 22.1936 11.862 22.1679 11.7184C22.1454 11.5941 22.0382 11.5683 21.976 11.4622C21.8495 11.2478 22.1003 11.0516 21.9846 10.8383C21.8688 10.625 21.6244 10.6582 21.3918 10.55C21.186 10.4546 21.3285 10.1952 21.3285 9.96683C21.3285 9.77495 21.068 9.731 20.8805 9.76745C20.6264 9.81676 20.5085 9.93682 20.2652 10.0226C19.8546 10.1684 19.5887 10.1426 19.1535 10.1426C18.877 10.1426 18.7419 10.3045 18.4653 10.3184C18.2692 10.3292 18.0494 10.1748 18.0902 9.98291C18.1384 9.74708 18.4653 10.0033 18.7055 10.0151C18.9305 10.0228 19.1552 9.99053 19.369 9.91967C19.8449 9.79103 20.055 9.60558 20.5289 9.44694C20.9576 9.30758 21.3285 9.36547 21.6244 9.68705C21.768 9.8457 22.0714 9.76102 22.1604 9.56699C22.2676 9.33974 22.0532 9.14572 21.8495 9.00744C21.5042 8.7525 21.0774 8.63311 20.65 8.67192C20.248 8.69121 20.0304 8.82413 19.6852 9.03102C19.4998 9.13821 19.3958 9.26792 19.1814 9.24541C19.1557 9.04174 19.503 8.70193 19.3015 8.73302C19.0035 8.78018 18.9595 9.14893 18.6583 9.14893C18.6422 8.9056 18.8191 8.78554 18.8191 8.54114C18.7636 8.53976 18.7085 8.55012 18.6573 8.57155C18.6061 8.59298 18.5601 8.62499 18.5222 8.66548Z" fill="white"/>
<path fill-rule="evenodd" clip-rule="evenodd" d="M19.7237 8.64956L19.8524 8.6099C20.5159 8.50271 20.8922 8.38158 21.5557 8.44161C21.903 8.47162 22.0467 8.67743 22.3865 8.76962C22.6587 8.84359 23.1068 8.42338 22.8828 8.24973C22.7306 8.13181 22.5848 8.19184 22.395 8.21757C22.3286 8.22614 22.2332 8.21114 22.2428 8.14575C22.2611 8.03855 22.3447 8.00639 22.4347 7.94636C22.5826 7.8637 22.7258 7.7728 22.8635 7.67409C22.9557 7.60012 22.7434 7.48221 22.6244 7.48221C22.2482 7.48221 22.052 7.643 21.7122 7.80379C21.62 7.8456 21.5364 7.92385 21.456 7.86061C21.4324 7.83425 21.4193 7.80008 21.4193 7.76467C21.4193 7.72925 21.4324 7.69509 21.456 7.66873C21.5632 7.51651 21.7358 7.46827 21.7358 7.28497C21.1805 7.23888 20.9007 7.54224 20.3851 7.74805C20.1345 7.84366 19.8979 7.97275 19.6819 8.13181C19.5973 8.1897 19.5179 8.21757 19.4976 8.31619C19.4568 8.4684 19.593 8.55738 19.7237 8.64956Z" fill="white"/>
<path fill-rule="evenodd" clip-rule="evenodd" d="M22.2471 10.1524C22.2749 9.76439 22.6758 9.69149 23.0232 9.52856C23.4519 9.33132 23.543 9.00116 23.8807 8.671C24.0082 8.52678 24.1521 8.39798 24.3095 8.28724C24.4435 8.19934 24.6118 8.09322 24.7179 8.21542C24.8015 8.31297 24.66 8.42981 24.5496 8.5027C24.3602 8.59887 24.2063 8.75279 24.1101 8.9422C24.0479 9.06869 24.0029 9.21019 24.1101 9.30238C24.2602 9.43423 24.4542 9.36026 24.63 9.26272C24.9677 9.07298 25.1177 8.91112 25.4372 8.68708C26.1929 8.15968 26.5027 7.74376 27.2284 7.19921C27.5436 7.09202 27.6819 6.93337 28.012 6.87763C28.2457 6.84011 28.4333 6.73934 28.6112 6.8937C28.7892 7.04807 28.4258 7.25602 28.2114 7.37394C27.9595 7.51329 27.8298 7.61084 27.58 7.7577C26.7428 8.24865 26.4491 8.7321 25.717 9.37205C25.4693 9.58644 25.2592 9.61217 24.9977 9.82013C24.5175 10.2039 24.0983 10.0849 23.5184 10.2596C23.2495 10.3511 22.9699 10.4077 22.6866 10.4279C22.4732 10.4386 22.1195 10.3122 22.2471 10.1524Z" fill="white"/>
<path fill-rule="evenodd" clip-rule="evenodd" d="M22.4039 11.5835C22.5679 11.3777 22.5518 11.1858 22.748 11.0164C23.0557 10.7474 23.3494 10.7367 23.7556 10.7517C24.0633 10.7645 24.267 10.8589 24.5467 10.7206C24.9187 10.5341 25.028 9.95092 25.4043 10.1203C25.5115 10.1707 25.4547 10.3347 25.3893 10.4419C25.2821 10.6134 25.1803 10.697 25.1331 10.8975C25.1042 11.0207 25.1792 11.2105 25.3003 11.1772C25.4826 11.1247 25.5286 10.9832 25.7002 10.8975C26.338 10.5759 26.6778 10.3754 27.3799 10.2018C28.082 10.0281 28.4808 9.89196 29.1947 9.96914C29.3791 9.98951 29.5024 9.99916 29.6417 10.1214C29.7811 10.2436 29.541 10.4172 29.3791 10.4569C28.9985 10.5512 28.7691 10.4451 28.3875 10.5212C27.6039 10.6766 27.1419 10.7485 26.4441 11.129C26.0507 11.3434 25.8567 11.5245 25.4365 11.6811C25.1867 11.7722 25.0784 11.9598 24.8126 11.9598C24.6743 11.9598 24.6271 11.8526 24.5167 11.7604C24.1904 11.5495 23.7953 11.4727 23.4137 11.546C23.1779 11.5781 23.0439 11.5792 22.8145 11.6253C22.6472 11.6553 22.3878 11.7475 22.4039 11.5835Z" fill="white"/>
</svg>
