{
  "contractName": "AmaluEligibility",
  "abi": [
    {
      "inputs": [
        { "internalType": "address", "name": "_mgmt", "type": "address" },
        { "internalType": "address", "name": "_gateMaster", "type": "address" }
      ],
      "stateMutability": "nonpayable",
      "type": "constructor"
    },
    {
      "inputs": [
        {
          "internalType": "uint256",
          "name": "maxWithdrawalsAddress",
          "type": "uint256"
        },
        {
          "internalType": "uint256",
          "name": "maxWithdrawalsTotal",
          "type": "uint256"
        }
      ],
      "name": "addGate",
      "outputs": [{ "internalType": "uint256", "name": "", "type": "uint256" }],
      "stateMutability": "nonpayable",
      "type": "function"
    },
    {
      "inputs": [],
      "name": "gateMaster",
      "outputs": [{ "internalType": "address", "name": "", "type": "address" }],
      "stateMutability": "view",
      "type": "function"
    },
    {
      "inputs": [{ "internalType": "uint256", "name": "", "type": "uint256" }],
      "name": "gates",
      "outputs": [
        {
          "internalType": "uint256",
          "name": "maxWithdrawalsAddress",
          "type": "uint256"
        },
        {
          "internalType": "uint256",
          "name": "maxWithdrawalsTotal",
          "type": "uint256"
        },
        {
          "internalType": "uint256",
          "name": "totalWithdrawals",
          "type": "uint256"
        }
      ],
      "stateMutability": "view",
      "type": "function"
    },
    {
      "inputs": [{ "internalType": "uint256", "name": "index", "type": "uint256" }],
      "name": "getGate",
      "outputs": [
        { "internalType": "uint256", "name": "", "type": "uint256" },
        { "internalType": "uint256", "name": "", "type": "uint256" },
        { "internalType": "uint256", "name": "", "type": "uint256" }
      ],
      "stateMutability": "view",
      "type": "function"
    },
    {
      "inputs": [
        { "internalType": "uint256", "name": "index", "type": "uint256" },
        { "internalType": "address", "name": "recipient", "type": "address" },
        { "internalType": "bytes32[]", "name": "", "type": "bytes32[]" }
      ],
      "name": "isEligible",
      "outputs": [{ "internalType": "bool", "name": "eligible", "type": "bool" }],
      "stateMutability": "view",
      "type": "function"
    },
    {
      "inputs": [],
      "name": "management",
      "outputs": [{ "internalType": "address", "name": "", "type": "address" }],
      "stateMutability": "view",
      "type": "function"
    },
    {
      "inputs": [],
      "name": "numGates",
      "outputs": [{ "internalType": "uint256", "name": "", "type": "uint256" }],
      "stateMutability": "view",
      "type": "function"
    },
    {
      "inputs": [
        { "internalType": "uint256", "name": "index", "type": "uint256" },
        { "internalType": "address", "name": "recipient", "type": "address" },
        { "internalType": "bytes32[]", "name": "", "type": "bytes32[]" }
      ],
      "name": "passThruGate",
      "outputs": [],
      "stateMutability": "nonpayable",
      "type": "function"
    },
    {
      "inputs": [{ "internalType": "address", "name": "newMgmt", "type": "address" }],
      "name": "setManagement",
      "outputs": [],
      "stateMutability": "nonpayable",
      "type": "function"
    },
    {
      "inputs": [
        { "internalType": "uint256", "name": "", "type": "uint256" },
        { "internalType": "address", "name": "", "type": "address" }
      ],
      "name": "timesWithdrawn",
      "outputs": [{ "internalType": "uint256", "name": "", "type": "uint256" }],
      "stateMutability": "view",
      "type": "function"
    }
  ]
}
