<svg width="45" height="45" fill="none"
    xmlns="http://www.w3.org/2000/svg">
    <path fill-rule="evenodd" clip-rule="evenodd" d="M42.188 22.5a19.688 19.688 0 1 0-39.376 0 19.688 19.688 0 0 0 39.376 0ZM0 22.5a22.5 22.5 0 1 1 45 0 22.5 22.5 0 0 1-45 0Zm12.656 1.406a1.406 1.406 0 1 1 0-2.812H28.95l-6.038-6.036a1.408 1.408 0 0 1 1.99-1.991l8.438 8.437a1.407 1.407 0 0 1 0 1.992l-8.437 8.437a1.408 1.408 0 0 1-1.991-1.991l6.038-6.036H12.656Z" fill="#fff"/>
</svg>