<svg xmlns="http://www.w3.org/2000/svg" width="31" height="24" viewBox="0 0 31 24">
    <g fill="none" fill-rule="evenodd">
        <g fill="#00B1FF" fill-rule="nonzero">
            <g>
                <g>
                    <path d="M31 3.537h-1.226c-.455 0-1.099.642-1.099 1.053v14.9c0 .412.644.973 1.099.973H31V24H19.892v-3.537h2.325V4.8h-.114L16.673 24H12.47L7.11 4.8h-.135v15.663H9.3V24H0v-3.537h1.191c.49 0 1.134-.561 1.134-.972V4.59c0-.411-.644-1.053-1.134-1.053H0V0h11.63l3.817 13.895h.106L19.406 0H31v3.537" transform="translate(-1292 -972) translate(0 943) translate(1292 29)"/>
                </g>
            </g>
        </g>
    </g>
</svg>