<svg width="80" height="72" viewBox="0 0 80 72" fill="none" xmlns="http://www.w3.org/2000/svg">
<g clip-path="url(#clip0_5_79)">
<path d="M0.0169205 0.492448L-0.00565483 0.492448L0.0112824 0.503762C-0.0225921 0.611321 -0.0113082 0.735863 0.0508027 0.837762L10.18 18.7433L29.6252 53.1221L29.6252 53.3542L29.7551 53.3542L29.7664 53.3712L29.6986 53.49L29.8002 53.4334L29.9132 53.6316L29.9132 53.6429L39.5511 70.6823L39.6245 70.8068C39.6697 70.8861 39.7318 70.9427 39.8108 70.9823L39.8108 71.2087L39.9181 71.0163C40.0931 71.0559 40.2851 70.9653 40.3811 70.8068L50.2054 53.4334L50.3013 53.49L50.2392 53.3768L60.0127 36.0884L60.0804 36.128L60.0353 36.0431L70.0515 18.33L70.1193 18.33L70.0684 18.3017L79.9435 0.837769C80.0169 0.707565 80.0169 0.543404 79.9435 0.407539C79.8645 0.271675 79.7233 0.192421 79.5709 0.192421L79.441 0.192421L79.3337 -5.34639e-05L79.0006 0.192421L60.0748 0.192419L60.1482 0.062216L59.9223 0.192419L59.8659 0.158453L59.8659 0.0112745L59.8038 0.124487L59.6852 0.0565549L59.6513 -5.51846e-05L59.6175 0.0169278L59.5836 -5.51905e-05L59.5554 0.0509015L59.3182 0.186758L40.4997 0.186756L40.5223 0.147129L40.4545 0.186756L40.2908 0.186756L40.1609 0.0112728L40.0536 0.0735362L39.9125 -0.00571792L39.8052 0.186756L20.789 0.186755L20.4503 -0.00571962L20.343 0.186755L0.429099 0.186753C0.333113 0.186753 0.242774 0.220719 0.169371 0.271668L0.0338655 0.198075L0.107268 0.328278C0.107268 0.328278 0.06774 0.373566 0.0508027 0.401871C0.0338578 0.430176 0.0225739 0.45282 0.0112824 0.486787L0.0169205 0.492448ZM10.1574 6.58927L10.067 16.7903L1.53573 1.70388L10.1574 6.58927ZM18.9428 1.05854L10.5921 5.84202L2.14551 1.05854L18.9428 1.05854ZM19.3831 1.80012L10.9309 16.8186L11.0212 6.59493L19.3831 1.80578L19.3831 1.80012ZM12.4949 17.7639L20.3769 13.2465L28.3436 17.7639L12.4949 17.7639ZM21.3424 1.50009L29.9414 6.37415L29.8511 16.6148L21.3424 1.49443L21.3424 1.50009ZM31.3247 17.1016L39.8221 2.00392L39.7318 12.2842L31.3247 17.1016ZM31.9006 17.7639L40.1609 13.0314L48.5115 17.7639L31.9063 17.7639L31.9006 17.7639ZM48.5228 16.7789L40.59 12.2842L40.6747 2.84173L48.5228 16.7789ZM50.1715 16.6204L50.2618 6.36849L58.6463 1.56803L50.1715 16.6204ZM51.3628 17.7583L59.6231 13.0257L67.9737 17.7583L51.3628 17.7583ZM60.1369 2.6436L68.1375 16.8582L60.0466 12.2728L60.1313 2.63795L60.1369 2.6436ZM69.8426 16.9261L69.9386 6.36283L78.6336 1.38122L69.8426 16.9261ZM48.9293 53.9316L40.3924 69.0293L40.4827 58.7717L48.9293 53.9316ZM48.2179 53.3429L40.0536 58.0188L31.799 53.3429L48.2179 53.3429ZM39.6245 58.766L39.5342 68.8821L31.0706 53.9146L39.6245 58.7604L39.6245 58.766ZM29.7325 41.3021L29.6422 51.3955L21.2012 36.4676L29.7325 41.3021ZM21.4157 34.6844L29.9358 19.5528L29.8454 29.8613L21.4214 34.6901L21.4157 34.6844ZM20.8229 33.9768L20.9132 23.9457L29.1171 19.2471L20.8229 33.9768ZM38.1339 35.9865L30.156 40.5548L22.0933 35.9865L38.1339 35.9865ZM30.698 29.8613L30.7883 20.017L38.9696 34.5486L30.7036 29.8613L30.698 29.8613ZM41.0304 34.5995L49.3867 19.7509L49.2963 29.8613L41.0304 34.5995ZM50.9224 19.2641L59.1883 23.9457L59.098 33.79L50.9224 19.2641ZM58.8439 36.3884L50.1715 51.7295L50.2618 41.3077L58.8439 36.3884ZM50.1602 29.8613L50.2505 19.8302L58.5842 34.6392L50.1602 29.867L50.1602 29.8613ZM57.8107 35.9865L49.8327 40.5548L41.77 35.9865L57.8107 35.9865ZM41.8491 35.1203L49.7311 30.6029L57.6978 35.1203L41.8491 35.1203ZM49.3189 51.1521L41.0756 36.5809L49.4036 41.3021L49.3133 51.1521L49.3189 51.1521ZM48.7995 51.9899L40.3811 47.2177L40.4714 37.2602L48.8051 51.9899L48.7995 51.9899ZM32.0643 52.4824L39.9463 47.965L47.913 52.4824L32.0643 52.4824ZM39.6076 37.1243L39.5172 47.2177L31.2061 51.9786L39.6076 37.1243ZM40.2851 34.175L40.3755 23.9513L48.7374 19.1622L40.2851 34.1806L40.2851 34.175ZM31.8837 18.6301L47.9243 18.6301L39.9463 23.1984L31.8837 18.6301ZM39.5172 23.9457L39.4325 33.6032L31.4094 19.3547L39.5172 23.9513L39.5172 23.9457ZM38.9696 36.5073L30.5004 51.4804L30.5907 41.3077L38.9696 36.5073ZM38.2412 35.126L22.3925 35.126L30.2745 30.6086L38.2412 35.126ZM67.6011 18.6301L59.6231 23.1984L51.5604 18.6301L67.5954 18.6301L67.6011 18.6301ZM59.9619 34.4297L60.0579 23.9513L68.6851 19.0093L59.9619 34.4297ZM69.5208 5.62691L61.4581 1.05855L77.4931 1.05855L69.5151 5.62691L69.5208 5.62691ZM69.086 6.37415L68.9957 16.6148L60.487 1.49444L69.086 6.36849L69.086 6.37415ZM49.8384 5.62691L41.7757 1.05854L57.8163 1.05855L49.8384 5.62691ZM49.4036 6.37415L49.3133 16.428L40.9627 1.59066L49.4036 6.37415ZM30.7149 16.4336L30.8053 6.37981L39.026 1.66993L30.7149 16.4393L30.7149 16.4336ZM38.3485 1.05854L30.3705 5.62691L22.3078 1.05854L38.3485 1.05854ZM20.8963 2.47377L29.23 17.2828L20.806 12.5106L20.8963 2.47943L20.8963 2.47377ZM28.4565 18.6357L20.4785 23.2041L12.4158 18.6357L28.4565 18.6357ZM11.6762 17.2431L20.0325 2.39452L19.9421 12.5049L11.6762 17.2431ZM20.0494 23.9513L19.9591 34.2825L11.3148 18.998L20.0494 23.9513ZM50.945 17.0167L59.2843 2.20205L59.194 12.2898L50.945 17.0167Z" fill="white"/>
</g>
<defs>
<clipPath id="clip0_5_79">
<rect width="80" height="71.2088" fill="white" transform="translate(80 71.2087) rotate(-180)"/>
</clipPath>
</defs>
</svg>
