<svg width="44" height="38" viewBox="0 0 44 38" fill="none" xmlns="http://www.w3.org/2000/svg">
<path d="M14.1875 0.25C12.9443 0.25 11.752 0.74386 10.8729 1.62294C9.99386 2.50201 9.5 3.6943 9.5 4.9375V6.5H6.375C4.7174 6.5 3.12769 7.15848 1.95558 8.33058C0.78348 9.50268 0.125 11.0924 0.125 12.75V26.8125C0.125 28.0557 0.61886 29.248 1.49794 30.1271C2.37701 31.0061 3.5693 31.5 4.8125 31.5H9.5V33.0625C9.5 34.3057 9.99386 35.498 10.8729 36.3771C11.752 37.2561 12.9443 37.75 14.1875 37.75H30.125C31.3682 37.75 32.5605 37.2561 33.4396 36.3771C34.3186 35.498 34.8125 34.3057 34.8125 33.0625V31.5H39.1875C40.4307 31.5 41.623 31.0061 42.5021 30.1271C43.3811 29.248 43.875 28.0557 43.875 26.8125V12.75C43.875 11.0924 43.2165 9.50268 42.0444 8.33058C40.8723 7.15848 39.2826 6.5 37.625 6.5H34.5V4.9375C34.5 3.6943 34.0061 2.50201 33.1271 1.62294C32.248 0.74386 31.0557 0.25 29.8125 0.25H14.1875ZM31.375 6.5H12.625V4.9375C12.625 4.5231 12.7896 4.12567 13.0826 3.83265C13.3757 3.53962 13.7731 3.375 14.1875 3.375H29.8125C30.2269 3.375 30.6243 3.53962 30.9174 3.83265C31.2104 4.12567 31.375 4.5231 31.375 4.9375V6.5ZM14.1875 25.25H30.125C30.5394 25.25 30.9368 25.4146 31.2299 25.7076C31.5229 26.0007 31.6875 26.3981 31.6875 26.8125V33.0625C31.6875 33.4769 31.5229 33.8743 31.2299 34.1674C30.9368 34.4604 30.5394 34.625 30.125 34.625H14.1875C13.7731 34.625 13.3757 34.4604 13.0826 34.1674C12.7896 33.8743 12.625 33.4769 12.625 33.0625V26.8125C12.625 26.3981 12.7896 26.0007 13.0826 25.7076C13.3757 25.4146 13.7731 25.25 14.1875 25.25Z" fill="white"/>
</svg>
