<svg width="315" height="51" viewBox="0 0 315 51" fill="none" xmlns="http://www.w3.org/2000/svg">
<g clip-path="url(#clip0_294_108)">
<path d="M23.3159 0.0444336V34.5641H17.4982V0.0444336H0V40.3063H5.81771V5.7866H11.658V40.3063H29.1311V5.7866H34.9714V40.3063H40.7891V0.0444336H23.3159Z" fill="white"/>
<path d="M93.2361 11.551V17.3154H110.734V23.0576H93.2361V40.3286H116.552V11.551H93.2361ZM110.712 34.5642H99.0538V28.7998H110.712V34.5642Z" fill="white"/>
<path d="M81.5781 17.2932H87.4184V11.551H81.5781V4.88477H75.7379V40.3038H87.4184V34.5617H81.5781V17.2932Z" fill="white"/>
<path d="M122.392 40.3039H128.393V22.9662H147.783V17.3599H128.393V5.60627H149.06V0H122.392V40.3039Z" fill="white"/>
<path d="M164.208 10.9878C159.281 10.9878 155.561 13.0139 153.165 17.0215L152.823 17.5849L157.088 21.4344L157.566 20.4213C158.685 17.9901 161.286 16.4359 164.16 16.4359C167.993 16.4359 170.273 18.5065 170.273 21.9755V23.663C167.627 22.9663 165.322 22.6055 163.407 22.6055C156.585 22.6055 152.204 26.2525 152.204 31.9279C152.204 37.2426 156.447 40.9563 162.493 40.9563C165.642 40.9563 168.288 40.1458 170.386 38.5695V40.3484H176.181V22.3807C176.158 15.2425 171.688 10.9878 164.205 10.9878H164.208ZM162.726 35.644C159.919 35.644 158.095 34.2035 158.095 31.9971C158.095 28.5305 161.562 28.0117 163.639 28.0117C165.717 28.0117 167.815 28.3724 170.278 29.1161V31.8859C168.476 34.1838 165.557 35.6465 162.728 35.6465L162.726 35.644Z" fill="white"/>
<path d="M203.903 31.8167C201.963 34.248 199.499 35.4884 196.581 35.4884C190.946 35.4884 187.318 31.75 187.318 25.9856C187.318 23.2381 188.184 20.9649 189.897 19.2082C191.654 17.3847 193.774 16.4829 196.398 16.4829C199.021 16.4829 201.417 17.5873 203.402 19.8382L203.973 20.4905L208.033 16.6632L207.53 16.0777C204.634 12.7001 200.891 10.9878 196.398 10.9878C192.2 10.9878 188.595 12.4727 185.654 15.4229C182.757 18.3286 181.295 21.8841 181.295 25.9831C181.295 30.0822 182.732 33.7069 185.538 36.5879C188.412 39.4466 191.994 40.9118 196.215 40.9118C200.984 40.9118 204.974 39.0661 208.101 35.4389L208.627 34.8311L204.451 31.1373L203.903 31.8118V31.8167Z" fill="white"/>
<path d="M218.707 4.97632H212.8V31.5449C212.8 37.6009 215.651 40.4176 221.764 40.4176C222.813 40.4176 223.817 40.3509 224.455 40.304L225.231 40.2373V34.9448L222.174 35.0115C219.413 35.0115 218.707 34.1788 218.707 30.9124V17.0882H225.254V11.7068H218.707V4.97632Z" fill="white"/>
<path d="M244.374 10.9878C240.131 10.9878 236.526 12.4728 233.675 15.3784C230.846 18.2594 229.432 21.8396 229.432 25.9831C229.432 30.1267 230.869 33.7069 233.675 36.5879C236.551 39.4466 240.131 40.9118 244.351 40.9118C248.572 40.9118 252.222 39.4491 255.096 36.5879C257.947 33.66 259.409 30.102 259.409 25.9831C259.409 21.8643 257.947 18.2816 255.053 15.3784C252.222 12.4505 248.62 10.9878 244.376 10.9878H244.374ZM244.374 35.4859C241.818 35.4859 239.653 34.584 237.985 32.8298C236.298 31.0063 235.455 28.7084 235.455 25.9856C235.455 23.2628 236.301 20.9649 237.985 19.2082C239.653 17.407 241.798 16.4829 244.374 16.4829C246.95 16.4829 249.143 17.36 250.83 19.2082C252.52 20.9649 253.361 23.2603 253.361 25.9856C253.361 28.7109 252.517 31.0063 250.83 32.8298C249.14 34.5865 246.972 35.4859 244.374 35.4859Z" fill="white"/>
<path d="M279.413 11.2571C275.763 11.2571 273.275 12.0453 271.064 14.0046V11.6401H265.269V40.3039H271.179V27.9647C271.179 19.7245 273.412 16.8189 279.711 16.8189C280.006 16.8189 280.327 16.8189 280.532 16.8633L281.513 17.0437V11.4152L280.805 11.3263C280.349 11.2596 279.846 11.2596 279.415 11.2596L279.413 11.2571Z" fill="white"/>
<path d="M308.499 11.6426L299.99 32.7186L291.321 11.6426H284.752L296.751 39.8345L292.167 51.0026H298.601L315.002 11.6426H308.501H308.499Z" fill="white"/>
<path d="M46.6068 11.551V40.3038H69.9227V34.5617H52.4245V28.7973H69.9227V11.551H46.6068ZM64.0824 23.0576H52.4245V17.2932H64.0824V23.0576Z" fill="white"/>
</g>
<defs>
<clipPath id="clip0_294_108">
<rect width="315" height="51" fill="white"/>
</clipPath>
</defs>
</svg>
