<svg width="34" height="31" viewBox="0 0 34 31" fill="none" xmlns="http://www.w3.org/2000/svg">
<path d="M22.6801 0.0126953V5.46434H9.04784C4.52931 5.46434 0.867188 9.12646 0.867188 13.645C0.867188 15.0191 1.23787 16.2909 1.83864 17.4285L5.21316 15.0255C5.05977 14.5909 4.95751 14.1371 4.95751 13.6514C4.95751 11.3889 6.79177 9.56105 9.04784 9.56105H22.6801V15.0127L33.5898 8.19335V6.83204L22.6801 0.0126953ZM29.2438 14.9999C29.3972 15.4345 29.4995 15.8883 29.4995 16.374C29.4995 18.6365 27.6716 20.4643 25.4091 20.4643H11.7769V15.0127L0.867188 21.832V23.1933L11.7769 30.0127V24.5611H25.4091C29.9277 24.5611 33.5898 20.8989 33.5898 16.3804C33.5898 15.0063 33.2191 13.7345 32.6183 12.5968L29.2438 14.9999Z" fill="#00B318"/>
</svg>
