<svg width="40" height="40" viewBox="0 0 40 40" fill="none" xmlns="http://www.w3.org/2000/svg">
<g id="IMGDAOS_+01 1" clip-path="url(#clip0_1820_120)">
<g id="Layer 1">
<path id="Vector" d="M16.8586 40V23.1435H0V16.8565H16.8586V0H23.1414V16.8565H40V23.1435H23.1414V40H16.8586Z" fill="url(#paint0_linear_1820_120)"/>
</g>
</g>
<defs>
<linearGradient id="paint0_linear_1820_120" x1="8.42681" y1="31.5693" x2="31.5703" y2="8.42786" gradientUnits="userSpaceOnUse">
<stop stop-color="#FC8891"/>
<stop offset="0.33" stop-color="#FA399F"/>
<stop offset="0.42" stop-color="#F16AB0"/>
<stop offset="0.53" stop-color="#E89DC2"/>
<stop offset="0.61" stop-color="#E3BDCD"/>
<stop offset="0.66" stop-color="#E1CAD2"/>
<stop offset="0.71" stop-color="#BCD4BF"/>
<stop offset="0.77" stop-color="#97DFAD"/>
<stop offset="0.83" stop-color="#7BE79E"/>
<stop offset="0.89" stop-color="#66ED94"/>
<stop offset="0.94" stop-color="#5AF08E"/>
<stop offset="1" stop-color="#56F28C"/>
</linearGradient>
<clipPath id="clip0_1820_120">
<rect width="40" height="40" fill="white"/>
</clipPath>
</defs>
</svg>
