{
  "contractName": "AggregatorV3Interface",
  "abi": [
    {
      "inputs": [],
      "name": "decimals",
      "outputs": [
        {
          "internalType": "uint8",
          "name": "",
          "type": "uint8"
        }
      ],
      "stateMutability": "view",
      "type": "function"
    },
    {
      "inputs": [],
      "name": "description",
      "outputs": [
        {
          "internalType": "string",
          "name": "",
          "type": "string"
        }
      ],
      "stateMutability": "view",
      "type": "function"
    },
    {
      "inputs": [],
      "name": "version",
      "outputs": [
        {
          "internalType": "uint256",
          "name": "",
          "type": "uint256"
        }
      ],
      "stateMutability": "view",
      "type": "function"
    },
    {
      "inputs": [
        {
          "internalType": "uint80",
          "name": "_roundId",
          "type": "uint80"
        }
      ],
      "name": "getRoundData",
      "outputs": [
        {
          "internalType": "uint80",
          "name": "roundId",
          "type": "uint80"
        },
        {
          "internalType": "int256",
          "name": "answer",
          "type": "int256"
        },
        {
          "internalType": "uint256",
          "name": "startedAt",
          "type": "uint256"
        },
        {
          "internalType": "uint256",
          "name": "updatedAt",
          "type": "uint256"
        },
        {
          "internalType": "uint80",
          "name": "answeredInRound",
          "type": "uint80"
        }
      ],
      "stateMutability": "view",
      "type": "function"
    },
    {
      "inputs": [],
      "name": "latestRoundData",
      "outputs": [
        {
          "internalType": "uint80",
          "name": "roundId",
          "type": "uint80"
        },
        {
          "internalType": "int256",
          "name": "answer",
          "type": "int256"
        },
        {
          "internalType": "uint256",
          "name": "startedAt",
          "type": "uint256"
        },
        {
          "internalType": "uint256",
          "name": "updatedAt",
          "type": "uint256"
        },
        {
          "internalType": "uint80",
          "name": "answeredInRound",
          "type": "uint80"
        }
      ],
      "stateMutability": "view",
      "type": "function"
    }
  ],
  "metadata": "{\"compiler\":{\"version\":\"0.7.4+commit.3f05b770\"},\"language\":\"Solidity\",\"output\":{\"abi\":[{\"inputs\":[],\"name\":\"decimals\",\"outputs\":[{\"internalType\":\"uint8\",\"name\":\"\",\"type\":\"uint8\"}],\"stateMutability\":\"view\",\"type\":\"function\"},{\"inputs\":[],\"name\":\"description\",\"outputs\":[{\"internalType\":\"string\",\"name\":\"\",\"type\":\"string\"}],\"stateMutability\":\"view\",\"type\":\"function\"},{\"inputs\":[{\"internalType\":\"uint80\",\"name\":\"_roundId\",\"type\":\"uint80\"}],\"name\":\"getRoundData\",\"outputs\":[{\"internalType\":\"uint80\",\"name\":\"roundId\",\"type\":\"uint80\"},{\"internalType\":\"int256\",\"name\":\"answer\",\"type\":\"int256\"},{\"internalType\":\"uint256\",\"name\":\"startedAt\",\"type\":\"uint256\"},{\"internalType\":\"uint256\",\"name\":\"updatedAt\",\"type\":\"uint256\"},{\"internalType\":\"uint80\",\"name\":\"answeredInRound\",\"type\":\"uint80\"}],\"stateMutability\":\"view\",\"type\":\"function\"},{\"inputs\":[],\"name\":\"latestRoundData\",\"outputs\":[{\"internalType\":\"uint80\",\"name\":\"roundId\",\"type\":\"uint80\"},{\"internalType\":\"int256\",\"name\":\"answer\",\"type\":\"int256\"},{\"internalType\":\"uint256\",\"name\":\"startedAt\",\"type\":\"uint256\"},{\"internalType\":\"uint256\",\"name\":\"updatedAt\",\"type\":\"uint256\"},{\"internalType\":\"uint80\",\"name\":\"answeredInRound\",\"type\":\"uint80\"}],\"stateMutability\":\"view\",\"type\":\"function\"},{\"inputs\":[],\"name\":\"version\",\"outputs\":[{\"internalType\":\"uint256\",\"name\":\"\",\"type\":\"uint256\"}],\"stateMutability\":\"view\",\"type\":\"function\"}],\"devdoc\":{\"kind\":\"dev\",\"methods\":{},\"version\":1},\"userdoc\":{\"kind\":\"user\",\"methods\":{},\"version\":1}},\"settings\":{\"compilationTarget\":{\"/home/metapriest/code/my_code/dotvote/contracts/contracts/interfaces/AggregatorV3Interface.sol\":\"AggregatorV3Interface\"},\"evmVersion\":\"istanbul\",\"libraries\":{},\"metadata\":{\"bytecodeHash\":\"ipfs\"},\"optimizer\":{\"enabled\":false,\"runs\":200},\"remappings\":[]},\"sources\":{\"/home/metapriest/code/my_code/dotvote/contracts/contracts/interfaces/AggregatorV3Interface.sol\":{\"keccak256\":\"0xe8ac21ebc07ac14deb1c7fa779621306ce6d62c0913947c9c4c2ced42825200f\",\"license\":\"MIT\",\"urls\":[\"bzz-raw://a29f4ad144d1aee571083c2fc8ff884a9558460e51fe373c34914300c2676233\",\"dweb:/ipfs/QmXVVamnLxtcTTtrdMNPVcH2a3WKUKnnSdDaqLKETjQj98\"]}},\"version\":1}",
  "bytecode": "0x",
  "deployedBytecode": "0x",
  "immutableReferences": {},
  "generatedSources": [],
  "deployedGeneratedSources": [],
  "sourceMap": "",
  "deployedSourceMap": "",
  "source": "// SPDX-License-Identifier: MIT\npragma solidity 0.7.4;\n\ninterface AggregatorV3Interface {\n\n  function decimals() external view returns (uint8);\n  function description() external view returns (string memory);\n  function version() external view returns (uint256);\n\n  // getRoundData and latestRoundData should both raise \"No data present\"\n  // if they do not have data to report, instead of returning unset values\n  // which could be misinterpreted as actual reported values.\n  function getRoundData(uint80 _roundId)\n    external\n    view\n    returns (\n      uint80 roundId,\n      int256 answer,\n      uint256 startedAt,\n      uint256 updatedAt,\n      uint80 answeredInRound\n    );\n  function latestRoundData()\n    external\n    view\n    returns (\n      uint80 roundId,\n      int256 answer,\n      uint256 startedAt,\n      uint256 updatedAt,\n      uint80 answeredInRound\n    );\n\n}",
  "sourcePath": "/home/metapriest/code/my_code/dotvote/contracts/contracts/interfaces/AggregatorV3Interface.sol",
  "ast": {
    "absolutePath": "/home/metapriest/code/my_code/dotvote/contracts/contracts/interfaces/AggregatorV3Interface.sol",
    "exportedSymbols": {
      "AggregatorV3Interface": [
        7016
      ]
    },
    "id": 7017,
    "license": "MIT",
    "nodeType": "SourceUnit",
    "nodes": [
      {
        "id": 6972,
        "literals": [
          "solidity",
          "0.7",
          ".4"
        ],
        "nodeType": "PragmaDirective",
        "src": "32:22:14"
      },
      {
        "abstract": false,
        "baseContracts": [],
        "contractDependencies": [],
        "contractKind": "interface",
        "fullyImplemented": false,
        "id": 7016,
        "linearizedBaseContracts": [
          7016
        ],
        "name": "AggregatorV3Interface",
        "nodeType": "ContractDefinition",
        "nodes": [
          {
            "functionSelector": "313ce567",
            "id": 6977,
            "implemented": false,
            "kind": "function",
            "modifiers": [],
            "name": "decimals",
            "nodeType": "FunctionDefinition",
            "parameters": {
              "id": 6973,
              "nodeType": "ParameterList",
              "parameters": [],
              "src": "110:2:14"
            },
            "returnParameters": {
              "id": 6976,
              "nodeType": "ParameterList",
              "parameters": [
                {
                  "constant": false,
                  "id": 6975,
                  "mutability": "mutable",
                  "name": "",
                  "nodeType": "VariableDeclaration",
                  "scope": 6977,
                  "src": "136:5:14",
                  "stateVariable": false,
                  "storageLocation": "default",
                  "typeDescriptions": {
                    "typeIdentifier": "t_uint8",
                    "typeString": "uint8"
                  },
                  "typeName": {
                    "id": 6974,
                    "name": "uint8",
                    "nodeType": "ElementaryTypeName",
                    "src": "136:5:14",
                    "typeDescriptions": {
                      "typeIdentifier": "t_uint8",
                      "typeString": "uint8"
                    }
                  },
                  "visibility": "internal"
                }
              ],
              "src": "135:7:14"
            },
            "scope": 7016,
            "src": "93:50:14",
            "stateMutability": "view",
            "virtual": false,
            "visibility": "external"
          },
          {
            "functionSelector": "7284e416",
            "id": 6982,
            "implemented": false,
            "kind": "function",
            "modifiers": [],
            "name": "description",
            "nodeType": "FunctionDefinition",
            "parameters": {
              "id": 6978,
              "nodeType": "ParameterList",
              "parameters": [],
              "src": "166:2:14"
            },
            "returnParameters": {
              "id": 6981,
              "nodeType": "ParameterList",
              "parameters": [
                {
                  "constant": false,
                  "id": 6980,
                  "mutability": "mutable",
                  "name": "",
                  "nodeType": "VariableDeclaration",
                  "scope": 6982,
                  "src": "192:13:14",
                  "stateVariable": false,
                  "storageLocation": "memory",
                  "typeDescriptions": {
                    "typeIdentifier": "t_string_memory_ptr",
                    "typeString": "string"
                  },
                  "typeName": {
                    "id": 6979,
                    "name": "string",
                    "nodeType": "ElementaryTypeName",
                    "src": "192:6:14",
                    "typeDescriptions": {
                      "typeIdentifier": "t_string_storage_ptr",
                      "typeString": "string"
                    }
                  },
                  "visibility": "internal"
                }
              ],
              "src": "191:15:14"
            },
            "scope": 7016,
            "src": "146:61:14",
            "stateMutability": "view",
            "virtual": false,
            "visibility": "external"
          },
          {
            "functionSelector": "54fd4d50",
            "id": 6987,
            "implemented": false,
            "kind": "function",
            "modifiers": [],
            "name": "version",
            "nodeType": "FunctionDefinition",
            "parameters": {
              "id": 6983,
              "nodeType": "ParameterList",
              "parameters": [],
              "src": "226:2:14"
            },
            "returnParameters": {
              "id": 6986,
              "nodeType": "ParameterList",
              "parameters": [
                {
                  "constant": false,
                  "id": 6985,
                  "mutability": "mutable",
                  "name": "",
                  "nodeType": "VariableDeclaration",
                  "scope": 6987,
                  "src": "252:7:14",
                  "stateVariable": false,
                  "storageLocation": "default",
                  "typeDescriptions": {
                    "typeIdentifier": "t_uint256",
                    "typeString": "uint256"
                  },
                  "typeName": {
                    "id": 6984,
                    "name": "uint256",
                    "nodeType": "ElementaryTypeName",
                    "src": "252:7:14",
                    "typeDescriptions": {
                      "typeIdentifier": "t_uint256",
                      "typeString": "uint256"
                    }
                  },
                  "visibility": "internal"
                }
              ],
              "src": "251:9:14"
            },
            "scope": 7016,
            "src": "210:51:14",
            "stateMutability": "view",
            "virtual": false,
            "visibility": "external"
          },
          {
            "functionSelector": "9a6fc8f5",
            "id": 7002,
            "implemented": false,
            "kind": "function",
            "modifiers": [],
            "name": "getRoundData",
            "nodeType": "FunctionDefinition",
            "parameters": {
              "id": 6990,
              "nodeType": "ParameterList",
              "parameters": [
                {
                  "constant": false,
                  "id": 6989,
                  "mutability": "mutable",
                  "name": "_roundId",
                  "nodeType": "VariableDeclaration",
                  "scope": 7002,
                  "src": "498:15:14",
                  "stateVariable": false,
                  "storageLocation": "default",
                  "typeDescriptions": {
                    "typeIdentifier": "t_uint80",
                    "typeString": "uint80"
                  },
                  "typeName": {
                    "id": 6988,
                    "name": "uint80",
                    "nodeType": "ElementaryTypeName",
                    "src": "498:6:14",
                    "typeDescriptions": {
                      "typeIdentifier": "t_uint80",
                      "typeString": "uint80"
                    }
                  },
                  "visibility": "internal"
                }
              ],
              "src": "497:17:14"
            },
            "returnParameters": {
              "id": 7001,
              "nodeType": "ParameterList",
              "parameters": [
                {
                  "constant": false,
                  "id": 6992,
                  "mutability": "mutable",
                  "name": "roundId",
                  "nodeType": "VariableDeclaration",
                  "scope": 7002,
                  "src": "557:14:14",
                  "stateVariable": false,
                  "storageLocation": "default",
                  "typeDescriptions": {
                    "typeIdentifier": "t_uint80",
                    "typeString": "uint80"
                  },
                  "typeName": {
                    "id": 6991,
                    "name": "uint80",
                    "nodeType": "ElementaryTypeName",
                    "src": "557:6:14",
                    "typeDescriptions": {
                      "typeIdentifier": "t_uint80",
                      "typeString": "uint80"
                    }
                  },
                  "visibility": "internal"
                },
                {
                  "constant": false,
                  "id": 6994,
                  "mutability": "mutable",
                  "name": "answer",
                  "nodeType": "VariableDeclaration",
                  "scope": 7002,
                  "src": "579:13:14",
                  "stateVariable": false,
                  "storageLocation": "default",
                  "typeDescriptions": {
                    "typeIdentifier": "t_int256",
                    "typeString": "int256"
                  },
                  "typeName": {
                    "id": 6993,
                    "name": "int256",
                    "nodeType": "ElementaryTypeName",
                    "src": "579:6:14",
                    "typeDescriptions": {
                      "typeIdentifier": "t_int256",
                      "typeString": "int256"
                    }
                  },
                  "visibility": "internal"
                },
                {
                  "constant": false,
                  "id": 6996,
                  "mutability": "mutable",
                  "name": "startedAt",
                  "nodeType": "VariableDeclaration",
                  "scope": 7002,
                  "src": "600:17:14",
                  "stateVariable": false,
                  "storageLocation": "default",
                  "typeDescriptions": {
                    "typeIdentifier": "t_uint256",
                    "typeString": "uint256"
                  },
                  "typeName": {
                    "id": 6995,
                    "name": "uint256",
                    "nodeType": "ElementaryTypeName",
                    "src": "600:7:14",
                    "typeDescriptions": {
                      "typeIdentifier": "t_uint256",
                      "typeString": "uint256"
                    }
                  },
                  "visibility": "internal"
                },
                {
                  "constant": false,
                  "id": 6998,
                  "mutability": "mutable",
                  "name": "updatedAt",
                  "nodeType": "VariableDeclaration",
                  "scope": 7002,
                  "src": "625:17:14",
                  "stateVariable": false,
                  "storageLocation": "default",
                  "typeDescriptions": {
                    "typeIdentifier": "t_uint256",
                    "typeString": "uint256"
                  },
                  "typeName": {
                    "id": 6997,
                    "name": "uint256",
                    "nodeType": "ElementaryTypeName",
                    "src": "625:7:14",
                    "typeDescriptions": {
                      "typeIdentifier": "t_uint256",
                      "typeString": "uint256"
                    }
                  },
                  "visibility": "internal"
                },
                {
                  "constant": false,
                  "id": 7000,
                  "mutability": "mutable",
                  "name": "answeredInRound",
                  "nodeType": "VariableDeclaration",
                  "scope": 7002,
                  "src": "650:22:14",
                  "stateVariable": false,
                  "storageLocation": "default",
                  "typeDescriptions": {
                    "typeIdentifier": "t_uint80",
                    "typeString": "uint80"
                  },
                  "typeName": {
                    "id": 6999,
                    "name": "uint80",
                    "nodeType": "ElementaryTypeName",
                    "src": "650:6:14",
                    "typeDescriptions": {
                      "typeIdentifier": "t_uint80",
                      "typeString": "uint80"
                    }
                  },
                  "visibility": "internal"
                }
              ],
              "src": "549:129:14"
            },
            "scope": 7016,
            "src": "476:203:14",
            "stateMutability": "view",
            "virtual": false,
            "visibility": "external"
          },
          {
            "functionSelector": "feaf968c",
            "id": 7015,
            "implemented": false,
            "kind": "function",
            "modifiers": [],
            "name": "latestRoundData",
            "nodeType": "FunctionDefinition",
            "parameters": {
              "id": 7003,
              "nodeType": "ParameterList",
              "parameters": [],
              "src": "706:2:14"
            },
            "returnParameters": {
              "id": 7014,
              "nodeType": "ParameterList",
              "parameters": [
                {
                  "constant": false,
                  "id": 7005,
                  "mutability": "mutable",
                  "name": "roundId",
                  "nodeType": "VariableDeclaration",
                  "scope": 7015,
                  "src": "751:14:14",
                  "stateVariable": false,
                  "storageLocation": "default",
                  "typeDescriptions": {
                    "typeIdentifier": "t_uint80",
                    "typeString": "uint80"
                  },
                  "typeName": {
                    "id": 7004,
                    "name": "uint80",
                    "nodeType": "ElementaryTypeName",
                    "src": "751:6:14",
                    "typeDescriptions": {
                      "typeIdentifier": "t_uint80",
                      "typeString": "uint80"
                    }
                  },
                  "visibility": "internal"
                },
                {
                  "constant": false,
                  "id": 7007,
                  "mutability": "mutable",
                  "name": "answer",
                  "nodeType": "VariableDeclaration",
                  "scope": 7015,
                  "src": "773:13:14",
                  "stateVariable": false,
                  "storageLocation": "default",
                  "typeDescriptions": {
                    "typeIdentifier": "t_int256",
                    "typeString": "int256"
                  },
                  "typeName": {
                    "id": 7006,
                    "name": "int256",
                    "nodeType": "ElementaryTypeName",
                    "src": "773:6:14",
                    "typeDescriptions": {
                      "typeIdentifier": "t_int256",
                      "typeString": "int256"
                    }
                  },
                  "visibility": "internal"
                },
                {
                  "constant": false,
                  "id": 7009,
                  "mutability": "mutable",
                  "name": "startedAt",
                  "nodeType": "VariableDeclaration",
                  "scope": 7015,
                  "src": "794:17:14",
                  "stateVariable": false,
                  "storageLocation": "default",
                  "typeDescriptions": {
                    "typeIdentifier": "t_uint256",
                    "typeString": "uint256"
                  },
                  "typeName": {
                    "id": 7008,
                    "name": "uint256",
                    "nodeType": "ElementaryTypeName",
                    "src": "794:7:14",
                    "typeDescriptions": {
                      "typeIdentifier": "t_uint256",
                      "typeString": "uint256"
                    }
                  },
                  "visibility": "internal"
                },
                {
                  "constant": false,
                  "id": 7011,
                  "mutability": "mutable",
                  "name": "updatedAt",
                  "nodeType": "VariableDeclaration",
                  "scope": 7015,
                  "src": "819:17:14",
                  "stateVariable": false,
                  "storageLocation": "default",
                  "typeDescriptions": {
                    "typeIdentifier": "t_uint256",
                    "typeString": "uint256"
                  },
                  "typeName": {
                    "id": 7010,
                    "name": "uint256",
                    "nodeType": "ElementaryTypeName",
                    "src": "819:7:14",
                    "typeDescriptions": {
                      "typeIdentifier": "t_uint256",
                      "typeString": "uint256"
                    }
                  },
                  "visibility": "internal"
                },
                {
                  "constant": false,
                  "id": 7013,
                  "mutability": "mutable",
                  "name": "answeredInRound",
                  "nodeType": "VariableDeclaration",
                  "scope": 7015,
                  "src": "844:22:14",
                  "stateVariable": false,
                  "storageLocation": "default",
                  "typeDescriptions": {
                    "typeIdentifier": "t_uint80",
                    "typeString": "uint80"
                  },
                  "typeName": {
                    "id": 7012,
                    "name": "uint80",
                    "nodeType": "ElementaryTypeName",
                    "src": "844:6:14",
                    "typeDescriptions": {
                      "typeIdentifier": "t_uint80",
                      "typeString": "uint80"
                    }
                  },
                  "visibility": "internal"
                }
              ],
              "src": "743:129:14"
            },
            "scope": 7016,
            "src": "682:191:14",
            "stateMutability": "view",
            "virtual": false,
            "visibility": "external"
          }
        ],
        "scope": 7017,
        "src": "56:820:14"
      }
    ],
    "src": "32:844:14"
  },
  "legacyAST": {
    "absolutePath": "/home/metapriest/code/my_code/dotvote/contracts/contracts/interfaces/AggregatorV3Interface.sol",
    "exportedSymbols": {
      "AggregatorV3Interface": [
        7016
      ]
    },
    "id": 7017,
    "license": "MIT",
    "nodeType": "SourceUnit",
    "nodes": [
      {
        "id": 6972,
        "literals": [
          "solidity",
          "0.7",
          ".4"
        ],
        "nodeType": "PragmaDirective",
        "src": "32:22:14"
      },
      {
        "abstract": false,
        "baseContracts": [],
        "contractDependencies": [],
        "contractKind": "interface",
        "fullyImplemented": false,
        "id": 7016,
        "linearizedBaseContracts": [
          7016
        ],
        "name": "AggregatorV3Interface",
        "nodeType": "ContractDefinition",
        "nodes": [
          {
            "functionSelector": "313ce567",
            "id": 6977,
            "implemented": false,
            "kind": "function",
            "modifiers": [],
            "name": "decimals",
            "nodeType": "FunctionDefinition",
            "parameters": {
              "id": 6973,
              "nodeType": "ParameterList",
              "parameters": [],
              "src": "110:2:14"
            },
            "returnParameters": {
              "id": 6976,
              "nodeType": "ParameterList",
              "parameters": [
                {
                  "constant": false,
                  "id": 6975,
                  "mutability": "mutable",
                  "name": "",
                  "nodeType": "VariableDeclaration",
                  "scope": 6977,
                  "src": "136:5:14",
                  "stateVariable": false,
                  "storageLocation": "default",
                  "typeDescriptions": {
                    "typeIdentifier": "t_uint8",
                    "typeString": "uint8"
                  },
                  "typeName": {
                    "id": 6974,
                    "name": "uint8",
                    "nodeType": "ElementaryTypeName",
                    "src": "136:5:14",
                    "typeDescriptions": {
                      "typeIdentifier": "t_uint8",
                      "typeString": "uint8"
                    }
                  },
                  "visibility": "internal"
                }
              ],
              "src": "135:7:14"
            },
            "scope": 7016,
            "src": "93:50:14",
            "stateMutability": "view",
            "virtual": false,
            "visibility": "external"
          },
          {
            "functionSelector": "7284e416",
            "id": 6982,
            "implemented": false,
            "kind": "function",
            "modifiers": [],
            "name": "description",
            "nodeType": "FunctionDefinition",
            "parameters": {
              "id": 6978,
              "nodeType": "ParameterList",
              "parameters": [],
              "src": "166:2:14"
            },
            "returnParameters": {
              "id": 6981,
              "nodeType": "ParameterList",
              "parameters": [
                {
                  "constant": false,
                  "id": 6980,
                  "mutability": "mutable",
                  "name": "",
                  "nodeType": "VariableDeclaration",
                  "scope": 6982,
                  "src": "192:13:14",
                  "stateVariable": false,
                  "storageLocation": "memory",
                  "typeDescriptions": {
                    "typeIdentifier": "t_string_memory_ptr",
                    "typeString": "string"
                  },
                  "typeName": {
                    "id": 6979,
                    "name": "string",
                    "nodeType": "ElementaryTypeName",
                    "src": "192:6:14",
                    "typeDescriptions": {
                      "typeIdentifier": "t_string_storage_ptr",
                      "typeString": "string"
                    }
                  },
                  "visibility": "internal"
                }
              ],
              "src": "191:15:14"
            },
            "scope": 7016,
            "src": "146:61:14",
            "stateMutability": "view",
            "virtual": false,
            "visibility": "external"
          },
          {
            "functionSelector": "54fd4d50",
            "id": 6987,
            "implemented": false,
            "kind": "function",
            "modifiers": [],
            "name": "version",
            "nodeType": "FunctionDefinition",
            "parameters": {
              "id": 6983,
              "nodeType": "ParameterList",
              "parameters": [],
              "src": "226:2:14"
            },
            "returnParameters": {
              "id": 6986,
              "nodeType": "ParameterList",
              "parameters": [
                {
                  "constant": false,
                  "id": 6985,
                  "mutability": "mutable",
                  "name": "",
                  "nodeType": "VariableDeclaration",
                  "scope": 6987,
                  "src": "252:7:14",
                  "stateVariable": false,
                  "storageLocation": "default",
                  "typeDescriptions": {
                    "typeIdentifier": "t_uint256",
                    "typeString": "uint256"
                  },
                  "typeName": {
                    "id": 6984,
                    "name": "uint256",
                    "nodeType": "ElementaryTypeName",
                    "src": "252:7:14",
                    "typeDescriptions": {
                      "typeIdentifier": "t_uint256",
                      "typeString": "uint256"
                    }
                  },
                  "visibility": "internal"
                }
              ],
              "src": "251:9:14"
            },
            "scope": 7016,
            "src": "210:51:14",
            "stateMutability": "view",
            "virtual": false,
            "visibility": "external"
          },
          {
            "functionSelector": "9a6fc8f5",
            "id": 7002,
            "implemented": false,
            "kind": "function",
            "modifiers": [],
            "name": "getRoundData",
            "nodeType": "FunctionDefinition",
            "parameters": {
              "id": 6990,
              "nodeType": "ParameterList",
              "parameters": [
                {
                  "constant": false,
                  "id": 6989,
                  "mutability": "mutable",
                  "name": "_roundId",
                  "nodeType": "VariableDeclaration",
                  "scope": 7002,
                  "src": "498:15:14",
                  "stateVariable": false,
                  "storageLocation": "default",
                  "typeDescriptions": {
                    "typeIdentifier": "t_uint80",
                    "typeString": "uint80"
                  },
                  "typeName": {
                    "id": 6988,
                    "name": "uint80",
                    "nodeType": "ElementaryTypeName",
                    "src": "498:6:14",
                    "typeDescriptions": {
                      "typeIdentifier": "t_uint80",
                      "typeString": "uint80"
                    }
                  },
                  "visibility": "internal"
                }
              ],
              "src": "497:17:14"
            },
            "returnParameters": {
              "id": 7001,
              "nodeType": "ParameterList",
              "parameters": [
                {
                  "constant": false,
                  "id": 6992,
                  "mutability": "mutable",
                  "name": "roundId",
                  "nodeType": "VariableDeclaration",
                  "scope": 7002,
                  "src": "557:14:14",
                  "stateVariable": false,
                  "storageLocation": "default",
                  "typeDescriptions": {
                    "typeIdentifier": "t_uint80",
                    "typeString": "uint80"
                  },
                  "typeName": {
                    "id": 6991,
                    "name": "uint80",
                    "nodeType": "ElementaryTypeName",
                    "src": "557:6:14",
                    "typeDescriptions": {
                      "typeIdentifier": "t_uint80",
                      "typeString": "uint80"
                    }
                  },
                  "visibility": "internal"
                },
                {
                  "constant": false,
                  "id": 6994,
                  "mutability": "mutable",
                  "name": "answer",
                  "nodeType": "VariableDeclaration",
                  "scope": 7002,
                  "src": "579:13:14",
                  "stateVariable": false,
                  "storageLocation": "default",
                  "typeDescriptions": {
                    "typeIdentifier": "t_int256",
                    "typeString": "int256"
                  },
                  "typeName": {
                    "id": 6993,
                    "name": "int256",
                    "nodeType": "ElementaryTypeName",
                    "src": "579:6:14",
                    "typeDescriptions": {
                      "typeIdentifier": "t_int256",
                      "typeString": "int256"
                    }
                  },
                  "visibility": "internal"
                },
                {
                  "constant": false,
                  "id": 6996,
                  "mutability": "mutable",
                  "name": "startedAt",
                  "nodeType": "VariableDeclaration",
                  "scope": 7002,
                  "src": "600:17:14",
                  "stateVariable": false,
                  "storageLocation": "default",
                  "typeDescriptions": {
                    "typeIdentifier": "t_uint256",
                    "typeString": "uint256"
                  },
                  "typeName": {
                    "id": 6995,
                    "name": "uint256",
                    "nodeType": "ElementaryTypeName",
                    "src": "600:7:14",
                    "typeDescriptions": {
                      "typeIdentifier": "t_uint256",
                      "typeString": "uint256"
                    }
                  },
                  "visibility": "internal"
                },
                {
                  "constant": false,
                  "id": 6998,
                  "mutability": "mutable",
                  "name": "updatedAt",
                  "nodeType": "VariableDeclaration",
                  "scope": 7002,
                  "src": "625:17:14",
                  "stateVariable": false,
                  "storageLocation": "default",
                  "typeDescriptions": {
                    "typeIdentifier": "t_uint256",
                    "typeString": "uint256"
                  },
                  "typeName": {
                    "id": 6997,
                    "name": "uint256",
                    "nodeType": "ElementaryTypeName",
                    "src": "625:7:14",
                    "typeDescriptions": {
                      "typeIdentifier": "t_uint256",
                      "typeString": "uint256"
                    }
                  },
                  "visibility": "internal"
                },
                {
                  "constant": false,
                  "id": 7000,
                  "mutability": "mutable",
                  "name": "answeredInRound",
                  "nodeType": "VariableDeclaration",
                  "scope": 7002,
                  "src": "650:22:14",
                  "stateVariable": false,
                  "storageLocation": "default",
                  "typeDescriptions": {
                    "typeIdentifier": "t_uint80",
                    "typeString": "uint80"
                  },
                  "typeName": {
                    "id": 6999,
                    "name": "uint80",
                    "nodeType": "ElementaryTypeName",
                    "src": "650:6:14",
                    "typeDescriptions": {
                      "typeIdentifier": "t_uint80",
                      "typeString": "uint80"
                    }
                  },
                  "visibility": "internal"
                }
              ],
              "src": "549:129:14"
            },
            "scope": 7016,
            "src": "476:203:14",
            "stateMutability": "view",
            "virtual": false,
            "visibility": "external"
          },
          {
            "functionSelector": "feaf968c",
            "id": 7015,
            "implemented": false,
            "kind": "function",
            "modifiers": [],
            "name": "latestRoundData",
            "nodeType": "FunctionDefinition",
            "parameters": {
              "id": 7003,
              "nodeType": "ParameterList",
              "parameters": [],
              "src": "706:2:14"
            },
            "returnParameters": {
              "id": 7014,
              "nodeType": "ParameterList",
              "parameters": [
                {
                  "constant": false,
                  "id": 7005,
                  "mutability": "mutable",
                  "name": "roundId",
                  "nodeType": "VariableDeclaration",
                  "scope": 7015,
                  "src": "751:14:14",
                  "stateVariable": false,
                  "storageLocation": "default",
                  "typeDescriptions": {
                    "typeIdentifier": "t_uint80",
                    "typeString": "uint80"
                  },
                  "typeName": {
                    "id": 7004,
                    "name": "uint80",
                    "nodeType": "ElementaryTypeName",
                    "src": "751:6:14",
                    "typeDescriptions": {
                      "typeIdentifier": "t_uint80",
                      "typeString": "uint80"
                    }
                  },
                  "visibility": "internal"
                },
                {
                  "constant": false,
                  "id": 7007,
                  "mutability": "mutable",
                  "name": "answer",
                  "nodeType": "VariableDeclaration",
                  "scope": 7015,
                  "src": "773:13:14",
                  "stateVariable": false,
                  "storageLocation": "default",
                  "typeDescriptions": {
                    "typeIdentifier": "t_int256",
                    "typeString": "int256"
                  },
                  "typeName": {
                    "id": 7006,
                    "name": "int256",
                    "nodeType": "ElementaryTypeName",
                    "src": "773:6:14",
                    "typeDescriptions": {
                      "typeIdentifier": "t_int256",
                      "typeString": "int256"
                    }
                  },
                  "visibility": "internal"
                },
                {
                  "constant": false,
                  "id": 7009,
                  "mutability": "mutable",
                  "name": "startedAt",
                  "nodeType": "VariableDeclaration",
                  "scope": 7015,
                  "src": "794:17:14",
                  "stateVariable": false,
                  "storageLocation": "default",
                  "typeDescriptions": {
                    "typeIdentifier": "t_uint256",
                    "typeString": "uint256"
                  },
                  "typeName": {
                    "id": 7008,
                    "name": "uint256",
                    "nodeType": "ElementaryTypeName",
                    "src": "794:7:14",
                    "typeDescriptions": {
                      "typeIdentifier": "t_uint256",
                      "typeString": "uint256"
                    }
                  },
                  "visibility": "internal"
                },
                {
                  "constant": false,
                  "id": 7011,
                  "mutability": "mutable",
                  "name": "updatedAt",
                  "nodeType": "VariableDeclaration",
                  "scope": 7015,
                  "src": "819:17:14",
                  "stateVariable": false,
                  "storageLocation": "default",
                  "typeDescriptions": {
                    "typeIdentifier": "t_uint256",
                    "typeString": "uint256"
                  },
                  "typeName": {
                    "id": 7010,
                    "name": "uint256",
                    "nodeType": "ElementaryTypeName",
                    "src": "819:7:14",
                    "typeDescriptions": {
                      "typeIdentifier": "t_uint256",
                      "typeString": "uint256"
                    }
                  },
                  "visibility": "internal"
                },
                {
                  "constant": false,
                  "id": 7013,
                  "mutability": "mutable",
                  "name": "answeredInRound",
                  "nodeType": "VariableDeclaration",
                  "scope": 7015,
                  "src": "844:22:14",
                  "stateVariable": false,
                  "storageLocation": "default",
                  "typeDescriptions": {
                    "typeIdentifier": "t_uint80",
                    "typeString": "uint80"
                  },
                  "typeName": {
                    "id": 7012,
                    "name": "uint80",
                    "nodeType": "ElementaryTypeName",
                    "src": "844:6:14",
                    "typeDescriptions": {
                      "typeIdentifier": "t_uint80",
                      "typeString": "uint80"
                    }
                  },
                  "visibility": "internal"
                }
              ],
              "src": "743:129:14"
            },
            "scope": 7016,
            "src": "682:191:14",
            "stateMutability": "view",
            "virtual": false,
            "visibility": "external"
          }
        ],
        "scope": 7017,
        "src": "56:820:14"
      }
    ],
    "src": "32:844:14"
  },
  "compiler": {
    "name": "solc",
    "version": "0.7.4+commit.3f05b770.Emscripten.clang"
  },
  "networks": {},
  "schemaVersion": "3.3.1",
  "updatedAt": "2021-01-11T05:51:30.303Z",
  "devdoc": {
    "kind": "dev",
    "methods": {},
    "version": 1
  },
  "userdoc": {
    "kind": "user",
    "methods": {},
    "version": 1
  }
}