<svg width="40" height="40" viewBox="0 0 40 40" fill="none" xmlns="http://www.w3.org/2000/svg">
<rect x="17" width="6" height="40" fill="white"/>
<rect y="23" width="6" height="40" transform="rotate(-90 0 23)" fill="white"/>
</svg>
