<svg width="66" height="65" viewBox="0 0 66 65" fill="none" xmlns="http://www.w3.org/2000/svg">
<rect width="12" height="12" fill="#2244F7"/>
<rect y="53" width="12" height="12" fill="#00E0CC"/>
<rect x="18" width="12" height="12" fill="#2244F7"/>
<rect x="36" width="12" height="12" fill="#2244F7"/>
<rect x="54" width="12" height="12" fill="#2244F7"/>
<rect y="18" width="12" height="12" fill="#3083FF"/>
<rect x="18" y="18" width="12" height="12" fill="#3083FF"/>
<rect x="36" y="18" width="12" height="12" fill="#3083FF"/>
<rect y="36" width="12" height="12" fill="#00B1FF"/>
<rect x="18" y="36" width="12" height="12" fill="#00B1FF"/>
</svg>
