%YAML 1.1
%TAG !u! tag:unity3d.com,2011:
--- !u!114 &11400000
MonoBehaviour:
  m_ObjectHideFlags: 0
  m_CorrespondingSourceObject: {fileID: 0}
  m_PrefabInstance: {fileID: 0}
  m_PrefabAsset: {fileID: 0}
  m_GameObject: {fileID: 0}
  m_Enabled: 1
  m_EditorHideFlags: 0
  m_Script: {fileID: 11500000, guid: 17f1c2bc0b1a76b47845b574b7624dcb, type: 3}
  m_Name: Four_Hearts
  m_EditorClassIdentifier: 
  value: 4
  seed: Hearts
  sprite: {fileID: -4445314725687963750, guid: 1c86c3f752b92004f9094f13e957fe4e, type: 3}
