{
  "environments": [
    {
      "BOOST_ROOT": "C:/local/boost_1_68_0",
      "LUA_DIR": "${workspaceRoot}/libs/lua/lua-5.3.4_Win64_vc15_lib/",
      "VULKAN_SDK": "C:/VulkanSDK/1.1.92.1/"
    }
  ],
  "configurations": [
    {
      "buildCommandArgs": "-v",
      "buildRoot": "${workspaceRoot}\\..\\build_${name}",
      "cmakeCommandArgs": "",
      "configurationType": "Debug",
      "ctestCommandArgs": "",
      "generator": "Ninja",
      "inheritEnvironments": [
        "msvc_x64_x64"
      ],
      "installRoot": "${env.USERPROFILE}\\CMakeBuilds\\${workspaceHash}\\install\\${name}",
      "name": "x64-Debug"
    },
    {
      "buildCommandArgs": "-v",
      "buildRoot": "${workspaceRoot}\\..\\build_${name}",
      "cmakeCommandArgs": "",
      "configurationType": "Release",
      "ctestCommandArgs": "",
      "generator": "Ninja",
      "inheritEnvironments": [
        "msvc_x64_x64"
      ],
      "installRoot": "${env.USERPROFILE}\\CMakeBuilds\\${workspaceHash}\\install\\${name}",
      "name": "x64-Release"
    }
  ]
}