33557552,33557552,33557552,33557552,33557552,33557552,33557552
2438205107,2438208178,2438197494,2438228139,2438235630,2438197549,2438175709
359.999176025391,15.0075168609619,180.001434326172,229.997512817383,0.00018310546875,54.9964714050293,90.0008010864258
0,-0.000303835869999602,0,0,0,0.000607218302320689,0
-0.0874204114079475,15.8308000564575,0.199390828609467,-7.45736885070801,0.365005820989609,-2.95008563995361,0.107405349612236
0.137199640274048,-1.38583588600159,-0.249755859375,0.451459497213364,-0.0180151965469122,0.378662109375,-0.0887145474553108
23.4080448150635,23.3229236602783,23.35129737854,23.2803630828857,23.1526851654053,23.1952438354492,23.1668701171875
39.806568145752,40.9578628540039,38.7882080078125,40.0031509399414,41.5194091796875,44.166820526123,44.9209213256836
48.1960792541504,49.2000007629395,46.8421058654785,48.461540222168,47.8486061096191,49.2885360717773,52.539680480957
0,0,0,0,0,0,0
0,0,0,0,0,0,0
0,0,0,0,0,0,0
0,0,0,0,0,0,0
